<?xml version="1.0" encoding="UTF-8"?>
<svg xmlns="http://www.w3.org/2000/svg" width="113.75" height="20" viewBox="0 0 113.75 20">
    <rect fill="#2976B7" width="52.6875" height="20" x="0" y="0" />
    <rect fill="#174168" width="61.0625" height="20" x="52.6875" y="0" />
    <g transform="translate(5, 14.3125)"><path transform="translate(0.000000,0)" d=" M 3.640625,-8.703125  C 1.906250,-8.703125 0.718750,-7.781250 0.718750,-6.218750  C 0.718750,-4.734375 1.937500,-4.109375 3.453125,-3.703125  C 4.875000,-3.312500 5.453125,-2.875000 5.453125,-2.062500  C 5.453125,-1.250000 4.718750,-0.828125 3.812500,-0.828125  C 2.828125,-0.828125 2.046875,-1.265625 1.828125,-2.500000  L 0.390625,-2.500000  C 0.640625,-0.578125 1.968750,0.218750 3.718750,0.218750  C 5.500000,0.218750 6.859375,-0.578125 6.859375,-2.171875  C 6.859375,-3.609375 5.937500,-4.390625 3.984375,-4.890625  C 2.828125,-5.203125 2.125000,-5.531250 2.125000,-6.390625  C 2.125000,-7.125000 2.578125,-7.640625 3.531250,-7.640625  C 4.531250,-7.640625 5.140625,-7.062500 5.328125,-6.062500  L 6.765625,-6.062500  C 6.593750,-7.609375 5.546875,-8.703125 3.640625,-8.703125 " fill="white" /><path transform="translate(7.343750,0)" d=" M 2.828125,-7.359375  L 4.421875,-7.359375  L 4.421875,-8.421875  L 2.828125,-8.421875  L 2.828125,-10.390625  L 1.453125,-10.390625  L 1.453125,-8.421875  L 0.312500,-8.421875  L 0.312500,-7.359375  L 1.453125,-7.359375  L 1.453125,-2.421875  C 1.453125,-1.937500 1.453125,-1.578125 1.468750,-1.359375  C 1.546875,-0.296875 2.093750,0.125000 3.156250,0.125000  C 3.531250,0.125000 3.921875,0.109375 4.312500,0.046875  L 4.312500,-0.953125  C 3.250000,-0.828125 2.906250,-1.015625 2.843750,-1.828125  C 2.828125,-2.046875 2.828125,-2.187500 2.828125,-2.484375  L 2.828125,-7.359375 " fill="white" /><path transform="translate(12.359375,0)" d=" M 6.046875,0.000000  L 7.421875,0.000000  C 7.296875,-0.937500 7.265625,-1.515625 7.265625,-2.156250  L 7.265625,-5.343750  C 7.265625,-5.718750 7.250000,-6.125000 7.218750,-6.468750  C 7.078125,-7.859375 6.218750,-8.703125 4.203125,-8.703125  C 2.343750,-8.703125 1.078125,-7.656250 0.937500,-5.859375  L 2.390625,-5.859375  C 2.484375,-7.031250 3.062500,-7.640625 4.203125,-7.640625  C 5.343750,-7.640625 5.796875,-7.140625 5.859375,-6.359375  C 5.890625,-6.031250 5.890625,-5.703125 5.890625,-5.328125  L 5.890625,-5.109375  L 5.343750,-5.109375  C 2.015625,-5.109375 0.578125,-4.109375 0.578125,-2.187500  C 0.578125,-0.625000 1.781250,0.218750 3.312500,0.218750  C 4.125000,0.218750 4.859375,0.093750 5.437500,-0.296875  L 5.906250,-1.218750  L 6.046875,0.000000  M 3.781250,-0.828125  C 2.734375,-0.828125 2.078125,-1.281250 2.078125,-2.296875  C 2.078125,-3.765625 3.546875,-4.250000 5.890625,-4.078125  L 5.890625,-3.218750  C 5.890625,-1.687500 5.062500,-0.828125 3.781250,-0.828125 " fill="white" /><path transform="translate(20.859375,0)" d=" M 2.828125,-7.359375  L 4.421875,-7.359375  L 4.421875,-8.421875  L 2.828125,-8.421875  L 2.828125,-10.390625  L 1.453125,-10.390625  L 1.453125,-8.421875  L 0.312500,-8.421875  L 0.312500,-7.359375  L 1.453125,-7.359375  L 1.453125,-2.421875  C 1.453125,-1.937500 1.453125,-1.578125 1.468750,-1.359375  C 1.546875,-0.296875 2.093750,0.125000 3.156250,0.125000  C 3.531250,0.125000 3.921875,0.109375 4.312500,0.046875  L 4.312500,-0.953125  C 3.250000,-0.828125 2.906250,-1.015625 2.843750,-1.828125  C 2.828125,-2.046875 2.828125,-2.187500 2.828125,-2.484375  L 2.828125,-7.359375 " fill="white" /><path transform="translate(25.875000,0)" d=" M 8.218750,-8.484375  L 6.843750,-8.484375  L 6.843750,-4.750000  C 6.843750,-1.859375 5.796875,-0.859375 4.468750,-0.859375  C 3.312500,-0.859375 2.625000,-1.515625 2.500000,-2.484375  C 2.453125,-2.906250 2.437500,-3.375000 2.437500,-3.640625  L 2.437500,-8.484375  L 1.062500,-8.484375  L 1.062500,-3.390625  C 1.062500,-2.703125 1.078125,-2.375000 1.140625,-1.937500  C 1.328125,-0.765625 2.359375,0.218750 4.109375,0.218750  C 4.968750,0.218750 5.593750,0.078125 6.312500,-0.453125  L 6.843750,-1.437500  L 6.843750,0.000000  L 8.218750,0.000000  L 8.218750,-8.484375 " fill="white" /><path transform="translate(35.343750,0)" d=" M 3.640625,-8.703125  C 1.906250,-8.703125 0.718750,-7.781250 0.718750,-6.218750  C 0.718750,-4.734375 1.937500,-4.109375 3.453125,-3.703125  C 4.875000,-3.312500 5.453125,-2.875000 5.453125,-2.062500  C 5.453125,-1.250000 4.718750,-0.828125 3.812500,-0.828125  C 2.828125,-0.828125 2.046875,-1.265625 1.828125,-2.500000  L 0.390625,-2.500000  C 0.640625,-0.578125 1.968750,0.218750 3.718750,0.218750  C 5.500000,0.218750 6.859375,-0.578125 6.859375,-2.171875  C 6.859375,-3.609375 5.937500,-4.390625 3.984375,-4.890625  C 2.828125,-5.203125 2.125000,-5.531250 2.125000,-6.390625  C 2.125000,-7.125000 2.578125,-7.640625 3.531250,-7.640625  C 4.531250,-7.640625 5.140625,-7.062500 5.328125,-6.062500  L 6.765625,-6.062500  C 6.593750,-7.609375 5.546875,-8.703125 3.640625,-8.703125 " fill="white" /></g>
    <g transform="translate(57.6875, 14.3125)"><path transform="translate(0.000000,0)" d=" M 7.484375,-2.859375  L 8.421875,0.000000  L 11.546875,0.000000  L 7.562500,-11.046875  L 4.046875,-11.046875  L 0.062500,0.000000  L 3.125000,0.000000  L 4.046875,-2.859375  L 7.484375,-2.859375  M 5.781250,-8.500000  L 6.796875,-5.109375  L 4.750000,-5.109375  L 5.781250,-8.500000 " fill="white" /><path transform="translate(11.312500,0)" d=" M 4.875000,-8.765625  C 2.375000,-8.765625 0.390625,-7.125000 0.390625,-4.171875  C 0.390625,-1.359375 2.234375,0.218750 4.687500,0.218750  C 7.015625,0.218750 8.718750,-0.921875 9.046875,-3.140625  L 6.203125,-3.140625  C 6.046875,-2.203125 5.500000,-1.734375 4.843750,-1.734375  C 3.875000,-1.734375 3.328125,-2.531250 3.328125,-4.359375  C 3.328125,-6.000000 3.859375,-6.812500 4.812500,-6.812500  C 5.531250,-6.812500 6.093750,-6.406250 6.218750,-5.281250  L 9.015625,-5.281250  C 8.921875,-7.203125 7.390625,-8.765625 4.875000,-8.765625 " fill="white" /><path transform="translate(20.703125,0)" d=" M 4.312500,-6.687500  L 6.203125,-6.687500  L 6.203125,-8.484375  L 4.312500,-8.484375  L 4.312500,-10.687500  L 1.437500,-10.687500  L 1.437500,-8.484375  L 0.078125,-8.484375  L 0.078125,-6.687500  L 1.437500,-6.687500  L 1.437500,-3.125000  C 1.437500,-2.640625 1.437500,-2.234375 1.468750,-1.750000  C 1.562500,-0.437500 2.203125,0.218750 4.343750,0.218750  C 4.937500,0.218750 5.468750,0.171875 6.031250,0.078125  L 6.031250,-1.718750  C 4.671875,-1.640625 4.406250,-1.843750 4.343750,-2.703125  C 4.312500,-2.921875 4.312500,-3.250000 4.312500,-3.531250  L 4.312500,-6.687500 " fill="white" /><path transform="translate(27.109375,0)" d=" M 2.296875,-12.015625  C 1.406250,-12.015625 0.812500,-11.468750 0.812500,-10.609375  C 0.812500,-9.750000 1.406250,-9.203125 2.296875,-9.203125  C 3.203125,-9.203125 3.796875,-9.750000 3.796875,-10.609375  C 3.796875,-11.468750 3.203125,-12.015625 2.296875,-12.015625  M 3.750000,0.000000  L 3.750000,-8.546875  L 0.859375,-8.546875  L 0.859375,0.000000  L 3.750000,0.000000 " fill="white" /><path transform="translate(31.718750,0)" d=" M 9.859375,-8.546875  L 6.703125,-8.546875  L 4.953125,-2.281250  L 3.203125,-8.546875  L 0.000000,-8.546875  L 3.375000,0.000000  L 6.484375,0.000000  L 9.859375,-8.546875 " fill="white" /><path transform="translate(41.453125,0)" d=" M 9.234375,-4.390625  C 9.234375,-6.593750 7.796875,-8.765625 4.937500,-8.765625  C 2.093750,-8.765625 0.390625,-6.734375 0.390625,-4.234375  C 0.390625,-1.234375 2.343750,0.218750 4.781250,0.218750  C 6.968750,0.218750 8.578125,-0.859375 9.078125,-2.796875  L 6.234375,-2.796875  C 6.125000,-2.140625 5.625000,-1.734375 4.812500,-1.734375  C 4.000000,-1.734375 3.375000,-2.125000 3.234375,-3.546875  L 9.187500,-3.546875  C 9.218750,-3.843750 9.234375,-4.125000 9.234375,-4.390625  M 4.796875,-6.812500  C 5.562500,-6.812500 6.062500,-6.312500 6.218750,-5.312500  L 3.328125,-5.312500  C 3.515625,-6.375000 4.046875,-6.812500 4.796875,-6.812500 " fill="white" /></g>
</svg>