\BOOKMARK [3][]{Outline0.0.1.2}{\376\377\000F\000i\000g\000u\000r\000e}{}% 1
\BOOKMARK [2][]{Outline0.1}{\376\377\000E\000s\000t\000a\000b\000l\000i\000s\000h\000m\000e\000n\000t}{}% 2
\BOOKMARK [3][]{Outline0.1.1.3}{\376\377\000B\000a\000c\000k\000g\000r\000o\000u\000n\000d}{Outline0.1}% 3
\BOOKMARK [2][]{Outline0.2}{\376\377\000E\000n\000l\000i\000g\000h\000t\000e\000n\000e\000d\000\040\000D\000e\000s\000p\000o\000t\000i\000s\000m}{}% 4
\BOOKMARK [3][]{Outline0.2.1.8}{\376\377\000P\000r\000o\000b\000l\000e\000m\000s}{Outline0.2}% 5
\BOOKMARK [3][]{Outline0.2.2.12}{\376\377\000B\000o\000u\000r\000b\000o\000n\000\040\000R\000e\000f\000o\000r\000m\000s}{Outline0.2}% 6
\BOOKMARK [2][]{Outline0.3}{\376\377\000W\000a\000r}{}% 7
\BOOKMARK [3][]{Outline0.3.1.17}{\376\377\000E\000a\000r\000l\000y\000\040\000W\000a\000r}{Outline0.3}% 8
\BOOKMARK [3][]{Outline0.3.2.23}{\376\377\000V\000a\000l\000e\000s}{Outline0.3}% 9
\BOOKMARK [3][]{Outline0.3.3.29}{\376\377\000G\000o\000o\000d\000\040\000F\000e\000e\000l\000i\000n\000g\000s}{Outline0.3}% 10
\BOOKMARK [3][]{Outline0.3.4.33}{\376\377\000S\000u\000c\000c\000e\000s\000s\000i\000o\000n}{Outline0.3}% 11
\BOOKMARK [3][]{Outline0.3.5.39}{\376\377\000F\000r\000e\000n\000c\000h\000\040\000R\000e\000v\000o\000l\000u\000t\000i\000o\000n}{Outline0.3}% 12
\BOOKMARK [3][]{Outline0.3.6.43}{\376\377\000W\000a\000r\000\040\000a\000g\000a\000i\000n\000s\000t\000\040\000F\000r\000a\000n\000c\000e}{Outline0.3}% 13
\BOOKMARK [3][]{Outline0.3.7.50}{\376\377\000W\000a\000r\000\040\000a\000g\000a\000i\000n\000s\000t\000\040\000B\000r\000i\000t\000a\000i\000n}{Outline0.3}% 14
\BOOKMARK [3][]{Outline0.3.8.62}{\376\377\000R\000e\000v\000o\000l\000u\000t\000i\000o\000n}{Outline0.3}% 15
\BOOKMARK [3][]{Outline0.3.9.66}{\376\377\000N\000a\000p\000o\000l\000e\000o\000n}{Outline0.3}% 16
\BOOKMARK [3][]{Outline0.3.10.70}{\376\377\000C\000a\000v\000e\000a\000t\000s}{Outline0.3}% 17
\BOOKMARK [3][]{Outline0.3.11.78}{\376\377\000J\000u\000n\000t\000a\000s}{Outline0.3}% 18
\BOOKMARK [3][]{Outline0.3.12.85}{\376\377\000R\000e\000s\000t\000o\000r\000a\000t\000i\000o\000n}{Outline0.3}% 19
\BOOKMARK [2][]{Outline0.4}{\376\377\000R\000e\000f\000e\000r\000e\000n\000c\000i\000n\000g}{}% 20
