\headcommand {\slideentry {0}{0}{1}{1/1}{}{0}}
\headcommand {\beamer@framepages {1}{1}}
\headcommand {\beamer@subsectionpages {1}{1}}
\headcommand {\beamer@subsectionentry {0}{0}{1}{2}{Figure}}
\headcommand {\slideentry {0}{1}{1}{2/2}{Figure}{0}}
\headcommand {\beamer@framepages {2}{2}}
\headcommand {\beamer@sectionpages {1}{2}}
\headcommand {\beamer@subsectionpages {2}{2}}
\headcommand {\sectionentry {1}{Establishment}{3}{Establishment}{0}}
\headcommand {\beamer@subsectionpages {3}{2}}
\headcommand {\beamer@subsectionentry {0}{1}{1}{3}{Background}}
\headcommand {\slideentry {1}{1}{1}{3/6}{Background}{0}}
\headcommand {\beamer@framepages {3}{6}}
\headcommand {\slideentry {1}{1}{2}{7/7}{Background}{0}}
\headcommand {\beamer@framepages {7}{7}}
\headcommand {\beamer@sectionpages {3}{7}}
\headcommand {\beamer@subsectionpages {3}{7}}
\headcommand {\sectionentry {2}{Enlightened Despotism}{8}{Enlightened Despotism}{0}}
\headcommand {\beamer@subsectionpages {8}{7}}
\headcommand {\beamer@subsectionentry {0}{2}{1}{8}{Problems}}
\headcommand {\slideentry {2}{1}{1}{8/11}{Problems}{0}}
\headcommand {\beamer@framepages {8}{11}}
\headcommand {\beamer@subsectionpages {8}{11}}
\headcommand {\beamer@subsectionentry {0}{2}{2}{12}{Bourbon Reforms}}
\headcommand {\slideentry {2}{2}{1}{12/16}{Bourbon Reforms}{0}}
\headcommand {\beamer@framepages {12}{16}}
\headcommand {\beamer@sectionpages {8}{16}}
\headcommand {\beamer@subsectionpages {12}{16}}
\headcommand {\sectionentry {3}{War}{17}{War}{0}}
\headcommand {\beamer@subsectionpages {17}{16}}
\headcommand {\beamer@subsectionentry {0}{3}{1}{17}{Early War}}
\headcommand {\slideentry {3}{1}{1}{17/22}{Early War}{0}}
\headcommand {\beamer@framepages {17}{22}}
\headcommand {\beamer@subsectionpages {17}{22}}
\headcommand {\beamer@subsectionentry {0}{3}{2}{23}{Vales}}
\headcommand {\slideentry {3}{2}{1}{23/27}{Vales}{0}}
\headcommand {\beamer@framepages {23}{27}}
\headcommand {\slideentry {3}{2}{2}{28/28}{Vales}{0}}
\headcommand {\beamer@framepages {28}{28}}
\headcommand {\beamer@subsectionpages {23}{28}}
\headcommand {\beamer@subsectionentry {0}{3}{3}{29}{Good Feelings}}
\headcommand {\slideentry {3}{3}{1}{29/32}{Good Feelings}{0}}
\headcommand {\beamer@framepages {29}{32}}
\headcommand {\beamer@subsectionpages {29}{32}}
\headcommand {\beamer@subsectionentry {0}{3}{4}{33}{Succession}}
\headcommand {\slideentry {3}{4}{1}{33/38}{Succession}{0}}
\headcommand {\beamer@framepages {33}{38}}
\headcommand {\beamer@subsectionpages {33}{38}}
\headcommand {\beamer@subsectionentry {0}{3}{5}{39}{French Revolution}}
\headcommand {\slideentry {3}{5}{1}{39/42}{French Revolution}{0}}
\headcommand {\beamer@framepages {39}{42}}
\headcommand {\beamer@subsectionpages {39}{42}}
\headcommand {\beamer@subsectionentry {0}{3}{6}{43}{War against France}}
\headcommand {\slideentry {3}{6}{1}{43/49}{War against France}{0}}
\headcommand {\beamer@framepages {43}{49}}
\headcommand {\beamer@subsectionpages {43}{49}}
\headcommand {\beamer@subsectionentry {0}{3}{7}{50}{War against Britain}}
\headcommand {\slideentry {3}{7}{1}{50/61}{War against Britain}{0}}
\headcommand {\beamer@framepages {50}{61}}
\headcommand {\beamer@subsectionpages {50}{61}}
\headcommand {\beamer@subsectionentry {0}{3}{8}{62}{Revolution}}
\headcommand {\slideentry {3}{8}{1}{62/65}{Revolution}{0}}
\headcommand {\beamer@framepages {62}{65}}
\headcommand {\beamer@subsectionpages {62}{65}}
\headcommand {\beamer@subsectionentry {0}{3}{9}{66}{Napoleon}}
\headcommand {\slideentry {3}{9}{1}{66/69}{Napoleon}{0}}
\headcommand {\beamer@framepages {66}{69}}
\headcommand {\beamer@subsectionpages {66}{69}}
\headcommand {\beamer@subsectionentry {0}{3}{10}{70}{Caveats}}
\headcommand {\slideentry {3}{10}{1}{70/77}{Caveats}{0}}
\headcommand {\beamer@framepages {70}{77}}
\headcommand {\beamer@subsectionpages {70}{77}}
\headcommand {\beamer@subsectionentry {0}{3}{11}{78}{Juntas}}
\headcommand {\slideentry {3}{11}{1}{78/84}{Juntas}{0}}
\headcommand {\beamer@framepages {78}{84}}
\headcommand {\beamer@subsectionpages {78}{84}}
\headcommand {\beamer@subsectionentry {0}{3}{12}{85}{Restoration}}
\headcommand {\slideentry {3}{12}{1}{85/92}{Restoration}{0}}
\headcommand {\beamer@framepages {85}{92}}
\headcommand {\beamer@sectionpages {17}{92}}
\headcommand {\beamer@subsectionpages {85}{92}}
\headcommand {\sectionentry {4}{Referencing}{93}{Referencing}{0}}
\headcommand {\slideentry {4}{0}{1}{93/93}{}{0}}
\headcommand {\beamer@framepages {93}{93}}
\headcommand {\slideentry {4}{0}{2}{94/94}{}{0}}
\headcommand {\beamer@framepages {94}{94}}
\headcommand {\slideentry {4}{0}{3}{95/95}{}{0}}
\headcommand {\beamer@framepages {95}{95}}
\headcommand {\beamer@partpages {1}{95}}
\headcommand {\beamer@subsectionpages {93}{95}}
\headcommand {\beamer@sectionpages {93}{95}}
\headcommand {\beamer@documentpages {95}}
\headcommand {\gdef \inserttotalframenumber {22}}
