(1)

*RLLLELELLELELENIAIAIALALL ORDER OF THE BOARD.

From the moment in that a solemn swearing did manager *á this Board of the *delizado *cirgo that the Village has  *dignado trust him, has been *ucesante the *desvelo of the individuals that form it, to fill the hopes of his *conciudadanos. Abandoned almost entirely those businesses *á that *tenian linked his subsistence , *contraidos to the service of the public with an assiduity that they have seen  here few *exem» *plos, diligent in providing  all the means that can ensure them the tarpaulin; *vé the Board with *satisfaccion that the tranquility of all the inhabitants accredits the confidence with that *reposan in the *zelo and surveillance of the new Government.

*Podria The Together *reposar equally in the gratitude with that *publicamente receive  his tasks; but the quality *provisoria of his *instalacion *redobla the need to ensure by all the ways the concept had to *á the purity of his intentions. The skill with that a happy evil disguised the providences but *juiciosas; the mistakes that seeds many times the error, and that it takes advantage of  always the malice; the little knowledge of the tasks that consecrate  *á the public happiness , have been in all times the instrument, *qa *limando *sordamente the narrow bonds that tie the Village with his Representatives, produces finally a *disolucion, that: it wraps all the community in evils *irreparables.

A *exácta news of the procedures of the Board;

A continued *comunicacion public of the measures that 1