\relax 
\providecommand\hyper@newdestlabel[2]{}
\providecommand\HyperFirstAtBeginDocument{\AtBeginDocument}
\HyperFirstAtBeginDocument{\ifx\hyper@anchor\@undefined
\global\let\oldcontentsline\contentsline
\gdef\contentsline#1#2#3#4{\oldcontentsline{#1}{#2}{#3}}
\global\let\oldnewlabel\newlabel
\gdef\newlabel#1#2{\newlabelxx{#1}#2}
\gdef\newlabelxx#1#2#3#4#5#6{\oldnewlabel{#1}{{#2}{#3}}}
\AtEndDocument{\ifx\hyper@anchor\@undefined
\let\contentsline\oldcontentsline
\let\newlabel\oldnewlabel
\fi}
\fi}
\global\let\hyper@last\relax 
\gdef\HyperFirstAtBeginDocument#1{#1}
\providecommand\HyField@AuxAddToFields[1]{}
\providecommand\HyField@AuxAddToCoFields[2]{}
\@writefile{nav}{\headcommand {\slideentry {0}{0}{1}{1/1}{}{0}}}
\@writefile{nav}{\headcommand {\beamer@framepages {1}{1}}}
\@writefile{toc}{\beamer@subsectionintoc {0}{1}{Figure}{2}{0}{0}}
\@writefile{nav}{\headcommand {\beamer@subsectionpages {1}{1}}}
\@writefile{nav}{\headcommand {\beamer@subsectionentry {0}{0}{1}{2}{Figure}}}
\@writefile{nav}{\headcommand {\slideentry {0}{1}{1}{2/2}{Figure}{0}}}
\@writefile{nav}{\headcommand {\beamer@framepages {2}{2}}}
\@writefile{toc}{\beamer@sectionintoc {1}{Establishment}{3}{0}{1}}
\@writefile{nav}{\headcommand {\beamer@sectionpages {1}{2}}}
\@writefile{nav}{\headcommand {\beamer@subsectionpages {2}{2}}}
\@writefile{nav}{\headcommand {\sectionentry {1}{Establishment}{3}{Establishment}{0}}}
\@writefile{toc}{\beamer@subsectionintoc {1}{1}{Background}{3}{0}{1}}
\@writefile{nav}{\headcommand {\beamer@subsectionpages {3}{2}}}
\@writefile{nav}{\headcommand {\beamer@subsectionentry {0}{1}{1}{3}{Background}}}
\@writefile{nav}{\headcommand {\slideentry {1}{1}{1}{3/6}{Background}{0}}}
\@writefile{nav}{\headcommand {\beamer@framepages {3}{6}}}
\@writefile{nav}{\headcommand {\slideentry {1}{1}{2}{7/7}{Background}{0}}}
\@writefile{nav}{\headcommand {\beamer@framepages {7}{7}}}
\@writefile{toc}{\beamer@sectionintoc {2}{Enlightened Despotism}{8}{0}{2}}
\@writefile{nav}{\headcommand {\beamer@sectionpages {3}{7}}}
\@writefile{nav}{\headcommand {\beamer@subsectionpages {3}{7}}}
\@writefile{nav}{\headcommand {\sectionentry {2}{Enlightened Despotism}{8}{Enlightened Despotism}{0}}}
\@writefile{toc}{\beamer@subsectionintoc {2}{1}{Problems}{8}{0}{2}}
\@writefile{nav}{\headcommand {\beamer@subsectionpages {8}{7}}}
\@writefile{nav}{\headcommand {\beamer@subsectionentry {0}{2}{1}{8}{Problems}}}
\@writefile{nav}{\headcommand {\slideentry {2}{1}{1}{8/11}{Problems}{0}}}
\@writefile{nav}{\headcommand {\beamer@framepages {8}{11}}}
\@writefile{toc}{\beamer@subsectionintoc {2}{2}{Bourbon Reforms}{12}{0}{2}}
\@writefile{nav}{\headcommand {\beamer@subsectionpages {8}{11}}}
\@writefile{nav}{\headcommand {\beamer@subsectionentry {0}{2}{2}{12}{Bourbon Reforms}}}
\@writefile{nav}{\headcommand {\slideentry {2}{2}{1}{12/16}{Bourbon Reforms}{0}}}
\@writefile{nav}{\headcommand {\beamer@framepages {12}{16}}}
\@writefile{toc}{\beamer@sectionintoc {3}{War}{17}{0}{3}}
\@writefile{nav}{\headcommand {\beamer@sectionpages {8}{16}}}
\@writefile{nav}{\headcommand {\beamer@subsectionpages {12}{16}}}
\@writefile{nav}{\headcommand {\sectionentry {3}{War}{17}{War}{0}}}
\@writefile{toc}{\beamer@subsectionintoc {3}{1}{Early War}{17}{0}{3}}
\@writefile{nav}{\headcommand {\beamer@subsectionpages {17}{16}}}
\@writefile{nav}{\headcommand {\beamer@subsectionentry {0}{3}{1}{17}{Early War}}}
\@writefile{nav}{\headcommand {\slideentry {3}{1}{1}{17/22}{Early War}{0}}}
\@writefile{nav}{\headcommand {\beamer@framepages {17}{22}}}
\@writefile{toc}{\beamer@subsectionintoc {3}{2}{Vales}{23}{0}{3}}
\@writefile{nav}{\headcommand {\beamer@subsectionpages {17}{22}}}
\@writefile{nav}{\headcommand {\beamer@subsectionentry {0}{3}{2}{23}{Vales}}}
\@writefile{nav}{\headcommand {\slideentry {3}{2}{1}{23/27}{Vales}{0}}}
\@writefile{nav}{\headcommand {\beamer@framepages {23}{27}}}
\@writefile{nav}{\headcommand {\slideentry {3}{2}{2}{28/28}{Vales}{0}}}
\@writefile{nav}{\headcommand {\beamer@framepages {28}{28}}}
\@writefile{toc}{\beamer@subsectionintoc {3}{3}{Good Feelings}{29}{0}{3}}
\@writefile{nav}{\headcommand {\beamer@subsectionpages {23}{28}}}
\@writefile{nav}{\headcommand {\beamer@subsectionentry {0}{3}{3}{29}{Good Feelings}}}
\@writefile{nav}{\headcommand {\slideentry {3}{3}{1}{29/32}{Good Feelings}{0}}}
\@writefile{nav}{\headcommand {\beamer@framepages {29}{32}}}
\@writefile{toc}{\beamer@subsectionintoc {3}{4}{Succession}{33}{0}{3}}
\@writefile{nav}{\headcommand {\beamer@subsectionpages {29}{32}}}
\@writefile{nav}{\headcommand {\beamer@subsectionentry {0}{3}{4}{33}{Succession}}}
\@writefile{nav}{\headcommand {\slideentry {3}{4}{1}{33/38}{Succession}{0}}}
\@writefile{nav}{\headcommand {\beamer@framepages {33}{38}}}
\@writefile{toc}{\beamer@subsectionintoc {3}{5}{French Revolution}{39}{0}{3}}
\@writefile{nav}{\headcommand {\beamer@subsectionpages {33}{38}}}
\@writefile{nav}{\headcommand {\beamer@subsectionentry {0}{3}{5}{39}{French Revolution}}}
\@writefile{nav}{\headcommand {\slideentry {3}{5}{1}{39/42}{French Revolution}{0}}}
\@writefile{nav}{\headcommand {\beamer@framepages {39}{42}}}
\@writefile{toc}{\beamer@subsectionintoc {3}{6}{War against France}{43}{0}{3}}
\@writefile{nav}{\headcommand {\beamer@subsectionpages {39}{42}}}
\@writefile{nav}{\headcommand {\beamer@subsectionentry {0}{3}{6}{43}{War against France}}}
\@writefile{nav}{\headcommand {\slideentry {3}{6}{1}{43/49}{War against France}{0}}}
\@writefile{nav}{\headcommand {\beamer@framepages {43}{49}}}
\@writefile{toc}{\beamer@subsectionintoc {3}{7}{War against Britain}{50}{0}{3}}
\@writefile{nav}{\headcommand {\beamer@subsectionpages {43}{49}}}
\@writefile{nav}{\headcommand {\beamer@subsectionentry {0}{3}{7}{50}{War against Britain}}}
\@writefile{nav}{\headcommand {\slideentry {3}{7}{1}{50/61}{War against Britain}{0}}}
\@writefile{nav}{\headcommand {\beamer@framepages {50}{61}}}
\@writefile{toc}{\beamer@subsectionintoc {3}{8}{Revolution}{62}{0}{3}}
\@writefile{nav}{\headcommand {\beamer@subsectionpages {50}{61}}}
\@writefile{nav}{\headcommand {\beamer@subsectionentry {0}{3}{8}{62}{Revolution}}}
\@writefile{nav}{\headcommand {\slideentry {3}{8}{1}{62/65}{Revolution}{0}}}
\@writefile{nav}{\headcommand {\beamer@framepages {62}{65}}}
\@writefile{toc}{\beamer@subsectionintoc {3}{9}{Napoleon}{66}{0}{3}}
\@writefile{nav}{\headcommand {\beamer@subsectionpages {62}{65}}}
\@writefile{nav}{\headcommand {\beamer@subsectionentry {0}{3}{9}{66}{Napoleon}}}
\@writefile{nav}{\headcommand {\slideentry {3}{9}{1}{66/69}{Napoleon}{0}}}
\@writefile{nav}{\headcommand {\beamer@framepages {66}{69}}}
\@writefile{toc}{\beamer@subsectionintoc {3}{10}{Caveats}{70}{0}{3}}
\@writefile{nav}{\headcommand {\beamer@subsectionpages {66}{69}}}
\@writefile{nav}{\headcommand {\beamer@subsectionentry {0}{3}{10}{70}{Caveats}}}
\@writefile{nav}{\headcommand {\slideentry {3}{10}{1}{70/77}{Caveats}{0}}}
\@writefile{nav}{\headcommand {\beamer@framepages {70}{77}}}
\@writefile{toc}{\beamer@subsectionintoc {3}{11}{Juntas}{78}{0}{3}}
\@writefile{nav}{\headcommand {\beamer@subsectionpages {70}{77}}}
\@writefile{nav}{\headcommand {\beamer@subsectionentry {0}{3}{11}{78}{Juntas}}}
\@writefile{nav}{\headcommand {\slideentry {3}{11}{1}{78/84}{Juntas}{0}}}
\@writefile{nav}{\headcommand {\beamer@framepages {78}{84}}}
\@writefile{toc}{\beamer@subsectionintoc {3}{12}{Restoration}{85}{0}{3}}
\@writefile{nav}{\headcommand {\beamer@subsectionpages {78}{84}}}
\@writefile{nav}{\headcommand {\beamer@subsectionentry {0}{3}{12}{85}{Restoration}}}
\@writefile{nav}{\headcommand {\slideentry {3}{12}{1}{85/92}{Restoration}{0}}}
\@writefile{nav}{\headcommand {\beamer@framepages {85}{92}}}
\citation{p1}
\citation{p2}
\@writefile{toc}{\beamer@sectionintoc {4}{Referencing}{93}{0}{4}}
\@writefile{nav}{\headcommand {\beamer@sectionpages {17}{92}}}
\@writefile{nav}{\headcommand {\beamer@subsectionpages {85}{92}}}
\@writefile{nav}{\headcommand {\sectionentry {4}{Referencing}{93}{Referencing}{0}}}
\@writefile{nav}{\headcommand {\slideentry {4}{0}{1}{93/93}{}{0}}}
\@writefile{nav}{\headcommand {\beamer@framepages {93}{93}}}
\bibcite{p1}{\hyperlink {beamerbibp1}{Smith, 2022}}
\bibcite{p2}{\hyperlink {beamerbibp2}{Kennedy, 2023}}
\@writefile{nav}{\headcommand {\slideentry {4}{0}{2}{94/94}{}{0}}}
\@writefile{nav}{\headcommand {\beamer@framepages {94}{94}}}
\@writefile{nav}{\headcommand {\slideentry {4}{0}{3}{95/95}{}{0}}}
\@writefile{nav}{\headcommand {\beamer@framepages {95}{95}}}
\@writefile{nav}{\headcommand {\beamer@partpages {1}{95}}}
\@writefile{nav}{\headcommand {\beamer@subsectionpages {93}{95}}}
\@writefile{nav}{\headcommand {\beamer@sectionpages {93}{95}}}
\@writefile{nav}{\headcommand {\beamer@documentpages {95}}}
\@writefile{nav}{\headcommand {\gdef \inserttotalframenumber {22}}}
\gdef \@abspage@last{95}
