\relax 
\providecommand\babel@aux[2]{}
\@nameuse{bbl@beforestart}
\babel@aux{english}{}
\citation{ElliottSpeech}
\citation{ElliottSpeech}
\bibdata{SpanAmSource.bib}
\bibstyle{plain}
\gdef \@abspage@last{9}
