{
  "date": { "type": "string", "required": true },
  "slots":
    [
      {
        "begin": { "type": "string", "required": true },
        "end": { "type": "string", "required": true },
        "show_id": { "type": "string" },
        "live": { "type": "boolean", "required": true },
        "href": { "type": "string" },
        "title": { "type": "string" }
      }
    ]
}
