{
	// Use IntelliSense to learn about possible attributes.
	// Hover to view descriptions of existing attributes.
	// For more information, visit: https://go.microsoft.com/fwlink/?linkid=830387
	"version": "0.2.0",
	"configurations": [
		{
			"name": "Flutter Client",
			"type": "dart",
			"request": "launch",
			"program": "${workspaceRoot}/grpc_demo/client/lib/main.dart"
		},
		{
			"name": "Golang Server",
			"type": "go",
			"request": "launch",
			"mode": "auto",
			"program": "${workspaceRoot}/grpc_demo/server/main.go",
			"env": {},
			"args": []
		}
	]
}