module github.com/winwisely99/plugins/webview/gcn_webview/example/desktop

go 1.13

require (
	github.com/asticode/go-astichartjs v0.1.0
	github.com/asticode/go-astikit v0.3.0
	github.com/asticode/go-astilectron v0.12.1
	github.com/asticode/go-astilectron-bootstrap v0.3.0
	github.com/asticode/go-astisplash v0.0.0-20180211022220-0139873a74cb
	github.com/google/uuid v1.1.1 // indirect
	github.com/pkg/errors v0.9.1
)
