C#5       or   C#(no 3rd)[x 4 6 6 x 4] (C# G#): root and 5th (power chord) 
C5        or   C(no 3rd) [x 3 5 5 x 3] (C  G): root and 5th (power chord) 
D#5       or   D#(no 3rd)[x 6 8 8 x 6] (D# A#): root and 5th (power chord) 
D5        or   D(no 3rd) [5 5 7 7 x 5] (D  A): root and 5th (power chord) 
D5        or   D(no 3rd) [x 0 0 2 3 5] (D  A): root and 5th (power chord) 
E5        or   E(no 3rd) [0 2 x x x 0] (E  B) : root and 5th (power chord) 
E5        or   E(no 3rd) [x 7 9 9 x 0] (E  B) : root and 5th (power chord) 
F5        or   F(no 3rd) [1 3 3 x x 1] (C  F): root and 5th (power chord) 
F5        or   F(no 3rd) [x 8 10 10 x x] (C  F): root and 5th (power chord) 
G#5       or   G#(no 3rd)[4 6 6 x x 4] (D# G#): root and 5th (power chord) 
G5        or   G(no 3rd) [3 5 5 x x 3] (D  G): root and 5th (power chord) 
G5        or   G(no 3rd) [3 x 0 0 3 3] (D  G) : root and 5th (power chord) 
A#5       or   A#(no 3rd)[6 8 8 x x 6] (F  A#): root and 5th (power chord) 
A#5       or   A#(no 3rd)[x 1 3 3 x 6] (F  A#): root and 5th (power chord) 
A5        or   A(no 3rd) [5 7 7 x x 0] (E  A) : root and 5th (power chord) 
A5        or   A(no 3rd) [5 7 7 x x 5] (E  A): root and 5th (power chord) 
A5        or   A(no 3rd) [x 0 2 2 x 0] (E  A) : root and 5th (power chord) 
B5        or   B(no 3rd) [7 9 9 x x 2] (F# B): root and 5th (power chord) 
B5        or   B(no 3rd) [x 2 4 4 x 2] (F# B): root and 5th (power chord) 
