................

x...............
x.......x.......
x...x...x...x...
x.x.x.x.x.x.x.x.
xxxxxxxxxxxxxxxx

x...+x...x.x.+x... 
x...+x...x.x.+x.xx 
x...+x...xxx.+x... 
x...x.xxx.x.x.x.
x...x.xxx.x...x.
x...x.-x-x-x.x...x.
x...x.xxx.x.x.xx
x...+x.xxxxx.+x...
x...x.xx..x.x.xx
x...x.xx..x.xxxx
x...x.xx.xx.x.xx

x...x.xx.x.xxxxx

x...-x-x-xx.xx.x.xx
x.x.x.x.x.x.x.xx
x.x.x.x.x.x.x.-x-x
x.x.+x.x.x.x.+x.x.
x.x.+x.x.x.x.+x.xx
+x.x.x.+x.x.x.+x.x.
+x.x.x.+x.x.x.+x.xx
x.x.x.x...x.x.x.
x.x.x.x...x.x.xx
x.x.x.x.x.-x-xx.-..
x.x.x.xx.xx.xx..
x.x.-..x.-..x.x.x.
x.x.-..x.-..x.xxxx
x.x.xxxx.xxx.xxx
x.xx-x.x.........
x.xxxxxx.xx.x.xx
x.xxxxxx.xx.xxxx
x.xx-x-xx.x..-x-x-x-x-x
x.xxxxx.........
x.xx.xx...x.x.xx
x.xx.xx.xx.xxxxx

x.xx.-xx.x..xxxxx
x.xx.-xx.x..-x-x-x-x-x
x..x.xx.x.x.x...
x..xxxx.x.x.x...
xxxx.xx.........
xxxx.xx.....x.x.
xxxxx.xx.xx.xx.x
//Tango
x.....x.....x...
x4546454x4546454
