%!PS-Adobe-3.0 EPSF-3.0
%%Title: ball-Laplace-solution
%%Creator: GL2PS 1.4.3, (C) 1999-2020 C. Geuzaine
%%For: Gmsh
%%CreationDate: Sun May 05 13:05:00 2024
%%LanguageLevel: 3
%%DocumentData: Clean7Bit
%%Pages: 1
%%BoundingBox: 445 130 1170 764
%%EndComments
%%BeginProlog
/gl2psdict 64 dict def gl2psdict begin
/tryPS3shading false def % set to false to force subdivision
/rThreshold 0.0666667 def % red component subdivision threshold
/gThreshold 0.05 def % green component subdivision threshold
/bThreshold 0.1 def % blue component subdivision threshold
/BD { bind def } bind def
/C  { setrgbcolor } BD
/G  { 0.082 mul exch 0.6094 mul add exch 0.3086 mul add neg 1.0 add setgray } BD
/W  { setlinewidth } BD
/LC  { setlinecap } BD
/LJ  { setlinejoin } BD
/FC { findfont exch /SH exch def SH scalefont setfont } BD
/SW { dup stringwidth pop } BD
/S  { FC moveto show } BD
/SBC{ FC moveto SW -2 div 0 rmoveto show } BD
/SBR{ FC moveto SW neg 0 rmoveto show } BD
/SCL{ FC moveto 0 SH -2 div rmoveto show } BD
/SCC{ FC moveto SW -2 div SH -2 div rmoveto show } BD
/SCR{ FC moveto SW neg SH -2 div rmoveto show } BD
/STL{ FC moveto 0 SH neg rmoveto show } BD
/STC{ FC moveto SW -2 div SH neg rmoveto show } BD
/STR{ FC moveto SW neg SH neg rmoveto show } BD
/FCT { FC translate 0 0 } BD
/SR  { gsave FCT moveto rotate show grestore } BD
/SBCR{ gsave FCT moveto rotate SW -2 div 0 rmoveto show grestore } BD
/SBRR{ gsave FCT moveto rotate SW neg 0 rmoveto show grestore } BD
/SCLR{ gsave FCT moveto rotate 0 SH -2 div rmoveto show grestore} BD
/SCCR{ gsave FCT moveto rotate SW -2 div SH -2 div rmoveto show grestore} BD
/SCRR{ gsave FCT moveto rotate SW neg SH -2 div rmoveto show grestore} BD
/STLR{ gsave FCT moveto rotate 0 SH neg rmoveto show grestore } BD
/STCR{ gsave FCT moveto rotate SW -2 div SH neg rmoveto show grestore } BD
/STRR{ gsave FCT moveto rotate SW neg SH neg rmoveto show grestore } BD
/P  { newpath 0.0 360.0 arc closepath fill } BD
/R  { newpath moveto lineto lineto lineto closepath fill } BD
/LS { newpath moveto } BD
/L  { lineto } BD
/LE { lineto stroke } BD
/T  { newpath moveto lineto lineto closepath fill } BD
/STshfill {
      /b1 exch def /g1 exch def /r1 exch def /y1 exch def /x1 exch def
      /b2 exch def /g2 exch def /r2 exch def /y2 exch def /x2 exch def
      /b3 exch def /g3 exch def /r3 exch def /y3 exch def /x3 exch def
      gsave << /ShadingType 4 /ColorSpace [/DeviceRGB]
      /DataSource [ 0 x1 y1 r1 g1 b1 0 x2 y2 r2 g2 b2 0 x3 y3 r3 g3 b3 ] >>
      shfill grestore } BD
/Tm { 3 -1 roll 8 -1 roll 13 -1 roll add add 3 div
      3 -1 roll 7 -1 roll 11 -1 roll add add 3 div
      3 -1 roll 6 -1 roll 9 -1 roll add add 3 div C T } BD
/STsplit {
      4 index 15 index add 0.5 mul
      4 index 15 index add 0.5 mul
      4 index 15 index add 0.5 mul
      4 index 15 index add 0.5 mul
      4 index 15 index add 0.5 mul
      5 copy 5 copy 25 15 roll
      9 index 30 index add 0.5 mul
      9 index 30 index add 0.5 mul
      9 index 30 index add 0.5 mul
      9 index 30 index add 0.5 mul
      9 index 30 index add 0.5 mul
      5 copy 5 copy 35 5 roll 25 5 roll 15 5 roll
      4 index 10 index add 0.5 mul
      4 index 10 index add 0.5 mul
      4 index 10 index add 0.5 mul
      4 index 10 index add 0.5 mul
      4 index 10 index add 0.5 mul
      5 copy 5 copy 40 5 roll 25 5 roll 15 5 roll 25 5 roll
      STnoshfill STnoshfill STnoshfill STnoshfill } BD
/STnoshfill {
      2 index 8 index sub abs rThreshold gt
      { STsplit }
      { 1 index 7 index sub abs gThreshold gt
        { STsplit }
        { dup 6 index sub abs bThreshold gt
          { STsplit }
          { 2 index 13 index sub abs rThreshold gt
            { STsplit }
            { 1 index 12 index sub abs gThreshold gt
              { STsplit }
              { dup 11 index sub abs bThreshold gt
                { STsplit }
                { 7 index 13 index sub abs rThreshold gt
                  { STsplit }
                  { 6 index 12 index sub abs gThreshold gt
                    { STsplit }
                    { 5 index 11 index sub abs bThreshold gt
                      { STsplit }
                      { Tm }
                      ifelse }
                    ifelse }
                  ifelse }
                ifelse }
              ifelse }
            ifelse }
          ifelse }
        ifelse }
      ifelse } BD
tryPS3shading
{ /shfill where
  { /ST { STshfill } BD }
  { /ST { STnoshfill } BD }
  ifelse }
{ /ST { STnoshfill } BD }
ifelse
end
%%EndProlog
%%BeginSetup
/DeviceRGB setcolorspace
gl2psdict begin
%%EndSetup
%%Page: 1 1
%%BeginPageSetup
%%EndPageSetup
mark
gsave
1.0 1.0 scale
793.987 710.495 1 0.951708 1.12035e-12 735.231 711.772 0.892491 1 0.215721 760.044 694.391 0.90941 1 0.198801 ST
876.219 691.235 0.298039 0.202199 0 856.12 675.068 0.298039 0.282845 0 850.417 715.195 0.298039 0.160123 0 ST
735.231 711.772 0.735827 0.889269 0.177854 682.291 696.912 0.442891 0.889269 0.47079 712.291 691.078 0.512638 0.889269 0.401043 ST
808.79 718.393 0.298039 0.23025 0 822.473 744.821 0.298039 0.122722 0 793.987 710.495 0.298039 0.262976 0 ST
682.291 696.912 0.64208 1 0.682527 631.749 690.787 0.257843 1 1 671.747 662.842 0.581411 1 0.743196 ST
712.291 691.078 0.618752 1 0.484057 760.044 694.391 0.904977 1 0.197832 735.231 711.772 0.88814 1 0.214669 ST
671.747 662.842 0.330494 0.732835 0.422458 712.291 691.078 0.422458 0.732835 0.330494 682.291 696.912 0.364981 0.732835 0.387972 ST
604.589 647.491 0.293304 0.726141 0.45277 639.354 643.764 0.293304 0.726141 0.45277 631.749 690.787 0.145228 0.726141 0.600846 ST
822.473 744.821 0.927716 0.382001 5.31813e-17 839.433 733.703 0.927716 0.44021 5.31813e-17 875.45 748.384 0.927716 0.0036381 5.31813e-17 ST
639.354 643.764 0.500115 1 0.772023 671.747 662.842 0.558381 1 0.713757 631.749 690.787 0.24763 1 1 ST
808.79 718.393 0.740703 0.57223 0 839.433 733.703 0.740703 0.351471 0 822.473 744.821 0.740703 0.304996 0 ST
876.219 691.235 0.298039 0.202199 0 829.803 668.693 0.288689 0.298039 0.0175317 846.705 701.762 0.298039 0.206874 0 ST
743.901 674.282 0.740536 1 0.394086 760.044 694.391 0.931083 1 0.203539 712.291 691.078 0.636601 1 0.498021 ST
639.354 643.764 0.358719 0.888091 0.553751 604.589 647.491 0.358719 0.888091 0.553751 596.086 640.661 0.233342 0.888091 0.679129 ST
870.3 738.45 0.97996 0.265166 8.03828e-10 928.432 740.448 0.795497 8.03828e-10 8.03828e-10 875.45 748.384 0.97996 0.00384298 8.03828e-10 ST
870.3 738.45 1 0.302189 9.03239e-05 896.058 711.366 1 0.42478 9.03239e-05 875.45 748.384 1 0.00446857 9.03239e-05 ST
604.589 647.491 0.120384 0.298039 0.185836 600.536 601.55 0.176486 0.298039 0.129735 596.086 640.661 0.0783084 0.298039 0.227912 ST
561.123 631.516 0.243801 0.68318 0.458132 596.086 640.661 0.179502 0.68318 0.522432 604.589 647.491 0.275951 0.68318 0.425983 ST
839.433 733.703 1 0.612117 1.91232e-24 854.144 697.9 1 0.956117 1.91232e-24 875.45 748.384 1 0.00505882 1.91232e-24 ST
772.609 699.048 0.461126 0.536927 0.0905407 808.79 718.393 0.536927 0.414803 6.92621e-23 760.044 694.391 0.452703 0.536927 0.0989631 ST
854.144 697.9 0.298039 0.2209 0 870.3 738.45 0.298039 0.0806459 0 875.45 748.384 0.298039 0.00116878 0 ST
702.623 674.869 0.448656 0.994846 0.5735 712.291 691.078 0.5735 0.994846 0.448656 671.423 686.08 0.355024 0.994846 0.667132 ST
815.036 700.845 0.751807 0.698738 0 839.433 733.703 0.751807 0.35674 0 808.79 718.393 0.751807 0.580807 0 ST
702.623 674.869 0.494682 1 0.632332 743.901 674.282 0.73557 1 0.391444 712.291 691.078 0.632332 1 0.494682 ST
640.939 632.386 0.111034 0.298039 0.195186 639.271 674.039 0.0549327 0.298039 0.251288 639.354 643.764 0.120384 0.298039 0.185836 ST
596.086 640.661 0.264653 1 0.77026 640.939 632.386 0.375255 1 0.659658 639.354 643.764 0.406855 1 0.628058 ST
932.341 718.11 0.301404 0.0579169 0 952.628 760.509 0.164295 0 0 928.432 740.448 0.244669 0 0 ST
854.144 697.9 1 0.942558 2.46551e-31 839.433 733.703 1 0.603436 2.46551e-31 815.036 700.845 1 1 2.46551e-31 ST
808.79 718.393 1 0.812071 1.04814e-16 772.609 699.048 0.902759 1 0.177254 815.036 700.845 1 0.976958 1.04814e-16 ST
928.432 740.448 0.945814 1.50291e-05 1.50291e-05 904.653 741.314 1 0.150795 1.50291e-05 932.341 718.11 1 0.2239 1.50291e-05 ST
639.271 674.039 0.192771 1 0.881827 663.032 660.715 0.291208 1 0.783391 671.423 686.08 0.373238 1 0.70136 ST
574.569 622.642 0.203562 0.774751 0.592457 596.086 640.661 0.203562 0.774751 0.592457 561.123 631.516 0.27648 0.774751 0.519539 ST
702.623 674.869 0.442104 0.980317 0.565124 671.423 686.08 0.349839 0.980317 0.657389 663.032 660.715 0.272951 0.980317 0.734277 ST
876.54 707.005 0.395194 0.249515 0 870.3 738.45 0.395194 0.106935 0 854.144 697.9 0.395194 0.292909 0 ST
524.596 612.328 0.289454 0.848399 0.582235 574.569 622.642 0.222913 0.848399 0.648776 561.123 631.516 0.302762 0.848399 0.568927 ST
640.939 632.386 0.207263 0.556338 0.364347 663.032 660.715 0.154902 0.556338 0.416708 639.271 674.039 0.102541 0.556338 0.46907 ST
815.036 700.845 0.975221 0.906382 1.5148e-08 840.365 692.264 0.975221 0.891085 1.5148e-08 854.144 697.9 0.975221 0.722811 1.5148e-08 ST
615.212 615.549 0.376523 1 0.757374 640.939 632.386 0.411146 1 0.722751 596.086 640.661 0.289966 1 0.843931 ST
727.374 658.202 0.556267 1 0.556267 743.901 674.282 0.726119 1 0.386414 702.623 674.869 0.488326 1 0.624208 ST
870.3 738.45 0.788457 0.213347 0 876.54 707.005 0.788457 0.49781 0 904.653 741.314 0.788457 0.102036 0 ST
957.107 724.69 0.459566 0.0666822 0 952.628 760.509 0.250509 0 0 932.341 718.11 0.459566 0.0883088 0 ST
840.365 692.264 0.559541 0.511267 1.07104e-18 876.54 707.005 0.559541 0.353279 1.07104e-18 854.144 697.9 0.559541 0.414719 1.07104e-18 ST
615.212 615.549 0.376523 1 0.757374 596.086 640.661 0.289966 1 0.843931 574.569 622.642 0.289966 1 0.843931 ST
702.623 674.869 0.551353 1 0.704772 663.032 660.715 0.3404 1 0.915725 696.27 638.558 0.532175 1 0.72395 ST
932.341 718.11 1 0.228227 2.34584e-06 904.653 741.314 1 0.153705 2.34584e-06 917.272 712.916 1 0.544947 2.34584e-06 ST
952.628 760.509 0.602659 0 0 957.107 724.69 1 0.16042 0 1003.12 742.261 0.793429 0 0 ST
743.245 699.706 0.691534 1 0.420011 777.831 684.045 0.827295 1 0.28425 772.609 699.048 0.929116 1 0.182429 ST
917.272 712.916 0.640152 0.293717 2.84337e-15 957.107 724.69 0.640152 0.0928848 2.84337e-15 932.341 718.11 0.640152 0.12301 2.84337e-15 ST
666.014 624.468 0.169087 0.473816 0.317735 663.032 660.715 0.131925 0.473816 0.354897 640.939 632.386 0.17652 0.473816 0.310303 ST
702.623 674.869 0.37342 0.828019 0.477329 696.27 638.558 0.360432 0.828019 0.490317 727.374 658.202 0.425375 0.828019 0.425375 ST
777.831 684.045 0.244599 0.31986 0.0840417 794.64 722.881 0.31986 0.31986 0.00376306 772.609 699.048 0.274704 0.31986 0.0539372 ST
876.54 707.005 0.91518 0.57782 0 917.272 712.916 0.91518 0.419906 0 904.653 741.314 0.91518 0.118435 0 ST
666.014 624.468 0.303711 0.851059 0.57071 640.939 632.386 0.317061 0.851059 0.55736 615.212 615.549 0.290361 0.851059 0.58406 ST
547.936 603.316 0.271984 0.924744 0.678146 574.569 622.642 0.242972 0.924744 0.707157 524.596 612.328 0.315501 0.924744 0.634628 ST
666.014 624.468 0.441987 1 0.830546 696.27 638.558 0.539127 1 0.733406 663.032 660.715 0.344847 1 0.927686 ST
840.365 692.264 0.920476 0.841062 9.82844e-32 858.316 684.202 0.920476 0.87355 9.82844e-32 876.54 707.005 0.920476 0.581163 9.82844e-32 ST
727.374 658.202 0.50119 0.975598 0.50119 777.831 684.045 0.746046 0.975598 0.256334 743.245 699.706 0.623618 0.975598 0.378762 ST
840.365 692.264 1 1 2.11223e-18 794.64 722.881 1 1 0.0152272 808.157 673.882 1 1 0.258863 ST
957.107 724.69 0.876049 0.127113 2.1483e-25 988.966 723.184 0.876049 0.182081 2.1483e-25 1003.12 742.261 0.628694 2.1483e-25 2.1483e-25 ST
615.212 615.549 0.331972 0.973022 0.66776 574.569 622.642 0.255657 0.973022 0.744075 581.513 611.049 0.179341 0.973022 0.820391 ST
547.936 603.316 0.279022 0.948676 0.695695 524.596 612.328 0.323666 0.948676 0.651052 496.491 594.515 0.293903 0.948676 0.680814 ST
883.491 697.264 0.812729 0.653371 1.39457e-17 917.272 712.916 0.812729 0.372899 1.39457e-17 876.54 707.005 0.812729 0.513135 1.39457e-17 ST
808.157 673.882 0.803272 0.970779 0.194156 794.64 722.881 0.970779 0.970779 0.0114209 777.831 684.045 0.74236 0.970779 0.255067 ST
917.272 712.916 1 0.470029 2.63659e-25 945.317 701.031 1 0.582514 2.63659e-25 957.107 724.69 1 0.148642 2.63659e-25 ST
547.936 603.316 0.219023 0.744677 0.546097 581.513 611.049 0.137254 0.744677 0.627865 574.569 622.642 0.19566 0.744677 0.569459 ST
696.27 638.558 0.218189 0.501245 0.296816 715.523 646.695 0.210326 0.501245 0.304678 727.374 658.202 0.257502 0.501245 0.257502 ST
876.54 707.005 0.57525 0.363197 0 858.316 684.202 0.57525 0.545924 0 883.491 697.264 0.57525 0.462456 0 ST
727.374 658.202 0.446938 0.869994 0.446938 755.47 647.786 0.501526 0.869994 0.39235 777.831 684.045 0.665289 0.869994 0.228587 ST
666.014 624.468 0.325288 0.911521 0.611255 615.212 615.549 0.310989 0.911521 0.625553 624.231 593.923 0.339586 0.911521 0.596957 ST
615.212 615.549 0.101684 0.298039 0.204537 639.036 565.9 0.167136 0.298039 0.139085 624.231 593.923 0.111034 0.298039 0.195186 ST
988.966 723.184 0.514096 0.106851 0 1024.18 748.345 0.46571 0 0 1003.12 742.261 0.368939 0 0 ST
988.966 723.184 0.868723 0.180558 8.90089e-36 957.107 724.69 0.868723 0.12605 8.90089e-36 945.317 701.031 0.868723 0.49398 8.90089e-36 ST
691.764 627.768 0.247025 0.692214 0.46419 696.27 638.558 0.301317 0.692214 0.409899 666.014 624.468 0.247025 0.692214 0.46419 ST
615.212 615.549 0.391789 1 0.788082 581.513 611.049 0.211656 1 0.968215 624.231 593.923 0.427816 1 0.752055 ST
917.272 712.916 1 0.464132 2.68536e-31 914.403 689.517 1 0.781487 2.68536e-31 945.317 701.031 1 0.575206 2.68536e-31 ST
715.523 646.695 0.41569 0.990662 0.602167 755.47 647.786 0.571088 0.990662 0.446769 727.374 658.202 0.508929 0.990662 0.508929 ST
917.272 712.916 1 0.551622 3.68071e-17 883.491 697.264 1 0.966517 3.68071e-17 914.403 689.517 1 0.928799 3.68071e-17 ST
715.523 646.695 0.20066 0.478209 0.290676 696.27 638.558 0.208162 0.478209 0.283175 691.764 627.768 0.170655 0.478209 0.320681 ST
834.881 695.046 1 1 1.48191e-13 852.148 660.176 1 1 0.176785 858.316 684.202 1 1 1.48191e-13 ST
788.903 643.459 0.696191 1 0.42284 808.157 673.882 0.901204 1 0.217827 777.831 684.045 0.832867 1 0.286164 ST
496.491 594.515 0.375896 1 0.870746 521.903 565.282 0.661387 1 0.585256 547.936 603.316 0.356863 1 0.889779 ST
858.316 684.202 0.609501 0.578429 0 852.148 660.176 0.542576 0.609501 0.0836571 883.491 697.264 0.609501 0.489991 0 ST
852.148 660.176 0.848101 0.952713 0.130764 834.881 695.046 0.952713 0.948977 0 808.157 673.882 0.788323 0.952713 0.190543 ST
755.47 647.786 0.530578 0.920391 0.415078 788.903 643.459 0.588329 0.920391 0.357328 777.831 684.045 0.703829 0.920391 0.241828 ST
624.231 593.923 0.330328 0.886671 0.580682 663.02 597.424 0.330328 0.886671 0.580682 666.014 624.468 0.31642 0.886671 0.594591 ST
1019.75 705.743 0.788309 0.448254 0 1024.18 748.345 0.714115 0 0 988.966 723.184 0.788309 0.163845 0 ST
988.966 723.184 0.594496 0.123562 3.92165e-24 945.317 701.031 0.594496 0.338047 3.92165e-24 962.359 705.142 0.594496 0.403325 3.92165e-24 ST
945.317 701.031 0.774187 0.440224 8.95569e-21 914.403 689.517 0.774187 0.598097 8.95569e-21 922.741 683.823 0.774187 0.69525 8.95569e-21 ST
852.148 660.176 0.983772 1 0.151683 808.157 673.882 0.914431 1 0.221024 809.455 649.579 0.758415 1 0.37704 ST
914.403 689.517 0.95259 0.735924 5.42699e-06 883.491 697.264 0.95259 0.765809 5.42699e-06 922.741 683.823 0.95259 0.855464 5.42699e-06 ST
476.58 561.643 0.658466 1 0.619446 521.903 565.282 0.677976 1 0.599936 496.491 594.515 0.385325 1 0.892587 ST
757.286 611.636 0.162461 0.298039 0.14376 755.47 647.786 0.171811 0.298039 0.13441 788.903 643.459 0.190511 0.298039 0.115709 ST
883.491 697.264 0.520782 0.418668 0 852.148 660.176 0.463598 0.520782 0.0714799 874.806 667.479 0.471767 0.520782 0.0633108 ST
914.403 689.517 0.404699 0.312649 0 893.58 653.143 0.385654 0.404699 0.030154 922.741 683.823 0.404699 0.363435 0 ST
809.455 649.579 0.494471 0.720514 0.245823 808.157 673.882 0.59619 0.720514 0.144103 788.903 643.459 0.460564 0.720514 0.279729 ST
568.03 597.634 0.183714 1 0.935658 581.513 611.049 0.200803 1 0.918569 535.375 608.933 0.0427241 1 1 ST
721.489 624.016 0.388327 0.892102 0.528264 715.523 646.695 0.374333 0.892102 0.542258 691.764 627.768 0.318358 0.892102 0.598233 ST
922.741 683.823 0.582189 0.522829 6.2087e-27 962.359 705.142 0.582189 0.394975 6.2087e-27 945.317 701.031 0.582189 0.331049 6.2087e-27 ST
1019.75 705.743 0.345276 0.196333 0 1044.53 745.933 0.345276 0.115092 0 1024.18 748.345 0.312779 0 0 ST
568.03 597.634 0.0949647 0.563163 0.483658 604.209 619.344 0.0574205 0.563163 0.518993 581.513 611.049 0.103799 0.563163 0.474824 ST
874.806 667.479 0.905143 0.999184 0.121469 922.741 683.823 0.999184 0.897307 2.20412e-29 883.491 697.264 0.999184 0.803266 2.20412e-29 ST
757.286 611.636 0.162461 0.298039 0.14376 739.83 663.447 0.13441 0.298039 0.171811 788.903 643.459 0.190511 0.298039 0.115709 ST
721.489 624.016 0.168933 0.388089 0.229809 739.83 663.447 0.17502 0.388089 0.223722 715.523 646.695 0.162845 0.388089 0.235897 ST
1019.75 705.743 1 0.688465 0 992.344 736.95 1 0.441567 0 992.723 687.825 1 0.99234 0 ST
535.375 608.933 0.043749 1 1 515.178 585.686 0.170621 1 0.975603 568.03 597.634 0.188121 1 0.958104 ST
992.723 687.825 0.978535 0.802015 0 992.344 736.95 0.978535 0.356877 0 962.359 705.142 0.978535 0.663869 0 ST
792.208 631.064 0.420879 0.710755 0.309388 809.455 649.579 0.487773 0.710755 0.242493 788.903 643.459 0.454326 0.710755 0.27594 ST
1019.75 705.743 0.817638 0.464931 6.12258e-28 992.723 687.825 0.817638 0.670142 6.12258e-28 1041.01 698.962 0.817638 0.747096 6.12258e-28 ST
739.83 663.447 0.561927 1 0.71829 757.549 635.436 0.620563 1 0.659654 788.903 643.459 0.796471 1 0.483746 ST
792.208 631.064 0.626715 1 0.461025 825.144 588.303 0.643285 1 0.444456 788.903 643.459 0.676423 1 0.411317 ST
1041.01 698.962 0.401224 0.366608 0 1044.53 745.933 0.401224 0.133741 0 1019.75 705.743 0.401224 0.228147 0 ST
1023.84 667.109 0.298039 0.298039 0.00350634 1019.75 705.743 0.298039 0.169473 0 1041.01 698.962 0.298039 0.272326 0 ST
568.03 597.634 0.195451 1 0.995434 515.178 585.686 0.177269 1 1 543.312 552.711 0.577261 1 0.613624 ST
568.03 597.634 0.157252 0.932543 0.80089 599.886 585.957 0.230393 0.932543 0.727749 604.209 619.344 0.0950828 0.932543 0.859402 ST
962.359 705.142 0.574928 0.390049 2.00608e-26 922.741 683.823 0.574928 0.516308 2.00608e-26 950.391 693.784 0.574928 0.572674 2.00608e-26 ST
757.549 635.436 0.363206 0.729271 0.386085 739.83 663.447 0.328887 0.729271 0.420403 721.489 624.016 0.317447 0.729271 0.431843 ST
504.277 545.025 0.36232 0.705279 0.36232 515.178 585.686 0.107866 0.705279 0.616774 476.58 561.643 0.373383 0.705279 0.351257 ST
792.208 631.064 0.62735 1 0.461164 788.903 643.459 0.677205 1 0.411309 757.549 635.436 0.527639 1 0.560876 ST
922.741 683.823 0.867331 0.778897 2.95751e-22 874.806 667.479 0.7857 0.867331 0.10544 903.021 664.535 0.758489 0.867331 0.132651 ST
788.903 643.459 0.190511 0.298039 0.115709 764.94 595.359 0.157785 0.298039 0.148435 757.549 635.436 0.148435 0.298039 0.157785 ST
950.391 693.784 1 1 1.68954e-07 992.723 687.825 1 0.943996 1.68954e-07 962.359 705.142 1 0.781394 1.68954e-07 ST
713.916 607.153 0.495885 1 0.765493 721.489 624.016 0.534401 1 0.726978 682.759 641.987 0.303309 1 0.95807 ST
543.312 552.711 0.61316 1 0.651784 515.178 585.686 0.188293 1 1 504.277 545.025 0.632472 1 0.632472 ST
599.886 585.957 0.255859 1 0.808189 642.871 603.657 0.255859 1 0.808189 604.209 619.344 0.105592 1 0.954394 ST
833.979 673.483 0.252943 0.311596 0.0672071 809.455 649.579 0.213841 0.311596 0.106309 821.478 660.814 0.208953 0.311596 0.111197 ST
874.806 667.479 1 1 0.141336 833.979 673.483 0.94376 1 0.250757 867.958 644.591 0.852575 1 0.341942 ST
504.277 545.025 0.513042 0.998669 0.513042 476.58 561.643 0.528707 0.998669 0.497376 463.463 527.431 0.701026 0.998669 0.325057 ST
553.797 589.531 0.10351 1 0.935574 599.886 585.957 0.250813 1 0.792252 568.03 597.634 0.17119 1 0.871875 ST
721.489 624.016 0.310014 0.712194 0.421731 713.916 607.153 0.287671 0.712194 0.444074 757.549 635.436 0.354701 0.712194 0.377044 ST
1044.53 745.933 0.925461 0.308487 0 1041.01 698.962 0.925461 0.845618 0 1081.86 712.661 0.925461 0.921832 0 ST
809.455 649.579 0.204537 0.298039 0.101684 792.208 631.064 0.176486 0.298039 0.129735 821.478 660.814 0.199862 0.298039 0.106359 ST
903.021 664.535 0.494634 0.565613 0.0865054 950.391 693.784 0.565613 0.563394 2.00259e-34 922.741 683.823 0.565613 0.507942 2.00259e-34 ST
678.842 585.965 0.426161 1 0.70166 682.759 641.987 0.271194 1 0.856627 642.871 603.657 0.271194 1 0.856627 ST
874.806 667.479 0.768122 0.847926 0.103081 867.958 644.591 0.621813 0.847926 0.24939 903.021 664.535 0.74152 0.847926 0.129683 ST
682.759 641.987 0.270143 1 0.85331 678.842 585.965 0.424511 1 0.698942 713.916 607.153 0.441663 1 0.68179 ST
543.312 552.711 0.430371 0.864131 0.457481 504.277 545.025 0.443926 0.864131 0.443926 543.247 544.281 0.362596 0.864131 0.525256 ST
821.478 660.814 0.775311 1 0.412592 867.958 644.591 0.847855 1 0.340049 833.979 673.483 0.938534 1 0.249369 ST
543.247 544.281 0.12506 0.298039 0.181161 553.797 589.531 0.0303883 0.298039 0.274664 543.312 552.711 0.148435 0.298039 0.157785 ST
599.886 585.957 0.262709 1 0.829828 631.483 565.939 0.396149 1 0.696388 642.871 603.657 0.262709 1 0.829828 ST
821.478 660.814 0.377739 0.563295 0.201019 792.208 631.064 0.333559 0.563295 0.245199 813.34 618.873 0.342395 0.563295 0.236363 ST
581.26 562.758 0.40429 1 0.871903 599.886 585.957 0.306871 1 0.969323 553.797 589.531 0.126645 1 1 ST
1054.9 690.434 0.567091 0.790208 0.24481 1081.86 712.661 0.790208 0.78711 2.88955e-31 1041.01 698.962 0.790208 0.722034 2.88955e-31 ST
642.871 603.657 0.275577 1 0.870472 631.483 565.939 0.415552 1 0.730497 678.842 585.965 0.433049 1 0.713 ST
501.076 535.141 0.329564 0.730771 0.421268 504.277 545.025 0.375416 0.730771 0.375416 463.463 527.431 0.512973 0.730771 0.237859 ST
713.916 607.153 0.358514 0.887584 0.553435 755.027 607.271 0.428129 0.887584 0.48382 757.549 635.436 0.442052 0.887584 0.469898 ST
581.26 562.758 0.369106 1 0.796025 631.483 565.939 0.422471 1 0.74266 599.886 585.957 0.280165 1 0.884966 ST
821.478 660.814 0.699267 1 0.372125 813.34 618.873 0.633839 1 0.437553 867.958 644.591 0.764696 1 0.306696 ST
1014.29 678.058 0.785927 1 0.364424 1041.01 698.962 1 1 4.09378e-14 991.852 696.292 1 1 4.09378e-14 ST
543.247 544.281 0.454116 1 0.657832 581.26 562.758 0.352259 1 0.75969 553.797 589.531 0.110346 1 0.997359 ST
950.391 693.784 0.663286 0.660685 0 903.021 664.535 0.58005 0.663286 0.101444 928.498 668.502 0.517623 0.663286 0.163871 ST
504.277 545.025 0.449847 0.875657 0.449847 501.076 535.141 0.394904 0.875657 0.50479 543.247 544.281 0.367432 0.875657 0.532262 ST
755.027 607.271 0.224093 0.464582 0.253243 780.239 650.038 0.253243 0.464582 0.224093 757.549 635.436 0.23138 0.464582 0.245955 ST
1054.9 690.434 0.625018 0.870927 0.269817 1041.01 698.962 0.870927 0.795788 9.7339e-19 1014.29 678.058 0.611357 0.870927 0.283478 ST
903.021 664.535 0.691911 0.791199 0.121007 867.958 644.591 0.580212 0.791199 0.232706 889.311 639.426 0.530569 0.791199 0.282349 ST
968.588 669.056 0.778348 1 0.336008 991.852 696.292 1 1 3.64337e-25 950.391 693.784 1 1 3.64337e-25 ST
813.34 618.873 0.756137 1 0.521978 780.239 650.038 0.678084 1 0.600031 789.469 622.577 0.678084 1 0.600031 ST
889.311 639.426 0.447038 0.666636 0.237898 928.498 668.502 0.520238 0.666636 0.164698 903.021 664.535 0.58298 0.666636 0.101956 ST
928.498 668.502 0.830648 1 0.262969 968.588 669.056 0.763862 1 0.329755 950.391 693.784 1 1 1.36705e-28 ST
991.852 696.292 1 1 3.19758e-25 968.588 669.056 0.770658 1 0.332688 1014.29 678.058 0.753813 1 0.349533 ST
789.469 622.577 0.500455 0.918101 0.442849 780.239 650.038 0.500455 0.918101 0.442849 755.027 607.271 0.442849 0.918101 0.500455 ST
813.34 618.873 0.297667 0.48971 0.205486 832.19 620.713 0.289985 0.48971 0.213168 849.709 650.958 0.328393 0.48971 0.174759 ST
678.842 585.965 0.174552 0.449603 0.287393 678.925 581.517 0.167499 0.449603 0.294446 707.894 605.226 0.174552 0.449603 0.287393 ST
532.202 541.632 0.219335 0.673862 0.473025 543.247 544.281 0.282758 0.673862 0.409602 501.076 535.141 0.303898 0.673862 0.388462 ST
678.842 585.965 0.390906 1 0.643281 643.065 599.457 0.233173 1 0.801014 678.925 581.517 0.375133 1 0.659054 ST
631.483 565.939 0.390534 1 0.686518 597.536 567.645 0.291873 1 0.785179 635.647 553.557 0.423421 1 0.653631 ST
635.647 553.557 0.120384 0.298039 0.185836 643.065 599.457 0.0689581 0.298039 0.237263 631.483 565.939 0.111034 0.298039 0.195186 ST
464.916 556.933 0.174369 1 0.880486 494.358 535.968 0.33485 1 0.720005 501.076 535.141 0.463235 1 0.59162 ST
473.763 393.217 0.298039 0.292195 0 462.303 446.015 0.293364 0.298039 0.0128566 467.525 421.666 0.298039 0.169473 0 ST
1156.3 428.076 0.711276 0.711276 0.0195252 1162.39 470.146 0.3654 0.711276 0.3654 1156.4 432.04 0.532759 0.711276 0.198041 ST
1115.46 318.406 0.443635 2.58124e-25 2.58124e-25 1103.68 297.388 0.345469 2.58124e-25 2.58124e-25 1130.65 344.813 0.481391 0.069849 2.58124e-25 ST
1015.8 205.973 0.190511 0 0 994.674 193.723 0.246613 0 0 969.462 178.371 0.298039 0.010519 0 ST
832.19 620.713 0.306292 0.517247 0.225155 868.222 646.997 0.314405 0.517247 0.217041 849.709 650.958 0.34686 0.517247 0.184586 ST
1104.41 686.567 0.365227 0.974288 0.639304 1125.25 647.515 0.00359643 0.631691 0.974288 1127.68 645.642 0.117795 0.974288 0.882929 ST
939.573 643.635 0.509466 1 0.541559 968.588 669.056 0.734113 1 0.316912 928.498 668.502 0.798297 1 0.252727 ST
618.865 197.883 0 0.286351 0.298039 639.74 184.983 0 0.136747 0.298039 591.421 217.886 0 0.211549 0.298039 ST
922.459 159.265 0.298039 0.164798 0 953.252 171.142 0.298039 0.0759708 0 910.192 154.908 0.298039 0.23025 0 ST
889.311 639.426 0.542279 0.808662 0.288581 939.573 643.635 0.402745 0.808662 0.428115 928.498 668.502 0.631073 0.808662 0.199787 ST
597.536 567.645 0.318471 1 0.856732 550.911 579.833 0.134565 1 1 572.943 554.991 0.336413 1 0.83879 ST
928.498 668.502 0.388377 0.497669 0.122953 939.573 643.635 0.247859 0.497669 0.263472 926.02 624.708 0.302505 0.497669 0.208826 ST
1147.55 389.447 0.677274 0.459484 5.87834e-13 1156.3 428.076 0.677274 0.677274 0.0185918 1156.4 432.04 0.507292 0.677274 0.188574 ST
495.028 337.464 0.652023 0.673141 0.0395965 520.985 373.027 0.556991 0.673141 0.134628 478.92 376.145 0.673141 0.446121 0 ST
736.157 149.121 0 0.234925 0.298039 776.072 142.36 0 0.211549 0.298039 727.614 151.407 0 0.0946713 0.298039 ST
654.478 220.629 6.16939e-07 0.252078 0.347459 618.865 197.883 6.16939e-07 0.333833 0.347459 591.421 217.886 6.16939e-07 0.246628 0.347459 ST
678.925 581.517 0.414948 1 0.729435 643.065 599.457 0.257705 1 0.886678 635.647 553.557 0.449891 1 0.694492 ST
520.985 373.027 0.246613 0.298039 0.0596078 473.763 393.217 0.298039 0.292195 0 478.92 376.145 0.298039 0.197524 0 ST
707.894 605.226 0.364239 0.938191 0.599707 678.925 581.517 0.349522 0.938191 0.614423 724.832 581.742 0.437823 0.938191 0.526123 ST
1125.25 647.515 0.000774341 0.617187 0.953412 1143.21 608.493 0.000774341 0.751677 0.953412 1127.68 645.642 0.112849 0.953412 0.863752 ST
556.324 249.317 0.0736332 0.298039 0.232587 527.746 286.819 0.0876586 0.298039 0.218562 516.753 299.435 0.298039 0.298039 0.00350634 ST
1157.72 553.02 0.00699732 0.885318 0.885318 1143.21 608.493 5.40734e-05 0.69785 0.885318 1152.82 570.042 5.40734e-05 0.545099 0.885318 ST
463.322 531.377 0.0876586 0.298039 0.218562 464.916 556.933 0.0502576 0.298039 0.255963 458.975 499.221 0.218562 0.298039 0.0876586 ST
532.202 541.632 0.291362 0.895149 0.62836 572.943 554.991 0.263279 0.895149 0.656443 550.911 579.833 0.105312 0.895149 0.8109 ST
1014.29 678.058 0.301734 0.429845 0.13991 1028.17 667.431 0.13991 0.429845 0.301734 1044.31 701.277 0.180366 0.429845 0.261278 ST
527.746 286.819 0.0876586 0.298039 0.218562 495.028 337.464 0.288689 0.298039 0.0175317 516.753 299.435 0.298039 0.298039 0.00350634 ST
969.462 178.371 0.298039 0.010519 0 994.674 193.723 0.246613 0 0 953.252 171.142 0.298039 0.0759708 0 ST
727.385 625.491 0.142549 0.352912 0.220051 707.894 605.226 0.137013 0.352912 0.225587 724.832 581.742 0.164692 0.352912 0.197907 ST
1072.72 312.537 1 0.21252 4.50102e-14 1085.91 273.31 0.62021 4.50102e-14 4.50102e-14 1103.68 297.388 0.793696 4.50102e-14 4.50102e-14 ST
1054.4 237.969 0.14376 0 0 1033.14 222.979 0.176486 0 0 1015.8 205.973 0.190511 0 0 ST
1104.41 686.567 0.377662 1 0.658437 1079.8 719.112 0.408859 1 0.627239 1103.6 683.688 0.00719507 0.775426 1 ST
1157.72 553.02 0.0069255 0.882875 0.882875 1152.82 570.042 1.00264e-06 0.543574 0.882875 1161.81 511.859 0.0069255 0.882875 0.882875 ST
1069.07 670.817 0.119278 0.596388 0.493482 1103.6 683.688 1.69151e-19 0.460739 0.596388 1104.41 686.567 0.222184 0.596388 0.390576 ST
685.895 163.283 0 0.164798 0.298039 678.813 169.089 0 0.0187005 0.298039 639.74 184.983 0 0.136747 0.298039 ST
1125.25 647.515 1.6317e-09 0.453575 0.70098 1127.68 645.642 0.0824682 0.70098 0.635005 1088.08 644.505 1.6317e-09 0.651499 0.70098 ST
1103.68 297.388 0.213887 0 0 1115.46 318.406 0.274664 0 0 1072.72 312.537 0.298039 0.0572703 0 ST
1130.65 344.813 0.602821 0.0874681 1.83792e-19 1147.55 389.447 0.602821 0.408972 1.83792e-19 1134.14 361.213 0.602821 0.276588 1.83792e-19 ST
464.916 556.933 0.198137 1 1 463.322 531.377 0.345588 1 0.861667 494.358 535.968 0.382451 1 0.824805 ST
832.19 620.713 0.306495 0.51759 0.225304 842.534 607.425 0.290256 0.51759 0.241542 868.222 646.997 0.314614 0.51759 0.217185 ST
832.19 620.713 0.598536 0.999814 0.444199 808.349 648.139 0.567669 0.999814 0.475066 842.534 607.425 0.567669 0.999814 0.475066 ST
1088.08 644.505 0 0.277001 0.298039 1103.6 683.688 0 0.23025 0.298039 1104.41 686.567 0.111034 0.298039 0.195186 ST
462.303 446.015 0.293364 0.298039 0.0128566 462.602 479.349 0.190511 0.298039 0.115709 458.975 499.221 0.218562 0.298039 0.0876586 ST
1104.41 686.567 0.368718 0.983743 0.645479 1103.6 683.688 0.00354687 0.760796 0.983743 1125.25 647.515 0.00354687 0.637791 0.983743 ST
685.895 163.283 0 0.164798 0.298039 727.614 151.407 0 0.0946713 0.298039 678.813 169.089 0 0.0187005 0.298039 ST
685.895 163.283 0 0.239943 0.433939 705.79 193.001 0 0.233136 0.433939 678.813 169.089 0 0.0272275 0.433939 ST
994.674 193.723 0.246613 0 0 1015.8 205.973 0.190511 0 0 1033.14 222.979 0.176486 0 0 ST
1130.65 344.813 0.57831 0.0839116 2.77515e-22 1134.14 361.213 0.57831 0.265342 2.77515e-22 1115.46 318.406 0.532952 2.77515e-22 2.77515e-22 ST
1161.81 511.859 0.00635503 0.810267 0.810267 1158.25 474.141 0.111213 0.810267 0.721296 1162.39 470.146 0.416255 0.810267 0.416255 ST
866.19 144.742 0.209212 0.298039 0.0970088 856.089 147.822 0.106359 0.298039 0.199862 822.968 140.574 0.0596078 0.298039 0.246613 ST
751.125 610.219 0.519512 1 0.587091 777.466 619.409 0.553301 1 0.553301 727.385 625.491 0.435038 1 0.671564 ST
804.019 610.302 0.412339 0.75645 0.364876 808.349 648.139 0.424205 0.75645 0.35301 777.466 619.409 0.388607 0.75645 0.388607 ST
532.202 541.632 0.285018 0.875657 0.614677 494.358 535.968 0.285018 0.875657 0.614677 499.893 528.563 0.298753 0.875657 0.600941 ST
1162.39 470.146 0.405091 0.788535 0.405091 1158.25 474.141 0.10823 0.788535 0.701951 1156.4 432.04 0.590628 0.788535 0.219553 ST
822.968 140.574 0.0596078 0.298039 0.246613 810.23 145.295 0 0.23025 0.298039 776.072 142.36 0 0.211549 0.298039 ST
556.324 249.317 0.0736332 0.298039 0.232587 591.421 217.886 0 0.211549 0.298039 561.523 250.308 0 0.206874 0.298039 ST
462.602 479.349 0.190511 0.298039 0.115709 463.322 531.377 0.0876586 0.298039 0.218562 458.975 499.221 0.218562 0.298039 0.0876586 ST
910.192 154.908 0.298039 0.23025 0 898.919 156.793 0.274664 0.298039 0.0315571 866.19 144.742 0.209212 0.298039 0.0970088 ST
1085.91 273.31 0.213856 0 0 1065.56 256.623 0.237783 0 0 1054.4 237.969 0.183946 0 0 ST
532.202 541.632 0.278293 0.854995 0.600173 539.794 523.001 0.345351 0.854995 0.533115 572.943 554.991 0.251469 0.854995 0.626997 ST
495.028 337.464 0.288689 0.298039 0.0175317 485.69 371.624 0.199862 0.298039 0.106359 473.763 393.217 0.298039 0.292195 0 ST
751.125 610.219 0.283666 0.588088 0.320566 727.385 625.491 0.237542 0.588088 0.36669 724.832 581.742 0.274441 0.588088 0.329791 ST
473.763 393.217 0.298039 0.292195 0 470.758 423.883 0.227912 0.298039 0.0783084 462.303 446.015 0.293364 0.298039 0.0128566 ST
1044.31 701.277 0.215346 0.513207 0.311949 1074.85 716.408 2.04151e-22 0.420629 0.513207 1079.8 719.112 0.207295 0.513207 0.32 ST
842.534 607.425 0.676364 1 0.562848 808.349 648.139 0.676364 1 0.562848 804.019 610.302 0.657444 1 0.581767 ST
637.354 193.107 0 0 0.293364 591.421 217.886 0 0.211549 0.298039 639.74 184.983 0 0.136747 0.298039 ST
777.466 619.409 0.52367 1 0.52367 751.125 610.219 0.49169 1 0.55565 804.019 610.302 0.55565 1 0.49169 ST
556.324 249.317 0.0736332 0.298039 0.232587 561.523 250.308 0 0.206874 0.298039 527.746 286.819 0.0876586 0.298039 0.218562 ST
990.12 645.499 0.351559 1 0.945743 1028.17 667.431 0.410977 1 0.886325 994.633 693.734 0.648651 1 0.648651 ST
953.252 171.142 0.298039 0.0759708 0 941.02 171.949 0.298039 0.164798 0 910.192 154.908 0.298039 0.23025 0 ST
1152.82 570.042 2.80777e-05 0.597274 0.970078 1143.21 608.493 2.80777e-05 0.764656 0.970078 1141.66 593.541 2.80777e-05 0.247296 0.970078 ST
499.893 528.563 0.319635 0.936861 0.642944 494.358 535.968 0.304939 0.936861 0.65764 463.322 531.377 0.275547 0.936861 0.687032 ST
657.919 541.166 0.14376 0.298039 0.162461 641.73 577.524 0.101684 0.298039 0.204537 635.647 553.557 0.120384 0.298039 0.185836 ST
1125.25 647.515 5.57055e-05 0.645069 0.996895 1141.66 593.541 5.57055e-05 0.254152 0.996895 1143.21 608.493 5.57055e-05 0.7858 0.996895 ST
635.647 553.557 0.447526 1 0.690708 603.217 573.324 0.291195 1 0.84704 622.074 550.473 0.464896 1 0.673338 ST
776.072 142.36 0 0.211549 0.298039 762.46 149.902 0 0.0759708 0.298039 727.614 151.407 0 0.0946713 0.298039 ST
1033.14 222.979 0.214588 0 0 1054.4 237.969 0.174797 0 0 1065.56 256.623 0.225957 0 0 ST
1147.55 389.447 0.718648 0.487553 7.42949e-16 1156.4 432.04 0.538281 0.718648 0.200094 1144.62 403.217 0.662283 0.718648 0.0760921 ST
539.794 523.001 0.454212 1 0.701163 532.202 541.632 0.366016 1 0.789359 499.893 528.563 0.383655 1 0.77172 ST
1161.81 511.859 0.00705208 0.899079 0.899079 1152.82 570.042 4.83459e-07 0.553551 0.899079 1155.28 534.223 4.83459e-07 0.497138 0.899079 ST
1044.31 701.277 0.182332 0.434531 0.264127 1028.17 667.431 0.141435 0.434531 0.305023 1057.64 682.544 0 0.356145 0.434531 ST
527.746 286.819 0.0876586 0.298039 0.218562 505.83 329.833 0.115709 0.298039 0.190511 495.028 337.464 0.288689 0.298039 0.0175317 ST
1079.8 719.112 0.424496 1 0.653924 1074.85 716.408 0.00251163 0.858771 1 1103.6 683.688 0.00251163 0.809608 1 ST
962.112 676.633 0.590516 1 0.667331 990.12 645.499 0.340867 1 0.91698 994.633 693.734 0.628923 1 0.628923 ST
883.958 625.107 0.324013 0.650577 0.344423 868.222 646.997 0.395449 0.650577 0.272987 842.534 607.425 0.364833 0.650577 0.303603 ST
678.813 169.089 0 0.0187005 0.298039 637.354 193.107 0 0 0.293364 639.74 184.983 0 0.136747 0.298039 ST
470.758 423.883 0.227912 0.298039 0.0783084 462.602 479.349 0.190511 0.298039 0.115709 462.303 446.015 0.293364 0.298039 0.0128566 ST
1096.12 298.383 0.450262 9.5666e-37 9.5666e-37 1085.91 273.31 0.283645 9.5666e-37 9.5666e-37 1115.46 318.406 0.46613 9.5666e-37 9.5666e-37 ST
810.23 145.295 0 0.23025 0.298039 822.968 140.574 0.0596078 0.298039 0.246613 856.089 147.822 0.106359 0.298039 0.199862 ST
990.12 645.499 0.240004 0.861987 0.645645 962.112 676.633 0.415782 0.861987 0.469868 939.573 643.635 0.429303 0.861987 0.456346 ST
635.647 553.557 0.401353 0.993625 0.619558 622.074 550.473 0.416939 0.993625 0.603972 657.919 541.166 0.479283 0.993625 0.541628 ST
900.848 665.568 0.444342 0.750379 0.326635 868.222 646.997 0.456113 0.750379 0.314865 883.958 625.107 0.373718 0.750379 0.397259 ST
866.19 144.742 0.209212 0.298039 0.0970088 898.919 156.793 0.274664 0.298039 0.0315571 856.089 147.822 0.106359 0.298039 0.199862 ST
1147.55 389.447 0.702672 0.476715 1.2442e-17 1144.62 403.217 0.647561 0.702672 0.0744006 1134.14 361.213 0.702672 0.322403 1.2442e-17 ST
994.674 193.723 0.246613 0 0 980.686 192.762 0.298039 0.0338947 0 953.252 171.142 0.298039 0.0759708 0 ST
842.534 607.425 0.692785 1 0.576513 804.019 610.302 0.673406 1 0.595892 814.646 581.165 0.673406 1 0.595892 ST
804.019 610.302 0.642238 1 0.568312 751.125 610.219 0.568312 1 0.642238 771.631 573.134 0.642238 1 0.568312 ST
724.832 581.742 0.482589 1 0.579918 687.322 584.721 0.433924 1 0.628582 728.899 572.21 0.547475 1 0.515032 ST
703.354 540.959 0.183153 0.356519 0.183153 728.899 572.21 0.188745 0.356519 0.17756 724.832 581.742 0.166375 0.356519 0.19993 ST
751.125 610.219 0.190706 0.395366 0.215513 724.832 581.742 0.184504 0.395366 0.221715 728.899 572.21 0.209311 0.395366 0.196908 ST
1025.94 662.56 0.0225388 0.574739 0.567978 1028.17 667.431 0.187072 0.574739 0.403445 990.12 645.499 0.160026 0.574739 0.430491 ST
505.83 329.833 0.115709 0.298039 0.190511 485.69 371.624 0.199862 0.298039 0.106359 495.028 337.464 0.288689 0.298039 0.0175317 ST
1121.79 507.031 0 0.277001 0.298039 1161.81 511.859 0.00233756 0.298039 0.298039 1158.25 474.141 0.0409073 0.298039 0.265313 ST
473.763 393.217 0.298039 0.292195 0 485.69 371.624 0.199862 0.298039 0.106359 470.758 423.883 0.227912 0.298039 0.0783084 ST
687.322 584.721 0.449817 1 0.651604 641.73 577.524 0.365739 1 0.735682 657.919 541.166 0.51708 1 0.584342 ST
776.072 142.36 0 0.211549 0.298039 810.23 145.295 0 0.23025 0.298039 762.46 149.902 0 0.0759708 0.298039 ST
900.848 665.568 0.671542 1 0.493652 915.998 645.073 0.493652 1 0.671542 939.573 643.635 0.564808 1 0.600386 ST
910.192 154.908 0.298039 0.23025 0 941.02 171.949 0.298039 0.164798 0 898.919 156.793 0.274664 0.298039 0.0315571 ST
1155.28 534.223 0 0.164798 0.298039 1161.81 511.859 0.00233756 0.298039 0.298039 1121.79 507.031 0 0.277001 0.298039 ST
1103.6 683.688 0.000337901 0.808994 1 1111.83 658.269 0.000337901 0.267153 1 1125.25 647.515 0.000337901 0.677638 1 ST
1085.91 273.31 0.272728 0 0 1096.12 298.383 0.432931 0 0 1065.56 256.623 0.303243 0 0 ST
0.548906 1 0.485722 C
814.646 581.165 804.019 610.302 771.631 573.134 T
1057.64 682.544 0 0.360768 0.440171 1074.85 716.408 0 0.360768 0.440171 1044.31 701.277 0.184699 0.440171 0.267555 ST
587.509 527.782 0.389478 0.863625 0.497855 572.943 554.991 0.254007 0.863625 0.633325 539.794 523.001 0.348837 0.863625 0.538496 ST
591.421 217.886 0 0.211549 0.298039 598.853 222.202 0 0.0432449 0.298039 561.523 250.308 0 0.206874 0.298039 ST
727.614 151.407 0 0.0946713 0.298039 713.338 164.146 0 0 0.255963 678.813 169.089 0 0.0187005 0.298039 ST
1028.17 667.431 0.163892 0.503524 0.353454 1025.94 662.56 0.0197461 0.503524 0.497601 1057.64 682.544 5.89188e-32 0.412693 0.503524 ST
1152.82 570.042 3.2596e-07 0.60667 0.985356 1141.66 593.541 3.2596e-07 0.251169 0.985356 1155.28 534.223 3.2596e-07 0.544844 0.985356 ST
813.773 541.84 0.248287 0.442749 0.206616 833.734 510.454 0.241342 0.442749 0.213561 852.012 541.353 0.234397 0.442749 0.220507 ST
751.125 610.219 0.587349 1 0.663752 728.899 572.21 0.644651 1 0.60645 771.631 573.134 0.663752 1 0.587349 ST
1033.14 222.979 0.176486 0 0 1015.23 218.146 0.260638 0 0 994.674 193.723 0.246613 0 0 ST
591.421 217.886 0 0.211549 0.298039 637.354 193.107 0 0 0.293364 598.853 222.202 0 0.0432449 0.298039 ST
953.252 171.142 0.298039 0.0759708 0 980.686 192.762 0.298039 0.0338947 0 941.02 171.949 0.298039 0.164798 0 ST
1134.14 361.213 0.629387 0.288777 1.1047e-26 1116.17 339.859 0.629387 0.249287 1.1047e-26 1115.46 318.406 0.580023 1.1047e-26 1.1047e-26 ST
603.217 573.324 0.280865 1 0.812985 591.676 577.388 0.297494 1 0.796356 622.074 550.473 0.447152 1 0.646697 ST
883.958 625.107 0.395988 0.795093 0.420932 915.998 645.073 0.346099 0.795093 0.47082 900.848 665.568 0.47082 0.795093 0.346099 ST
682.951 558.7 0.243914 0.474795 0.243914 687.322 584.721 0.199228 0.474795 0.288601 657.919 541.166 0.229019 0.474795 0.25881 ST
1103.6 683.688 0 0.840902 1 1074.85 716.408 0 0.892125 1 1057.64 682.544 0 0.892125 1 ST
849.318 607.987 0.224196 0.423481 0.21091 842.534 607.425 0.237481 0.423481 0.197624 814.646 581.165 0.230838 0.423481 0.204267 ST
762.46 149.902 0 0.0759708 0.298039 713.338 164.146 0 0 0.255963 727.614 151.407 0 0.0946713 0.298039 ST
1156.4 432.04 0.616806 0.823484 0.229284 1158.25 474.141 0.113027 0.823484 0.733063 1148 444.703 0.216366 0.823484 0.629723 ST
842.534 607.425 0.315372 0.562377 0.262443 849.318 607.987 0.297729 0.562377 0.280086 883.958 625.107 0.280086 0.562377 0.297729 ST
587.509 527.782 0.13441 0.298039 0.171811 591.676 577.388 0.0829835 0.298039 0.223237 572.943 554.991 0.0876586 0.298039 0.218562 ST
561.523 250.308 0 0.206874 0.298039 535.995 290.043 0 0.24895 0.298039 527.746 286.819 0.0876586 0.298039 0.218562 ST
682.951 558.7 0.579676 1 0.579676 728.899 572.21 0.597376 1 0.561975 687.322 584.721 0.473475 1 0.685876 ST
473.477 499.849 0.13441 0.298039 0.171811 463.322 531.377 0.0876586 0.298039 0.218562 462.602 479.349 0.190511 0.298039 0.115709 ST
473.477 499.849 0.467084 1 0.597055 499.893 528.563 0.353359 1 0.710779 463.322 531.377 0.30462 1 0.759519 ST
1096.12 298.383 0.543014 2.12887e-30 2.12887e-30 1115.46 318.406 0.562151 2.12887e-30 2.12887e-30 1116.17 339.859 0.609993 0.241605 2.12887e-30 ST
994.674 193.723 0.246613 0 0 1015.23 218.146 0.260638 0 0 980.686 192.762 0.298039 0.0338947 0 ST
1156.4 432.04 0.607346 0.810855 0.225767 1148 444.703 0.213048 0.810855 0.620065 1144.62 403.217 0.747258 0.810855 0.0858552 ST
535.995 290.043 0 0.24895 0.298039 505.83 329.833 0.115709 0.298039 0.190511 527.746 286.819 0.0876586 0.298039 0.218562 ST
1141.66 593.541 2.33368e-05 0.268096 1 1125.25 647.515 2.33368e-05 0.680516 1 1127.59 611.419 2.33368e-05 2.33368e-05 1 ST
497.877 486.266 0.167136 0.298039 0.139085 473.477 499.849 0.13441 0.298039 0.171811 463.322 531.377 0.0876586 0.298039 0.218562 ST
745.429 557.664 0.644728 1 0.504379 771.631 573.134 0.609641 1 0.539467 728.899 572.21 0.592097 1 0.55701 ST
539.794 523.001 0.405075 1 0.62531 499.893 528.563 0.342151 1 0.688234 514.251 514.003 0.452268 1 0.578117 ST
1065.56 256.623 0.259183 0 0 1045.27 248.573 0.350467 0 0 1033.14 222.979 0.246142 0 0 ST
1125.25 647.515 2.24789e-05 0.678365 1 1111.83 658.269 2.24789e-05 0.267248 1 1127.59 611.419 2.24789e-05 2.24789e-05 0.999036 ST
1158.25 474.141 0.125443 0.913939 0.813585 1155.28 534.223 8.38338e-10 0.505354 0.913939 1150.59 501.3 8.38338e-10 0.548363 0.913939 ST
678.813 169.089 0 0.0187005 0.298039 671.444 185.041 0 0 0.199862 637.354 193.107 0 0 0.293364 ST
622.074 550.473 0.49346 1 0.714825 591.676 577.388 0.327436 1 0.880848 587.509 527.782 0.530354 1 0.677931 ST
990.12 645.499 0.201434 0.72346 0.541886 1012.02 629.746 0 0.61565 0.72346 1025.94 662.56 0.028371 0.72346 0.714949 ST
1080.63 695.533 0.000149383 0.332571 1 1111.83 658.269 0.000149383 0.280765 1 1103.6 683.688 0.000149383 0.850629 1 ST
470.758 423.883 0.227912 0.298039 0.0783084 479.653 444.977 0.167136 0.298039 0.139085 462.602 479.349 0.190511 0.298039 0.115709 ST
657.919 541.166 0.443819 0.92008 0.501548 622.074 550.473 0.386091 0.92008 0.559276 651.146 540.586 0.530412 0.92008 0.414955 ST
810.23 145.295 0 0.23025 0.298039 856.089 147.822 0.106359 0.298039 0.199862 824.181 156.077 0 0.211549 0.298039 ST
1144.62 403.217 0.682166 0.740222 0.0783765 1127.86 380.75 0.740222 0.740222 0.0087085 1134.14 361.213 0.740222 0.339631 2.36972e-21 ST
1155.28 534.223 2.48382e-07 0.550111 0.99488 1141.66 593.541 2.48382e-07 0.253597 0.99488 1142.39 560.593 2.48382e-07 0.093636 0.99488 ST
898.919 156.793 0.274664 0.298039 0.0315571 872.259 162.542 0.101684 0.298039 0.204537 856.089 147.822 0.106359 0.298039 0.199862 ST
713.338 164.146 0 0 0.255963 671.444 185.041 0 0 0.199862 678.813 169.089 0 0.0187005 0.298039 ST
1015.23 218.146 0.355119 0 0 1033.14 222.979 0.240462 0 0 1045.27 248.573 0.34238 0 0 ST
810.23 145.295 0 0.23025 0.298039 769.351 158.269 0 0.0327259 0.298039 762.46 149.902 0 0.0759708 0.298039 ST
485.69 371.624 0.199862 0.298039 0.106359 492.078 391.186 0.13441 0.298039 0.171811 470.758 423.883 0.227912 0.298039 0.0783084 ST
505.83 329.833 0.115709 0.298039 0.190511 511.251 340.483 0.0455825 0.298039 0.260638 485.69 371.624 0.199862 0.298039 0.106359 ST
511.251 340.483 0.0455825 0.298039 0.260638 523.669 372.157 0.162461 0.298039 0.14376 505.83 329.833 0.115709 0.298039 0.190511 ST
1057.64 682.544 0 0.53759 0.655912 1025.94 662.56 0.025722 0.655912 0.648195 1052.42 662.503 0 0.321525 0.655912 ST
1012.02 629.746 0.000268209 0.854921 1 990.12 645.499 0.279901 1 0.75252 966.297 652.775 0.216885 1 0.815536 ST
941.02 171.949 0.298039 0.164798 0 917.866 175.651 0.284014 0.298039 0.0222068 898.919 156.793 0.274664 0.298039 0.0315571 ST
1158.25 474.141 0.124635 0.908051 0.808344 1150.59 501.3 1.22991e-12 0.544831 0.908051 1148 444.703 0.238586 0.908051 0.694392 ST
888.816 599.307 0.498792 1 0.637587 883.958 625.107 0.55084 1 0.585539 849.318 607.987 0.585539 1 0.55084 ST
1096.12 298.383 0.47678 0 0 1074.02 285.546 0.53559 0.0189032 0 1065.56 256.623 0.333956 0 0 ST
1116.17 339.859 0.725896 0.287512 3.97683e-23 1134.14 361.213 0.725896 0.333058 3.97683e-23 1127.86 380.75 0.725896 0.725896 0.00853995 ST
924.697 621.798 0.240627 0.776709 0.557403 915.998 645.073 0.338097 0.776709 0.459933 883.958 625.107 0.386831 0.776709 0.411199 ST
598.853 222.202 0 0.0432449 0.298039 570.758 258.862 0 0.085321 0.298039 561.523 250.308 0 0.206874 0.298039 ST
745.429 557.664 0.601113 1 0.470708 728.899 572.21 0.552211 1 0.51961 711.157 580.454 0.601113 1 0.470708 ST
1155.28 534.223 1.36083e-09 0.551818 0.997968 1142.39 560.593 1.36083e-09 0.0939264 0.997968 1150.59 501.3 1.36083e-09 0.598781 0.997968 ST
561.523 250.308 0 0.206874 0.298039 570.758 258.862 0 0.085321 0.298039 535.995 290.043 0 0.24895 0.298039 ST
762.46 149.902 0 0.0759708 0.298039 769.351 158.269 0 0.0327259 0.298039 713.338 164.146 0 0 0.255963 ST
514.251 514.003 0.370889 0.822406 0.474093 499.893 528.563 0.280585 0.822406 0.564396 473.477 499.849 0.370889 0.822406 0.474093 ST
637.354 193.107 0 0 0.293364 631.315 211.74 0 0 0.218562 598.853 222.202 0 0.0432449 0.298039 ST
762.46 149.902 0 0.0759708 0.298039 769.351 158.269 0 0.0327259 0.298039 748.133 193.986 0 0.104022 0.298039 ST
941.02 171.949 0.298039 0.164798 0 980.686 192.762 0.298039 0.0338947 0 959.075 195.073 0.298039 0.174148 0 ST
535.995 290.043 0 0.24895 0.298039 511.251 340.483 0.0455825 0.298039 0.260638 505.83 329.833 0.115709 0.298039 0.190511 ST
479.653 444.977 0.167136 0.298039 0.139085 473.477 499.849 0.13441 0.298039 0.171811 462.602 479.349 0.190511 0.298039 0.115709 ST
1141.66 593.541 2.11584e-07 0.270465 1 1127.59 611.419 2.11584e-07 2.11584e-07 1 1142.39 560.593 2.11584e-07 0.0998642 1 ST
924.697 621.798 0.296564 0.957263 0.686977 966.297 652.775 0.206468 0.957263 0.777072 915.998 645.073 0.416691 0.957263 0.56685 ST
888.816 599.307 0.335652 0.744271 0.429051 924.697 621.798 0.230578 0.744271 0.534124 883.958 625.107 0.370676 0.744271 0.394026 ST
810.23 145.295 0 0.23025 0.298039 824.181 156.077 0 0.211549 0.298039 769.351 158.269 0 0.0327259 0.298039 ST
856.089 147.822 0.106359 0.298039 0.199862 872.259 162.542 0.101684 0.298039 0.204537 824.181 156.077 0 0.211549 0.298039 ST
1045.27 248.573 0.441543 0 0 1065.56 256.623 0.326536 0 0 1074.02 285.546 0.52369 0.0184832 0 ST
1052.42 662.503 0 0.307299 0.626889 1025.94 662.56 0.0245839 0.626889 0.619514 1012.02 629.746 0 0.533471 0.626889 ST
1057.64 682.544 0 0.375449 0.458083 1052.42 662.503 0 0.224551 0.458083 1080.63 695.533 0 0.138323 0.458083 ST
511.251 340.483 0.0455825 0.298039 0.260638 492.078 391.186 0.13441 0.298039 0.171811 485.69 371.624 0.199862 0.298039 0.106359 ST
622.074 550.473 0.392979 0.936538 0.569268 608.914 546.431 0.481124 0.936538 0.481124 651.146 540.586 0.539887 0.936538 0.42236 ST
966.297 652.775 0.106065 0.491758 0.399192 952.779 617.855 0.129207 0.491758 0.37605 970.736 623.663 0.0424262 0.491758 0.462831 ST
952.779 617.855 0.278048 1 0.809244 966.297 652.775 0.228248 1 0.859043 924.697 621.798 0.327847 1 0.759444 ST
898.919 156.793 0.274664 0.298039 0.0315571 917.866 175.651 0.284014 0.298039 0.0222068 872.259 162.542 0.101684 0.298039 0.204537 ST
470.758 423.883 0.227912 0.298039 0.0783084 492.078 391.186 0.13441 0.298039 0.171811 479.653 444.977 0.167136 0.298039 0.139085 ST
671.444 185.041 0 0 0.199862 631.315 211.74 0 0 0.218562 637.354 193.107 0 0 0.293364 ST
1116.17 339.859 0.653784 0.25895 0 1094.76 325.248 0.653784 0.310227 0 1096.12 298.383 0.581996 0 0 ST
980.686 192.762 0.358453 0.0407653 0 1015.23 218.146 0.313471 0 0 994.8 219.469 0.358453 0.102616 0 ST
1148 444.703 0.222112 0.845352 0.646446 1132.28 421.399 0.288414 0.845352 0.580144 1144.62 403.217 0.77905 0.845352 0.0895079 ST
682.951 558.7 0.263853 0.513606 0.263853 696.613 543.424 0.328305 0.513606 0.1994 711.157 580.454 0.296079 0.513606 0.231626 ST
564.598 524.362 0.460333 0.844496 0.407345 587.509 527.782 0.380851 0.844496 0.486827 550.246 527.468 0.367604 0.844496 0.500074 ST
1127.59 611.419 2.31159e-06 2.31159e-06 1 1111.83 658.269 2.31159e-06 0.285362 1 1098.71 657.56 2.31159e-06 2.31159e-06 1 ST
651.146 540.586 0.560899 0.972988 0.438799 696.613 543.424 0.621949 0.972988 0.377748 682.951 558.7 0.499849 0.972988 0.499849 ST
970.736 623.663 0.100714 1 1 1012.02 629.746 0 0.993405 1 966.297 652.775 0.251785 1 0.947626 ST
1080.63 695.533 2.01036e-05 0.341371 1 1098.71 657.56 2.01036e-05 2.01036e-05 1 1111.83 658.269 2.01036e-05 0.288173 1 ST
941.02 171.949 0.298039 0.164798 0 959.075 195.073 0.298039 0.174148 0 917.866 175.651 0.284014 0.298039 0.0222068 ST
609.055 504.163 0.193997 0.336526 0.151767 608.914 546.431 0.172882 0.336526 0.172882 587.509 527.782 0.151767 0.336526 0.193997 ST
745.429 557.664 0.40405 0.700903 0.316094 771.02 553.021 0.459023 0.700903 0.261121 778.996 578.867 0.415045 0.700903 0.305099 ST
1144.62 403.217 0.770251 0.835804 0.0884969 1132.28 421.399 0.285157 0.835804 0.573591 1127.86 380.75 0.835804 0.835804 0.00983299 ST
1096.12 298.383 0.573446 0 0 1094.76 325.248 0.644179 0.305669 0 1074.02 285.546 0.644179 0.0227357 0 ST
849.318 607.987 0.533949 1 0.502307 847.849 594.423 0.549769 1 0.486487 888.816 599.307 0.454845 1 0.581411 ST
711.157 580.454 0.642494 1 0.502668 733.223 555.75 0.747363 1 0.397799 745.429 557.664 0.642494 1 0.502668 ST
1015.23 218.146 0.409434 0 0 1045.27 248.573 0.394746 0 0 994.8 219.469 0.468187 0.13403 0 ST
713.338 164.146 0 0 0.255963 721.859 176.076 0 0 0.204537 671.444 185.041 0 0 0.199862 ST
1148 444.703 0.245442 0.934144 0.714345 1150.59 501.3 1.45937e-13 0.560486 0.934144 1138.78 471.051 1.45937e-13 0.648406 0.934144 ST
713.338 164.146 0 0 0.255963 769.351 158.269 0 0.0327259 0.298039 721.859 176.076 0 0 0.204537 ST
816.373 602.854 0.560103 0.971607 0.438176 847.849 594.423 0.529621 0.971607 0.468657 849.318 607.987 0.51438 0.971607 0.483898 ST
520.044 472.432 0.582686 1 0.515614 514.251 514.003 0.482078 1 0.616222 473.477 499.849 0.482078 1 0.616222 ST
609.055 504.163 0.650085 1 0.508571 587.509 527.782 0.508571 1 0.650085 564.598 524.362 0.614707 1 0.54395 ST
778.996 578.867 0.47574 0.803402 0.349716 796.22 565.971 0.500944 0.803402 0.324511 816.373 602.854 0.463137 0.803402 0.362318 ST
817.599 556.211 0.595992 1 0.466364 778.996 578.867 0.612196 1 0.450161 796.22 565.971 0.644603 1 0.417754 ST
980.686 192.762 0.357431 0.0406491 0 994.8 219.469 0.357431 0.102323 0 959.075 195.073 0.357431 0.208852 0 ST
598.853 222.202 0 0.0432449 0.298039 602.933 241.808 0 0 0.269988 570.758 258.862 0 0.085321 0.298039 ST
1150.59 501.3 4.03439e-10 0.607687 1 1142.39 560.593 4.03439e-10 0.0953234 1 1135.93 530.533 4.03439e-10 0.0794362 1 ST
535.995 290.043 0 0.24895 0.298039 543.653 304.168 0 0.192849 0.298039 511.251 340.483 0.0455825 0.298039 0.260638 ST
1098.71 657.56 0 0 0.943416 1080.63 695.533 0 0.314472 1 1052.42 662.503 0 0.510507 1 ST
651.146 540.586 0.64251 1 0.502644 608.914 546.431 0.572577 1 0.572577 609.055 504.163 0.64251 1 0.502644 ST
557.644 338.196 0.0163629 0.298039 0.289858 535.995 290.043 0 0.24895 0.298039 543.653 304.168 0 0.192849 0.298039 ST
631.315 211.74 0 0 0.218562 602.933 241.808 0 0 0.269988 598.853 222.202 0 0.0432449 0.298039 ST
570.758 258.862 0 0.085321 0.298039 543.653 304.168 0 0.192849 0.298039 535.995 290.043 0 0.24895 0.298039 ST
514.251 514.003 0.301935 0.669507 0.385951 528.025 514.762 0.375449 0.669507 0.312437 550.246 527.468 0.291432 0.669507 0.396453 ST
745.429 557.664 0.499332 0.866188 0.390634 733.223 555.75 0.580856 0.866188 0.30911 771.02 553.021 0.567268 0.866188 0.322698 ST
796.22 565.971 0.581416 0.93246 0.376641 778.996 578.867 0.552163 0.93246 0.405895 771.02 553.021 0.61067 0.93246 0.347387 ST
1127.86 380.75 0.765589 0.765589 0.00900693 1107.14 365.105 0.753579 0.765589 0.0330254 1116.17 339.859 0.765589 0.303233 2.84525e-29 ST
1142.39 560.593 2.0703e-08 0.102919 1 1127.59 611.419 2.0703e-08 2.0703e-08 1 1123.86 573.362 2.0703e-08 2.0703e-08 0.819067 ST
696.613 543.424 0.590651 0.924025 0.358739 733.223 555.75 0.61964 0.924025 0.32975 711.157 580.454 0.532673 0.924025 0.416717 ST
923.607 586.323 0.216114 0.776185 0.581378 924.697 621.798 0.240465 0.776185 0.557027 888.816 599.307 0.350044 0.776185 0.447448 ST
1148 444.703 0.24242 0.922644 0.705551 1138.78 471.051 8.74324e-17 0.640424 0.922644 1132.28 421.399 0.314784 0.922644 0.633187 ST
1127.59 611.419 9.13862e-07 9.13862e-07 1 1098.71 657.56 9.13862e-07 9.13862e-07 1 1112.8 617.245 9.13862e-07 9.13862e-07 0.810002 ST
1035.3 624.769 0 0.294268 0.688424 1052.42 662.503 0 0.337463 0.688424 1012.02 629.746 0 0.585836 0.688424 ST
1150.59 501.3 7.68384e-13 0.607546 1 1135.93 530.533 7.68384e-13 0.0794178 1 1138.78 471.051 7.68384e-13 0.702848 1 ST
479.653 444.977 0.167136 0.298039 0.139085 488.509 495.305 0.162461 0.298039 0.14376 473.477 499.849 0.13441 0.298039 0.171811 ST
520.044 472.432 0.162461 0.298039 0.14376 528.025 514.762 0.167136 0.298039 0.139085 514.251 514.003 0.13441 0.298039 0.171811 ST
564.598 524.362 0.430392 0.789568 0.380851 550.246 527.468 0.343695 0.789568 0.467548 528.025 514.762 0.442778 0.789568 0.368465 ST
1094.76 325.248 0.754778 0.358149 2.12463e-31 1116.17 339.859 0.754778 0.298951 2.12463e-31 1107.14 365.105 0.742938 0.754778 0.032559 ST
488.509 495.305 0.513355 0.916824 0.457704 520.044 472.432 0.513355 0.916824 0.457704 473.477 499.849 0.429879 0.916824 0.541181 ST
824.181 156.077 0 0.211549 0.298039 801.875 172.814 0 0.085321 0.298039 769.351 158.269 0 0.0327259 0.298039 ST
847.849 594.423 0.680919 1 0.60254 883.469 575.031 0.56335 1 0.720109 888.816 599.307 0.56335 1 0.720109 ST
1045.27 248.573 0.493568 0 0 1074.02 285.546 0.585394 0.020661 0 1022.26 252.179 0.585394 0.176766 0 ST
1045.27 248.573 0.928144 0.00018572 0.00018572 1008.35 271.112 1 0.505168 0.00018572 1022.26 252.179 1 0.332524 0.00018572 ST
888.816 599.307 0.421911 0.935543 0.539313 883.469 575.031 0.421911 0.935543 0.539313 923.607 586.323 0.260484 0.935543 0.70074 ST
796.22 565.971 0.276443 0.443352 0.179079 813.375 577.477 0.283397 0.443352 0.172125 816.373 602.854 0.255579 0.443352 0.199943 ST
872.259 162.542 0.101684 0.298039 0.204537 850.079 176.714 0 0.253626 0.298039 824.181 156.077 0 0.211549 0.298039 ST
671.444 185.041 0 0 0.199862 654.2 214.24 0 0 0.176486 631.315 211.74 0 0 0.218562 ST
696.613 543.424 0.587047 0.918387 0.35655 651.146 540.586 0.529423 0.918387 0.414174 668.276 529.276 0.702296 0.918387 0.241302 ST
1142.39 560.593 5.46425e-10 0.101793 1 1123.86 573.362 5.46425e-10 5.46425e-10 0.810107 1135.93 530.533 5.46425e-10 0.0848279 1 ST
1123.86 573.362 2.1549e-08 2.1549e-08 0.833508 1127.59 611.419 2.1549e-08 2.1549e-08 1 1112.8 617.245 2.1549e-08 2.1549e-08 0.798597 ST
528.538 349.298 0 0.295702 0.298039 492.078 391.186 0.13441 0.298039 0.171811 511.251 340.483 0.0455825 0.298039 0.260638 ST
994.8 219.469 0.485372 0.138949 0 1045.27 248.573 0.409235 0 0 1022.26 252.179 0.485372 0.146563 0 ST
813.375 577.477 0.61176 0.957049 0.37156 847.849 594.423 0.521685 0.957049 0.461635 816.373 602.854 0.55171 0.957049 0.43161 ST
917.866 175.651 0.284014 0.298039 0.0222068 896.135 187.38 0.139085 0.298039 0.167136 872.259 162.542 0.101684 0.298039 0.204537 ST
609.055 504.163 0.733011 1 0.573444 564.598 524.362 0.693119 1 0.613336 577.791 500.696 0.832741 1 0.473715 ST
511.147 402.056 0.115709 0.298039 0.190511 479.653 444.977 0.167136 0.298039 0.139085 492.078 391.186 0.13441 0.298039 0.171811 ST
721.859 176.076 0 0 0.204537 694.8 197.805 0 0 0.167136 671.444 185.041 0 0 0.199862 ST
923.607 586.323 0.142383 0.511375 0.38303 949.611 623.279 0.0441186 0.511375 0.481294 924.697 621.798 0.158426 0.511375 0.366987 ST
769.351 158.269 0 0.0327259 0.298039 752.649 181.354 0 0 0.241938 721.859 176.076 0 0 0.204537 ST
959.075 195.073 0.330266 0.192979 0 937.951 204.665 0.319905 0.330266 0.0194274 917.866 175.651 0.314724 0.330266 0.0246081 ST
543.653 304.168 0 0.192849 0.298039 528.538 349.298 0 0.295702 0.298039 511.251 340.483 0.0455825 0.298039 0.260638 ST
1132.28 421.399 0.295053 0.86481 0.593497 1112.15 404.802 0.308619 0.86481 0.579932 1127.86 380.75 0.86481 0.86481 0.0101742 ST
1074.02 285.546 0.682477 0.0240874 0 1094.76 325.248 0.682477 0.323842 0 1074.43 321.168 0.682477 0.463014 0 ST
631.315 211.74 0 0 0.218562 654.2 214.24 0 0 0.176486 602.933 241.808 0 0 0.269988 ST
570.758 258.862 0 0.085321 0.298039 576.972 282.216 0 0.0759708 0.298039 543.653 304.168 0 0.192849 0.298039 ST
1052.42 662.503 0 0.204705 0.417598 1035.3 624.769 0 0.178503 0.417598 1074.37 668.036 0 0 0.32589 ST
796.22 565.971 0.412309 0.661251 0.267093 771.02 553.021 0.433054 0.661251 0.246348 787.867 552.673 0.49529 0.661251 0.184113 ST
733.223 555.75 0.755441 1 0.402018 745.995 535.611 0.879139 1 0.27832 771.02 553.021 0.73777 1 0.41969 ST
602.933 241.808 0 0 0.269988 576.972 282.216 0 0.0759708 0.298039 570.758 258.862 0 0.085321 0.298039 ST
824.181 156.077 0 0.211549 0.298039 850.079 176.714 0 0.253626 0.298039 801.875 172.814 0 0.085321 0.298039 ST
671.444 185.041 0 0 0.199862 694.8 197.805 0 0 0.167136 654.2 214.24 0 0 0.176486 ST
564.598 524.362 0.672927 1 0.595468 528.025 514.762 0.692292 1 0.576103 577.791 500.696 0.80848 1 0.459914 ST
769.351 158.269 0 0.0327259 0.298039 801.875 172.814 0 0.085321 0.298039 752.649 181.354 0 0 0.241938 ST
733.223 555.75 0.417698 0.622883 0.222284 696.613 543.424 0.398157 0.622883 0.241825 705.304 543.555 0.544717 0.622883 0.0952644 ST
1107.14 365.105 0.851245 0.86481 0.0373055 1127.86 380.75 0.86481 0.86481 0.0101742 1112.15 404.802 0.308619 0.86481 0.579932 ST
651.146 540.586 0.546328 0.947712 0.427399 627.584 526.309 0.724721 0.947712 0.249007 668.276 529.276 0.724721 0.947712 0.249007 ST
994.8 219.469 0.426647 0.122138 0 974.243 227.906 0.426647 0.309528 0 959.075 195.073 0.426647 0.249296 0 ST
520.044 472.432 0.162461 0.298039 0.14376 537.364 465.815 0.190511 0.298039 0.115709 528.025 514.762 0.167136 0.298039 0.139085 ST
499.456 456.848 0.181161 0.298039 0.12506 488.509 495.305 0.162461 0.298039 0.14376 479.653 444.977 0.167136 0.298039 0.139085 ST
872.259 162.542 0.101684 0.298039 0.204537 896.135 187.38 0.139085 0.298039 0.167136 850.079 176.714 0 0.253626 0.298039 ST
488.509 495.305 0.667138 1 0.590345 499.456 456.848 0.743931 1 0.513552 520.044 472.432 0.667138 1 0.590345 ST
796.22 565.971 0.273566 0.438738 0.177216 787.867 552.673 0.328623 0.438738 0.122158 813.375 577.477 0.280448 0.438738 0.170333 ST
1112.8 617.245 3.39324e-08 3.39324e-08 0.85057 1098.71 657.56 3.39324e-08 3.39324e-08 1 1088.62 627.015 3.39324e-08 3.39324e-08 0.683245 ST
1138.78 471.051 1.47921e-13 0.716538 1 1135.93 530.533 1.47921e-13 0.0809647 1 1123.58 502.574 1.47921e-13 0.165978 1 ST
917.866 175.651 0.31008 0.325393 0.024245 937.951 204.665 0.315185 0.325393 0.0191408 896.135 187.38 0.15185 0.325393 0.182475 ST
528.538 349.298 0 0.295702 0.298039 511.147 402.056 0.115709 0.298039 0.190511 492.078 391.186 0.13441 0.298039 0.171811 ST
1074.43 321.168 0.78647 0.533566 0 1094.76 325.248 0.78647 0.373188 0 1107.14 365.105 0.774133 0.78647 0.0339261 ST
1132.28 421.399 0.331886 0.972771 0.667588 1138.78 471.051 2.29689e-19 0.675217 0.972771 1115.3 461.366 2.29689e-19 0.553144 0.972771 ST
705.304 543.555 0.52213 0.597054 0.0913142 696.613 543.424 0.381646 0.597054 0.231798 668.276 529.276 0.456571 0.597054 0.156873 ST
1022.26 252.179 0.624963 0.188714 0 1074.02 285.546 0.624963 0.0220575 0 1045.68 295.276 0.624963 0.384781 0 ST
479.653 444.977 0.167136 0.298039 0.139085 511.147 402.056 0.115709 0.298039 0.190511 499.456 456.848 0.181161 0.298039 0.12506 ST
813.375 577.477 0.719748 1 0.437148 833.384 548.535 0.755073 1 0.401822 847.849 594.423 0.613773 1 0.543123 ST
721.859 176.076 0 0 0.204537 752.649 181.354 0 0 0.241938 694.8 197.805 0 0 0.167136 ST
787.867 552.673 0.511842 0.683349 0.190266 771.02 553.021 0.447527 0.683349 0.254581 745.995 535.611 0.533281 0.683349 0.168828 ST
833.384 548.535 0.811314 1 0.431752 852.765 551.639 0.678467 1 0.564599 813.375 577.477 0.773358 1 0.469708 ST
528.025 514.762 0.667949 1 0.555845 537.364 465.815 0.761368 1 0.462426 577.791 500.696 0.780052 1 0.443742 ST
994.8 219.469 0.519216 0.148638 0 1022.26 252.179 0.519216 0.156783 0 974.243 227.906 0.519216 0.376686 0 ST
1074.37 668.036 3.4204e-08 3.4204e-08 0.93099 1088.62 627.015 3.4204e-08 3.4204e-08 0.687716 1098.71 657.56 3.4204e-08 3.4204e-08 1 ST
974.243 227.906 0.421609 0.305873 0 937.951 204.665 0.408382 0.421609 0.0248005 959.075 195.073 0.421609 0.246352 0 ST
1074.02 285.546 0.670493 0.0236645 0 1074.43 321.168 0.670493 0.454883 0 1045.68 295.276 0.670493 0.412813 0 ST
745.995 535.611 0.904719 1 0.286419 733.223 555.75 0.777422 1 0.413716 705.304 543.555 1 1 0.177307 ST
1123.86 573.362 3.74726e-10 3.74726e-10 0.874956 1112.8 617.245 3.74726e-10 3.74726e-10 0.838308 1100.41 583.139 3.74726e-10 3.74726e-10 0.673395 ST
1135.93 530.533 1.75241e-12 0.0876999 1 1123.86 573.362 1.75241e-12 1.75241e-12 0.837534 1108.67 536.952 1.75241e-12 1.75241e-12 0.890154 ST
1084.97 546.005 7.31159e-05 0.266533 0.930858 1108.67 536.952 7.31159e-05 7.31159e-05 0.741051 1135.93 530.533 7.31159e-05 0.0730759 0.930858 ST
949.611 623.279 0.0257132 0.298039 0.280508 923.607 586.323 0.0829835 0.298039 0.223237 935.251 592.951 0.0409073 0.298039 0.265313 ST
1132.28 421.399 0.330372 0.968333 0.664542 1115.3 461.366 3.38975e-21 0.550621 0.968333 1112.15 404.802 0.345562 0.968333 0.649353 ST
1035.3 624.769 0 0.325387 0.761227 1088.62 627.015 0 0 0.438825 1074.37 668.036 0 0 0.594056 ST
654.2 214.24 0 0 0.176486 629.052 250.513 0 0 0.241938 602.933 241.808 0 0 0.269988 ST
870.465 583.33 0.347517 0.676464 0.347517 847.849 594.423 0.368739 0.676464 0.326294 833.384 548.535 0.453629 0.676464 0.241405 ST
1138.78 471.051 5.66407e-17 0.709507 1 1123.58 502.574 5.66407e-17 0.164349 1 1115.3 461.366 5.66407e-17 0.581235 1 ST
833.384 548.535 0.773172 1 0.411454 813.375 577.477 0.737001 1 0.447626 787.867 552.673 0.863602 1 0.321025 ST
543.653 304.168 0 0.192849 0.298039 560.04 325.07 0 0.206874 0.298039 528.538 349.298 0 0.295702 0.298039 ST
576.972 282.216 0 0.0759708 0.298039 560.04 325.07 0 0.206874 0.298039 543.653 304.168 0 0.192849 0.298039 ST
629.052 250.513 0 0 0.241938 576.972 282.216 0 0.0759708 0.298039 602.933 241.808 0 0 0.269988 ST
627.584 526.309 0.941126 1 0.323361 653.766 498.181 1 1 0.246141 668.276 529.276 0.941126 1 0.323361 ST
1135.93 530.533 2.45464e-13 0.0866115 1 1108.67 536.952 2.45464e-13 2.45464e-13 0.879106 1123.58 502.574 2.45464e-13 0.177553 1 ST
1100.41 583.139 4.43594e-10 4.43594e-10 0.680493 1112.8 617.245 4.43594e-10 4.43594e-10 0.847144 1088.62 627.015 4.43594e-10 4.43594e-10 0.680493 ST
1074.43 321.168 0.823084 0.558406 0 1107.14 365.105 0.810173 0.823084 0.0355056 1086.78 372.417 0.526128 0.823084 0.31955 ST
1112.15 404.802 0.315042 0.882811 0.592003 1086.78 372.417 0.564307 0.882811 0.342738 1107.14 365.105 0.868963 0.882811 0.038082 ST
801.875 172.814 0 0.085321 0.298039 850.079 176.714 0 0.253626 0.298039 826.303 198.105 0 0.150773 0.298039 ST
801.875 172.814 0 0.085321 0.298039 778.026 198.628 0 0.00935025 0.298039 752.649 181.354 0 0 0.241938 ST
694.8 197.805 0 0 0.167136 673.032 230.796 0 0 0.199862 654.2 214.24 0 0 0.176486 ST
949.611 623.279 0.0635708 0.736843 0.693499 935.251 592.951 0.101135 0.736843 0.655935 979.603 627.674 0 0.569247 0.736843 ST
896.135 187.38 0.15034 0.322157 0.18066 873.204 205.837 0.017687 0.322157 0.313313 850.079 176.714 0 0.274149 0.322157 ST
1123.86 573.362 2.93499e-12 2.93499e-12 0.85872 1100.41 583.139 2.93499e-12 2.93499e-12 0.660899 1108.67 536.952 2.93499e-12 2.93499e-12 0.912671 ST
1022.26 252.179 0.56709 0.171239 0 1001.31 264.726 0.56709 0.429209 0 974.243 227.906 0.56709 0.411418 0 ST
752.649 181.354 0 0 0.241938 727.01 210.832 0 0 0.218562 694.8 197.805 0 0 0.167136 ST
745.995 535.611 0.533281 0.683349 0.168828 768.524 537.764 0.640473 0.683349 0.0616354 787.867 552.673 0.511842 0.683349 0.190266 ST
540.576 375.951 0.064283 0.298039 0.241938 511.147 402.056 0.115709 0.298039 0.190511 528.538 349.298 0 0.295702 0.298039 ST
1022.26 252.179 0.651495 0.196726 0 1045.68 295.276 0.651495 0.401117 0 1001.31 264.726 0.651495 0.493092 0 ST
937.951 204.665 0.393188 0.405923 0.0238778 916.19 220.857 0.227635 0.405923 0.189431 896.135 187.38 0.189431 0.405923 0.227635 ST
745.995 535.611 0.944214 1 0.298922 705.304 543.555 1 1 0.185047 733.687 518.279 1 1 0.0901511 ST
668.276 529.276 0.55347 0.723768 0.190167 688.919 503.52 0.723768 0.723768 0.00851492 705.304 543.555 0.632942 0.723768 0.110694 ST
511.147 402.056 0.115709 0.298039 0.190511 526.048 430.066 0.190511 0.298039 0.115709 499.456 456.848 0.181161 0.298039 0.12506 ST
688.919 503.52 0.739062 0.739062 0.00869485 668.276 529.276 0.565165 0.739062 0.194185 653.766 498.181 0.611538 0.739062 0.147812 ST
654.2 214.24 0 0 0.176486 673.032 230.796 0 0 0.199862 629.052 250.513 0 0 0.241938 ST
1112.15 404.802 0.348218 0.975775 0.654343 1115.3 461.366 3.85051e-23 0.554852 0.975775 1100.05 420.413 0.0229594 0.975775 0.975775 ST
653.766 498.181 0.904874 1 0.21924 627.584 526.309 0.836311 1 0.287803 625.823 517.022 1 1 0.000694274 ST
546.257 497.222 0.244731 0.333724 0.0981542 537.364 465.815 0.213322 0.333724 0.129564 565.749 482.544 0.29708 0.333724 0.0458053 ST
974.243 227.906 0.498861 0.361918 0 953.312 242.436 0.444084 0.498861 0.0684711 937.951 204.665 0.48321 0.498861 0.0293447 ST
560.04 325.07 0 0.206874 0.298039 540.576 375.951 0.064283 0.298039 0.241938 528.538 349.298 0 0.295702 0.298039 ST
1112.15 404.802 0.331902 0.930054 0.623683 1100.05 420.413 0.0218836 0.930054 0.930054 1086.78 372.417 0.594505 0.930054 0.36108 ST
801.875 172.814 0 0.085321 0.298039 826.303 198.105 0 0.150773 0.298039 778.026 198.628 0 0.00935025 0.298039 ST
625.823 517.022 0.874015 0.870588 7.2175e-13 627.584 526.309 0.668364 0.874015 0.229643 584.729 517.355 0.750625 0.874015 0.147383 ST
1074.43 321.168 0.783832 0.531776 0 1057.42 340.864 0.685468 0.783832 0.11988 1045.68 295.276 0.783832 0.482594 0 ST
850.079 176.714 0 0.273679 0.321605 873.204 205.837 0.0176567 0.321605 0.312776 826.303 198.105 0 0.162694 0.321605 ST
694.8 197.805 0 0 0.167136 727.01 210.832 0 0 0.218562 673.032 230.796 0 0 0.199862 ST
752.649 181.354 0 0 0.241938 778.026 198.628 0 0.00935025 0.298039 727.01 210.832 0 0 0.218562 ST
916.631 617.896 0.116861 0.47301 0.369133 870.465 583.33 0.242997 0.47301 0.242997 888.665 591.934 0.228158 0.47301 0.257837 ST
1030.09 643.999 3.59702e-25 0.188693 0.844155 979.603 627.674 3.59702e-25 0.652151 0.844155 1012.44 626.032 3.59702e-25 0.254902 0.844155 ST
629.052 250.513 0 0 0.241938 603.208 294.282 0 0.0899962 0.298039 576.972 282.216 0 0.0759708 0.298039 ST
1074.43 321.168 0.83508 0.566544 0 1086.78 372.417 0.533796 0.83508 0.324207 1057.42 340.864 0.730285 0.83508 0.127718 ST
603.208 294.282 0 0.0899962 0.298039 560.04 325.07 0 0.206874 0.298039 576.972 282.216 0 0.0759708 0.298039 ST
584.729 517.355 0.743154 0.865316 0.145916 546.257 497.222 0.634565 0.865316 0.254505 565.749 482.544 0.770301 0.865316 0.118769 ST
1115.3 461.366 6.68844e-19 0.61751 1 1123.58 502.574 6.68844e-19 0.174606 1 1092.85 487.021 6.68844e-19 0.22571 1 ST
896.135 187.38 0.189042 0.405091 0.227169 916.19 220.857 0.227169 0.405091 0.189042 873.204 205.837 0.0222403 0.405091 0.393971 ST
1088.62 627.015 6.77665e-08 6.77665e-08 0.625132 1030.09 643.999 6.77665e-08 0.242398 1 1064.66 622.573 6.77665e-08 6.77665e-08 0.642142 ST
978.472 598.275 0 0.761903 1 979.603 627.674 0 0.777694 1 935.251 592.951 0.138169 1 0.896124 ST
540.576 375.951 0.064283 0.298039 0.241938 526.048 430.066 0.190511 0.298039 0.115709 511.147 402.056 0.115709 0.298039 0.190511 ST
768.524 537.764 0.609512 0.650316 0.058656 810.088 555.507 0.558507 0.650316 0.109661 787.867 552.673 0.487099 0.650316 0.181068 ST
1088.62 627.015 2.73312e-12 2.73312e-12 0.704834 1064.66 622.573 2.73312e-12 2.73312e-12 0.724013 1100.41 583.139 2.73312e-12 2.73312e-12 0.704834 ST
1092.85 487.021 7.63011e-18 0.231577 1 1123.58 502.574 7.63011e-18 0.179144 1 1108.67 536.952 7.63011e-18 7.63011e-18 0.886984 ST
935.251 592.951 0.172919 1 1 916.631 617.896 0.311255 1 0.98317 888.665 591.934 0.607688 1 0.686737 ST
870.465 583.33 0.218203 0.424746 0.218203 833.384 548.535 0.284829 0.424746 0.151576 857.02 558.285 0.318143 0.424746 0.118262 ST
974.243 227.906 0.585917 0.425077 0 1001.31 264.726 0.585917 0.443459 0 953.312 242.436 0.521581 0.585917 0.08042 ST
937.951 204.665 0.4829 0.498541 0.0293259 953.312 242.436 0.443799 0.498541 0.0684272 916.19 220.857 0.279574 0.498541 0.232652 ST
688.919 503.52 1 1 0.013625 733.687 518.279 1 1 0.0862915 705.304 543.555 1 1 0.177125 ST
653.766 498.181 0.810741 0.979805 0.195961 625.823 517.022 0.979805 0.975963 0 611.462 478.042 0.872219 0.979805 0.134483 ST
526.048 430.066 0.190511 0.298039 0.115709 525.974 479.323 0.269988 0.298039 0.0362322 499.456 456.848 0.181161 0.298039 0.12506 ST
978.472 598.275 0 0.568517 0.751149 1012.44 626.032 0 0.226818 0.751149 979.603 627.674 0 0.580299 0.751149 ST
584.729 517.355 1 1 0.204636 565.749 482.544 1 1 0.166564 611.462 478.042 1 1 0.166564 ST
625.823 517.022 0.767935 0.764923 0 584.729 517.355 0.65952 0.767935 0.129495 611.462 478.042 0.683612 0.767935 0.105403 ST
1100.41 583.139 5.61025e-15 5.61025e-15 0.685325 1076.43 576.876 5.61025e-15 5.61025e-15 0.74127 1108.67 536.952 5.61025e-15 5.61025e-15 0.946401 ST
1100.05 420.413 0.0243505 1 1 1115.3 461.366 1.31108e-24 0.58847 1 1084.56 438.81 1.31108e-24 0.750806 1 ST
1001.31 264.726 0.711164 0.538253 0 1045.68 295.276 0.711164 0.437854 0 1022.94 310.525 0.700008 0.711164 0.0306777 ST
1064.66 622.573 3.98368e-18 3.98368e-18 0.644463 1030.09 643.999 3.98368e-18 0.243274 1 1012.44 626.032 3.98368e-18 0.328633 1 ST
653.766 498.181 0.499209 0.60331 0.120662 611.462 478.042 0.537064 0.60331 0.0828073 652.354 493.482 0.60331 0.532332 3.07856e-21 ST
1022.94 310.525 0.772612 0.784925 0.0338595 1045.68 295.276 0.784925 0.483268 0 1057.42 340.864 0.686425 0.784925 0.120047 ST
673.032 230.796 0 0 0.199862 646.923 271.431 0 0.0233756 0.298039 629.052 250.513 0 0 0.241938 ST
1066.34 393.791 0.235639 0.953777 0.74432 1086.78 372.417 0.609669 0.953777 0.37029 1100.05 420.413 0.0224418 0.953777 0.953777 ST
653.766 498.181 0.599409 0.724404 0.144881 652.354 493.482 0.724404 0.63918 1.91953e-14 688.919 503.52 0.724404 0.724404 0.0085224 ST
888.665 591.934 0.213817 0.443279 0.24163 870.465 583.33 0.227724 0.443279 0.227724 857.02 558.285 0.332025 0.443279 0.123423 ST
888.665 591.934 0.602366 1 0.680723 897.278 552.734 0.582777 1 0.700312 935.251 592.951 0.171405 1 1 ST
560.04 325.07 0 0.206874 0.298039 586.748 340.828 0 0.272326 0.298039 540.576 375.951 0.064283 0.298039 0.241938 ST
1064.66 622.573 7.96731e-13 7.96731e-13 0.724352 1076.43 576.876 7.96731e-13 7.96731e-13 0.762728 1100.41 583.139 7.96731e-13 7.96731e-13 0.705164 ST
1115.3 461.366 1.42448e-23 0.603723 1 1092.85 487.021 1.42448e-23 0.220671 1 1084.56 438.81 1.42448e-23 0.770267 1 ST
629.052 250.513 0 0 0.241938 646.923 271.431 0 0.0233756 0.298039 603.208 294.282 0 0.0899962 0.298039 ST
816.861 517.772 0.797127 0.981968 0.211797 854.643 523.888 0.673899 0.981968 0.335024 810.088 555.507 0.843337 0.981968 0.165587 ST
1086.78 372.417 0.585242 0.915563 0.355454 1066.34 393.791 0.226198 0.915563 0.714498 1057.42 340.864 0.800669 0.915563 0.140027 ST
1023.69 586.253 0 0.250265 0.924892 1012.44 626.032 0 0.279281 0.924892 978.472 598.275 0 0.700016 0.924892 ST
603.208 294.282 0 0.0899962 0.298039 586.748 340.828 0 0.272326 0.298039 560.04 325.07 0 0.206874 0.298039 ST
1108.67 536.952 3.26654e-18 3.26654e-18 0.904203 1085.11 530.199 3.26654e-18 3.26654e-18 0.957653 1092.85 487.021 3.26654e-18 0.236073 1 ST
727.01 210.832 0 0 0.218562 706.915 246.156 0 0 0.288689 673.032 230.796 0 0 0.199862 ST
778.026 198.628 0 0.00935025 0.298039 757.431 230.726 0 0.0280508 0.298039 727.01 210.832 0 0 0.218562 ST
1076.43 576.876 1.96778e-15 1.96778e-15 0.740638 1085.11 530.199 1.96778e-15 1.96778e-15 1 1108.67 536.952 1.96778e-15 1.96778e-15 0.945594 ST
826.303 198.105 0 0.172178 0.340351 805.784 227.552 0 0.145483 0.340351 778.026 198.628 0 0.0106777 0.340351 ST
1064.66 622.573 0 0 0.634977 1012.44 626.032 0 0.323796 1 1023.69 586.253 0 0.290155 1 ST
587.107 477.275 0.894653 0.817467 8.59996e-08 611.462 478.042 0.796417 0.894653 0.122796 565.749 482.544 0.796417 0.894653 0.122796 ST
873.204 205.837 0.0223764 0.40757 0.396382 852.8 231.054 0 0.353227 0.40757 826.303 198.105 0 0.206183 0.40757 ST
935.251 592.951 0.0547997 0.399255 0.355415 897.278 552.734 0.186319 0.399255 0.223896 935.604 586.533 0.0610625 0.399255 0.349152 ST
1001.31 264.726 0.64445 0.48776 0 980.548 284.626 0.573687 0.64445 0.0884539 953.312 242.436 0.573687 0.64445 0.0884539 ST
1066.34 393.791 0.244644 0.990226 0.772764 1100.05 420.413 0.0232994 0.990226 0.990226 1084.56 438.81 2.00331e-35 0.718399 0.990226 ST
540.576 375.951 0.064283 0.298039 0.241938 570.21 392.822 0.162461 0.298039 0.14376 526.048 430.066 0.190511 0.298039 0.115709 ST
916.19 220.857 0.274856 0.490127 0.228726 896.156 243.962 0.144155 0.490127 0.359427 873.204 205.837 0.0269089 0.490127 0.476673 ST
954.374 610.028 0 0.285369 0.312314 935.251 592.951 0.0428666 0.312314 0.278021 935.604 586.533 0.0477657 0.312314 0.273122 ST
1001.31 264.726 0.720236 0.54512 0 1022.94 310.525 0.708938 0.720236 0.031069 980.548 284.626 0.641151 0.720236 0.0988559 ST
953.312 242.436 0.508306 0.571005 0.0783732 933.87 263.539 0.347081 0.571005 0.239598 916.19 220.857 0.320211 0.571005 0.266469 ST
888.665 591.934 0.590308 1 0.667096 857.02 558.285 0.916656 1 0.340747 897.278 552.734 0.571111 1 0.686293 ST
706.915 246.156 0 0 0.288689 646.923 271.431 0 0.0233756 0.298039 673.032 230.796 0 0 0.199862 ST
565.749 482.544 1 1 0.161512 525.974 479.323 1 1 0.143054 557.167 447.649 1 1 0.0138439 ST
557.167 447.649 0.318321 0.318321 0.00374495 525.974 479.323 0.288361 0.318321 0.0386978 526.048 430.066 0.203476 0.318321 0.123583 ST
727.01 210.832 0 0 0.218562 757.431 230.726 0 0.0280508 0.298039 706.915 246.156 0 0 0.288689 ST
757.431 230.726 0 0.0315415 0.335128 778.026 198.628 0 0.0105138 0.335128 805.784 227.552 0 0.143251 0.335128 ST
1057.42 340.864 0.750332 0.858003 0.131224 1035.27 362.761 0.440778 0.858003 0.440778 1022.94 310.525 0.844544 0.858003 0.0370119 ST
586.748 340.828 0 0.272326 0.298039 570.21 392.822 0.162461 0.298039 0.14376 540.576 375.951 0.064283 0.298039 0.241938 ST
826.303 198.105 0 0.20369 0.402643 852.8 231.054 0 0.348958 0.402643 805.784 227.552 0 0.17211 0.402643 ST
1035.27 362.761 0.470865 0.91657 0.470865 1057.42 340.864 0.801549 0.91657 0.140181 1066.34 393.791 0.226447 0.91657 0.715284 ST
873.204 205.837 0.0268423 0.488913 0.475492 896.156 243.962 0.143798 0.488913 0.358536 852.8 231.054 0 0.423725 0.488913 ST
810.088 555.507 0.802074 0.933921 0.157485 821.297 530.864 0.919272 0.933921 0.0402868 857.02 558.285 0.699525 0.933921 0.260033 ST
587.107 477.275 0.750566 0.685811 0 565.749 482.544 0.668151 0.750566 0.103019 557.167 447.649 0.750566 0.750566 0.00883019 ST
1064.66 622.573 9.8249e-16 9.8249e-16 0.741931 1036.76 611.148 9.8249e-16 9.8249e-16 1 1076.43 576.876 9.8249e-16 9.8249e-16 0.781239 ST
646.923 271.431 0 0.0233756 0.298039 628.392 315.848 0 0.202199 0.298039 603.208 294.282 0 0.0899962 0.298039 ST
1084.56 438.81 4.93172e-27 0.794783 1 1092.85 487.021 4.93172e-27 0.227695 1 1065.2 471.795 4.93172e-27 0.451093 1 ST
980.548 284.626 0.58641 0.658742 0.0904156 933.87 263.539 0.400412 0.658742 0.276413 953.312 242.436 0.58641 0.658742 0.0904156 ST
916.19 220.857 0.319173 0.569155 0.265606 933.87 263.539 0.345957 0.569155 0.238822 896.156 243.962 0.167398 0.569155 0.41738 ST
685.221 497.952 0.735818 0.48766 3.2367e-14 688.919 503.52 0.735818 0.735818 0.00865668 652.354 493.482 0.735818 0.649251 3.2367e-14 ST
603.208 294.282 0 0.0899962 0.298039 628.392 315.848 0 0.202199 0.298039 586.748 340.828 0 0.272326 0.298039 ST
570.21 392.822 0.162461 0.298039 0.14376 557.167 447.649 0.298039 0.298039 0.00350634 526.048 430.066 0.190511 0.298039 0.115709 ST
810.088 555.507 1 1 0.200193 784.438 547.794 1 1 8.54964e-10 821.297 530.864 1 1 0.0512121 ST
716.187 530.275 0.308834 0.243434 0 688.919 503.52 0.308834 0.308834 0.00363335 685.221 497.952 0.308834 0.204678 0 ST
1056.82 515.673 3.52567e-23 0.109 1 1092.85 487.021 3.52567e-23 0.240709 1 1085.11 530.199 3.52567e-23 3.52567e-23 0.97646 ST
1076.43 576.876 3.35772e-19 3.35772e-19 0.75713 1048.35 563.795 3.35772e-19 3.35772e-19 1 1085.11 530.199 3.35772e-19 3.35772e-19 1 ST
935.604 586.533 0.102347 0.669194 0.585217 897.278 552.734 0.31229 0.669194 0.375273 927.458 541.487 0.207319 0.669194 0.480245 ST
1046.08 417.185 0 1 1 1066.34 393.791 0.255078 1 0.805724 1084.56 438.81 0 0.749039 1 ST
980.548 284.626 0.707702 0.794996 0.109117 1022.94 310.525 0.782525 0.794996 0.0342939 999.698 333.989 0.520644 0.794996 0.296175 ST
897.278 552.734 0.420249 0.900532 0.505005 857.02 558.285 0.674516 0.900532 0.250737 886.097 550.706 0.632139 0.900532 0.293115 ST
954.374 610.028 0 0.457486 0.500682 935.604 586.533 0.0765749 0.500682 0.437851 959.329 598.711 0 0.433924 0.500682 ST
646.923 271.431 0 0.0233756 0.298039 706.915 246.156 0 0 0.288689 678.223 288.941 0 0.132072 0.298039 ST
999.698 333.989 0.564918 0.862599 0.32136 1022.94 310.525 0.849068 0.862599 0.0372101 1035.27 362.761 0.443139 0.862599 0.443139 ST
1092.85 487.021 3.47367e-24 0.239236 1 1056.82 515.673 3.47367e-24 0.108333 1 1065.2 471.795 3.47367e-24 0.473958 1 ST
1048.35 563.795 2.38758e-17 2.38758e-17 1 1076.43 576.876 2.38758e-17 2.38758e-17 0.780679 1036.76 611.148 2.38758e-17 2.38758e-17 1 ST
1046.08 417.185 2.69547e-37 1 1 1084.56 438.81 2.69547e-37 0.775989 1 1065.2 471.795 2.69547e-37 0.440426 1 ST
752.479 538.578 1 0.812293 0 791.987 502.356 1 0.974751 0 784.438 547.794 1 0.891541 0 ST
994.352 599.407 1.31088e-09 0.487885 1 954.374 610.028 1.31088e-09 0.939481 1 959.329 598.711 1.31088e-09 0.891096 1 ST
1035.27 362.761 0.504655 0.982343 0.504655 1066.34 393.791 0.242696 0.982343 0.766613 1046.08 417.185 0 0.959229 0.982343 ST
784.438 547.794 1 0.941578 0 791.987 502.356 1 1 0 821.297 530.864 1 1 0.0460327 ST
678.223 288.941 0 0.140816 0.31777 628.392 315.848 0 0.215585 0.31777 646.923 271.431 0 0.0249231 0.31777 ST
1056.82 515.673 1.02622e-20 0.113798 1 1085.11 530.199 1.02622e-20 1.02622e-20 1 1048.35 563.795 1.02622e-20 1.02622e-20 1 ST
757.431 230.726 0 0.0346996 0.368683 730.848 270.356 0 0.151811 0.368683 706.915 246.156 0 0 0.357117 ST
897.278 552.734 0.441319 0.945675 0.530323 886.097 550.706 0.663829 0.945675 0.307813 927.458 541.487 0.292979 0.945675 0.678663 ST
716.187 530.275 0.969741 0.764384 1.06643e-36 727.905 508.366 0.969741 0.566633 1.06643e-36 752.479 538.578 0.969741 0.779595 1.06643e-36 ST
586.748 340.828 0 0.301997 0.330512 609.653 366.04 0.128316 0.330512 0.211268 570.21 392.822 0.180161 0.330512 0.159423 ST
618.641 489.961 0.700397 0.475171 0 587.107 477.275 0.700397 0.639971 0 615.699 449.415 0.700397 0.607011 0 ST
757.431 230.726 0 0.0407565 0.433038 805.784 227.552 0 0.185103 0.433038 779.625 264.057 0 0.259823 0.433038 ST
980.548 284.626 0.646429 0.726165 0.0996697 958.952 309.242 0.464176 0.726165 0.281923 933.87 263.539 0.441394 0.726165 0.304705 ST
628.392 315.848 0 0.222669 0.328212 609.653 366.04 0.127423 0.328212 0.209798 586.748 340.828 0 0.299895 0.328212 ST
645.979 465.406 1 0.819291 8.98988e-13 652.354 493.482 1 1 8.98988e-13 618.641 489.961 1 0.838683 8.98988e-13 ST
852.8 231.054 0 0.433304 0.499966 827.915 264.558 0 0.441146 0.499966 805.784 227.552 0 0.213711 0.499966 ST
685.221 497.952 0.770475 0.510628 0 652.354 493.482 0.770475 0.679831 0 645.979 465.406 0.770475 0.510628 0 ST
927.458 541.487 0.281118 0.907406 0.651197 968.369 557.787 0 0.814886 0.907406 935.604 586.533 0.13878 0.907406 0.793535 ST
896.156 243.962 0.167624 0.56992 0.417941 873.885 271.931 0.113984 0.56992 0.471581 852.8 231.054 0 0.493931 0.56992 ST
716.187 530.275 0.905425 0.713688 0 685.221 497.952 0.905425 0.600066 0 727.905 508.366 0.905425 0.529052 0 ST
935.604 586.533 0.0587337 0.384028 0.335836 968.369 557.787 0 0.344872 0.384028 959.329 598.711 0 0.332824 0.384028 ST
933.87 263.539 0.396556 0.652398 0.273751 914.012 289.673 0.304453 0.652398 0.365855 896.156 243.962 0.191882 0.652398 0.478425 ST
980.548 284.626 0.714778 0.802944 0.110208 999.698 333.989 0.52585 0.802944 0.299136 958.952 309.242 0.513255 0.802944 0.311731 ST
557.167 447.649 0.427792 0.427792 0.00503284 591.553 472.704 0.427792 0.202991 0 587.107 477.275 0.427792 0.390884 0 ST
570.21 392.822 0.211618 0.388219 0.187259 594.545 419.763 0.388219 0.386697 0 557.167 447.649 0.388219 0.388219 0.00456728 ST
706.915 246.156 0 0 0.363609 730.848 270.356 0 0.154571 0.375386 678.223 288.941 0 0.166348 0.375386 ST
994.352 599.407 3.75368e-36 0.594409 1 959.329 598.711 3.75368e-36 1 1 968.369 557.787 3.75368e-36 1 1 ST
791.987 502.356 0.828019 0.798795 0 845.204 509.508 0.828019 0.824772 0 821.297 530.864 0.815031 0.828019 0.0357185 ST
994.352 599.407 2.93014e-19 0.356353 0.750992 1005.27 594.242 2.93014e-19 0.191429 0.750992 1036.76 611.148 2.93014e-19 2.93014e-19 0.621409 ST
587.107 477.275 1 0.915653 0.0219348 591.553 472.704 1 0.486055 0.0219348 615.699 449.415 1 0.869625 0.0219348 ST
857.02 558.285 0.676216 0.902802 0.251368 846.19 554.971 0.902802 0.899261 1.53298e-07 886.097 550.706 0.633731 0.902802 0.293853 ST
757.431 230.726 0 0.0402334 0.427479 779.625 264.057 0 0.256488 0.427479 730.848 270.356 0 0.176021 0.427479 ST
1012.69 388.561 0.274849 0.987133 0.739382 1035.27 362.761 0.507115 0.987133 0.507115 1046.08 417.185 0 0.963906 0.987133 ST
1035.27 362.761 0.476423 0.927388 0.476423 1012.69 388.561 0.258214 0.927388 0.694632 999.698 333.989 0.607348 0.927388 0.345497 ST
645.979 465.406 0.833133 0.552155 0 618.641 489.961 0.833133 0.565224 0 615.699 449.415 0.833133 0.722049 0 ST
1046.08 417.185 0 1 1 1065.2 471.795 0 0.446945 1 1033.53 451.943 0 0.804501 1 ST
609.653 366.04 0.154274 0.397372 0.254007 594.545 419.763 0.397372 0.395814 0 570.21 392.822 0.216607 0.397372 0.191674 ST
805.784 227.552 0 0.210662 0.492834 827.915 264.558 0 0.434854 0.492834 779.625 264.057 0 0.295701 0.492834 ST
852.8 231.054 0 0.491874 0.567547 873.885 271.931 0.113509 0.567547 0.469617 827.915 264.558 0 0.500777 0.567547 ST
1005.27 594.242 8.27352e-21 0.322781 1 1048.35 563.795 8.27352e-21 8.27352e-21 1 1036.76 611.148 8.27352e-21 8.27352e-21 1 ST
933.87 263.539 0.443509 0.729645 0.306165 958.952 309.242 0.4664 0.729645 0.283274 914.012 289.673 0.340501 0.729645 0.409173 ST
968.369 557.787 0 0.402164 0.447825 1005.27 594.242 0 0.114151 0.447825 994.352 599.407 0 0.212497 0.447825 ST
896.156 243.962 0.190068 0.646231 0.473903 914.012 289.673 0.301574 0.646231 0.362396 873.885 271.931 0.129246 0.646231 0.534725 ST
727.905 508.366 0.55893 0.32659 0 764.784 532.815 0.55893 0.273985 0 752.479 538.578 0.55893 0.449336 0 ST
1056.82 515.673 5.31612e-32 0.109236 1 1024.57 496.29 5.31612e-32 0.587141 1 1065.2 471.795 5.31612e-32 0.477906 1 ST
678.223 288.941 0 0.172553 0.389389 664.106 335.098 0.0534455 0.389389 0.346632 628.392 315.848 0 0.264173 0.389389 ST
845.204 509.508 0.385534 0.384022 0 846.19 554.971 0.385534 0.384022 0 821.297 530.864 0.379486 0.385534 0.0166309 ST
1048.35 563.795 7.54914e-26 7.54914e-26 1 1016.24 545.798 7.54914e-26 0.388057 1 1056.82 515.673 7.54914e-26 0.11498 1 ST
628.392 315.848 0 0.279021 0.411274 664.106 335.098 0.0564494 0.411274 0.366114 609.653 366.04 0.159671 0.411274 0.262893 ST
594.545 419.763 0.468989 0.467149 0 591.553 472.704 0.468989 0.22254 0 557.167 447.649 0.468989 0.468989 0.00551751 ST
1046.08 417.185 0 1 1 1033.53 451.943 0 0.782634 1 1012.69 388.561 0.294006 1 0.790916 ST
1024.57 496.29 2.41472e-35 0.580537 1 1033.53 451.943 2.41472e-35 0.850554 1 1065.2 471.795 2.41472e-35 0.47253 1 ST
927.458 541.487 0.232428 0.750243 0.53841 948.916 536.517 0.13828 0.750243 0.632558 968.369 557.787 2.60588e-36 0.673748 0.750243 ST
791.987 502.356 1 1 4.40645e-23 764.784 532.815 1 0.543782 4.40645e-23 765.615 494.29 1 0.700391 4.40645e-23 ST
999.698 333.989 0.572341 0.873933 0.325583 976.106 366.107 0.407836 0.873933 0.490088 958.952 309.242 0.558632 0.873933 0.339292 ST
727.905 508.366 0.84825 0.495644 1.29825e-29 685.221 497.952 0.84825 0.562174 1.29825e-29 703.85 483.234 0.84825 0.269444 1.29825e-29 ST
730.848 270.356 0 0.183125 0.444732 714.902 314.31 0.0034881 0.444732 0.444732 678.223 288.941 0 0.197077 0.444732 ST
976.106 366.107 0.433554 0.929045 0.520994 999.698 333.989 0.608434 0.929045 0.346115 1012.69 388.561 0.258675 0.929045 0.695873 ST
1005.27 594.242 5.10983e-24 0.320399 1 1016.24 545.798 5.10983e-24 0.399266 1 1048.35 563.795 5.10983e-24 5.10983e-24 1 ST
1016.24 545.798 1.16479e-29 0.384014 1 1024.57 496.29 1.16479e-29 0.611578 1 1056.82 515.673 1.16479e-29 0.113782 1 ST
645.979 465.406 0.657968 0.436065 0 615.699 449.415 0.657968 0.570239 0 632.97 441.003 0.657968 0.312212 0 ST
765.615 494.29 0.767174 0.484373 0 764.784 532.815 0.767174 0.376066 0 727.905 508.366 0.767174 0.448271 0 ST
958.952 309.242 0.511191 0.799716 0.310478 939.864 338.814 0.435924 0.799716 0.385745 914.012 289.673 0.373201 0.799716 0.448468 ST
648.293 386.244 0.429744 0.482752 0.0662601 594.545 419.763 0.482752 0.480859 0 609.653 366.04 0.187421 0.482752 0.308583 ST
678.223 288.941 0 0.203706 0.459692 714.902 314.31 0.00360542 0.459692 0.459692 664.106 335.098 0.0630949 0.459692 0.409216 ST
779.625 264.057 0 0.310685 0.517809 762.709 305.248 0.0203062 0.517809 0.511717 730.848 270.356 0 0.213215 0.517809 ST
669.171 488.032 0.983463 0.374102 2.30143e-12 703.85 483.234 0.983463 0.312394 2.30143e-12 685.221 497.952 0.983463 0.651785 2.30143e-12 ST
997.75 427.854 0.124259 1 0.956796 1012.69 388.561 0.29408 1 0.791117 1033.53 451.943 0 0.782833 1 ST
827.915 264.558 0 0.518008 0.587076 810.481 302.489 0.0989971 0.587076 0.504194 779.625 264.057 0 0.352245 0.587076 ST
765.615 494.29 1 0.735104 4.29168e-21 727.905 508.366 1 0.680314 4.29168e-21 703.85 483.234 1 0.369835 4.29168e-21 ST
873.885 271.931 0.130535 0.652674 0.540056 856.593 307.438 0.222677 0.652674 0.447914 827.915 264.558 0 0.575889 0.652674 ST
914.012 289.673 0.340211 0.729025 0.408826 896.909 320.816 0.351647 0.729025 0.39739 873.885 271.931 0.145805 0.729025 0.603232 ST
664.106 335.098 0.0633948 0.461876 0.41116 648.293 386.244 0.41116 0.461876 0.0633948 609.653 366.04 0.179317 0.461876 0.295239 ST
958.952 309.242 0.560878 0.877448 0.340656 976.106 366.107 0.409476 0.877448 0.492059 939.864 338.814 0.478295 0.877448 0.42324 ST
846.19 554.971 1 1 1.19302e-13 873.914 526.681 1 1 1.19302e-13 886.097 550.706 0.808619 1 0.374946 ST
594.545 419.763 0.54024 0.538121 0 632.97 441.003 0.54024 0.256349 0 591.553 472.704 0.54024 0.256349 0 ST
714.902 314.31 0.00406516 0.518308 0.518308 730.848 270.356 0 0.213421 0.518308 762.709 305.248 0.0203258 0.518308 0.51221 ST
1012.69 388.561 0.281247 1 0.756594 997.75 427.854 0.118837 1 0.915043 976.106 366.107 0.471386 1 0.566455 ST
845.204 509.508 0.413201 0.41158 0 873.914 526.681 0.413201 0.405099 0 846.19 554.971 0.413201 0.41158 0 ST
988.763 472.062 0 1 1 1033.53 451.943 0 0.843318 1 1024.57 496.29 0 0.575598 1 ST
914.012 289.673 0.375706 0.805083 0.451478 939.864 338.814 0.438849 0.805083 0.388334 896.909 320.816 0.388334 0.805083 0.438849 ST
779.625 264.057 0 0.349704 0.582839 810.481 302.489 0.0982827 0.582839 0.500556 762.709 305.248 0.0228564 0.582839 0.575983 ST
873.885 271.931 0.144867 0.724334 0.599351 896.909 320.816 0.349385 0.724334 0.394833 856.593 307.438 0.247126 0.724334 0.497092 ST
1016.24 545.798 5.41725e-30 0.399874 1 1005.27 594.242 5.41725e-30 0.320886 1 970.818 571.625 5.41725e-30 1 1 ST
827.915 264.558 0 0.580521 0.657924 856.593 307.438 0.224468 0.657924 0.451516 810.481 302.489 0.110944 0.657924 0.56504 ST
648.293 386.244 0.468317 0.526083 0.0722074 632.97 441.003 0.526083 0.249631 0 594.545 419.763 0.526083 0.524019 0 ST
997.75 427.854 0.131471 1 1 1033.53 451.943 0 0.828267 1 988.763 472.062 0 1 1 ST
873.914 526.681 0.595721 0.58404 0 905.664 553.307 0.390139 0.595721 0.221935 886.097 550.706 0.418173 0.595721 0.193901 ST
980.716 522.534 0 1 1 1024.57 496.29 0 0.610783 1 1016.24 545.798 0 0.383515 1 ST
845.204 509.508 1 1 2.76559e-07 805.924 525.319 1 0.786009 2.76559e-07 819.748 505.494 1 0.64062 2.76559e-07 ST
664.106 335.098 0.0744957 0.542754 0.483158 714.902 314.31 0.00425689 0.542754 0.542754 697.182 363.414 0.39802 0.542754 0.159634 ST
741.5 485.22 0.830381 0.211666 5.24363e-13 765.615 494.29 0.830381 0.52428 5.24363e-13 703.85 483.234 0.830381 0.263768 5.24363e-13 ST
664.106 335.098 0.074028 0.539347 0.480125 697.182 363.414 0.395521 0.539347 0.158631 648.293 386.244 0.480125 0.539347 0.074028 ST
959.698 401.475 0.439696 1 0.598145 976.106 366.107 0.471386 1 0.566455 997.75 427.854 0.118837 1 0.915043 ST
939.864 338.814 0.510204 0.935986 0.451475 976.106 366.107 0.436793 0.935986 0.524886 923.82 373.313 0.568933 0.935986 0.392747 ST
988.763 472.062 0 1 1 1024.57 496.29 0 0.599914 1 980.716 522.534 0 1 1 ST
980.716 522.534 6.61253e-36 1 1 1016.24 545.798 6.61253e-36 0.394645 1 970.818 571.625 6.61253e-36 1 1 ST
939.864 338.814 0.474511 0.870505 0.419891 923.82 373.313 0.529131 0.870505 0.365271 896.909 320.816 0.419891 0.870505 0.474511 ST
703.85 483.234 1 0.321601 3.24293e-15 669.171 488.032 1 0.385128 3.24293e-15 675.341 469.46 0.984656 3.24293e-15 3.24293e-15 ST
714.902 314.31 0.0047726 0.608506 0.608506 762.709 305.248 0.023863 0.608506 0.601347 744.601 352.342 0.408057 0.608506 0.217153 ST
923.82 373.313 0.576987 0.949237 0.398307 976.106 366.107 0.442977 0.949237 0.532317 959.698 401.475 0.413197 0.949237 0.562097 ST
669.171 488.032 1 0.427021 1.60931e-07 631.343 494.703 1 1.60931e-07 1.60931e-07 675.341 469.46 1 1.60931e-07 1.60931e-07 ST
819.748 505.494 1 0.61843 6.8481e-17 805.924 525.319 1 0.758782 6.8481e-17 778.592 508.866 1 0.337724 6.8481e-17 ST
905.664 553.307 0.604783 0.923171 0.344284 934.739 541.774 0.431117 0.923171 0.51795 948.916 536.517 0.170618 0.923171 0.778449 ST
896.909 320.816 0.390159 0.808867 0.440912 881.95 357.255 0.542417 0.808867 0.288655 856.593 307.438 0.275966 0.808867 0.555105 ST
679.851 416.531 0.606346 0.344785 0 632.97 441.003 0.606346 0.287717 0 648.293 386.244 0.539767 0.606346 0.083224 ST
810.481 302.489 0.113865 0.675244 0.579915 792.338 346.962 0.442218 0.675244 0.251561 762.709 305.248 0.0264801 0.675244 0.6673 ST
714.902 314.31 0.00476276 0.607252 0.607252 744.601 352.342 0.407216 0.607252 0.216706 697.182 363.414 0.445318 0.607252 0.178604 ST
856.593 307.438 0.2528 0.740965 0.508506 839.101 347.168 0.48526 0.740965 0.276046 810.481 302.489 0.124947 0.740965 0.636359 ST
997.75 427.854 0.129261 1 0.995306 988.763 472.062 0 1 1 949.612 442.393 0.495499 1 0.633377 ST
959.698 401.475 0.465644 1 0.633444 997.75 427.854 0.12585 1 0.969044 949.612 442.393 0.482424 1 0.616664 ST
697.182 363.414 0.447488 0.610211 0.179474 679.851 416.531 0.610211 0.346982 0 648.293 386.244 0.543207 0.610211 0.0837544 ST
896.909 320.816 0.420687 0.872157 0.475411 923.82 373.313 0.530134 0.872157 0.365964 881.95 357.255 0.584858 0.872157 0.31124 ST
675.341 469.46 0.668688 0 0 631.343 494.703 0.679473 0 0 632.97 441.003 0.687562 0.326255 0 ST
905.664 553.307 0.600306 0.916635 0.341491 873.914 526.681 0.916635 0.898662 0 934.739 541.774 0.427763 0.916635 0.514035 ST
762.709 305.248 0.0263049 0.670775 0.662883 792.338 346.962 0.439292 0.670775 0.249896 744.601 352.342 0.449814 0.670775 0.239375 ST
856.593 307.438 0.275358 0.807083 0.55388 881.95 357.255 0.54122 0.807083 0.288018 839.101 347.168 0.52856 0.807083 0.300678 ST
810.481 302.489 0.123848 0.73445 0.630763 839.101 347.168 0.480992 0.73445 0.273618 792.338 346.962 0.480992 0.73445 0.273618 ST
934.739 541.774 0.573848 1 0.689582 980.716 522.534 0 1 1 970.818 571.625 0 1 1 ST
942.933 492.745 0.528899 1 0.676071 988.763 472.062 0 1 1 980.716 522.534 0 1 1 ST
679.851 416.531 0.683204 0.388488 0 675.341 469.46 0.664449 0 0 632.97 441.003 0.683204 0.324187 0 ST
703.85 483.234 0.956182 0.303728 0 719.415 453.529 0.956182 0.0637455 0 741.5 485.22 0.956182 0.243733 0 ST
923.82 373.313 0.609852 1 0.420995 959.698 401.475 0.436733 1 0.594114 906.11 412.051 0.782971 1 0.247875 ST
949.612 442.393 0.512541 1 0.655161 988.763 472.062 0 1 1 942.933 492.745 0.512541 1 0.655161 ST
744.601 352.342 0.458822 0.684209 0.244169 726.701 403.684 0.684209 0.442723 0 697.182 363.414 0.501753 0.684209 0.201238 ST
959.698 401.475 0.449817 1 0.611913 949.612 442.393 0.466027 1 0.595704 906.11 412.051 0.806429 1 0.255302 ST
726.701 403.684 0.674846 0.436665 0 679.851 416.531 0.674846 0.383736 0 697.182 363.414 0.494887 0.674846 0.198484 ST
703.85 483.234 1 0.36501 1.11405e-14 675.341 469.46 1 1.11405e-14 1.11405e-14 719.415 453.529 1 0.0766071 1.11405e-14 ST
881.95 357.255 0.631622 0.941893 0.336126 923.82 373.313 0.572523 0.941893 0.395226 906.11 412.051 0.735046 0.941893 0.232703 ST
942.933 492.745 0.541048 1 0.691601 980.716 522.534 0 1 1 934.739 541.774 0.559867 1 0.672782 ST
778.592 508.866 0.495734 0.149692 2.57116e-31 741.5 485.22 0.495734 0.126364 2.57116e-31 759.856 493.644 0.410196 2.57116e-31 2.57116e-31 ST
881.95 357.255 0.58725 0.875723 0.312513 866.545 397.319 0.834513 0.875723 0.06525 839.101 347.168 0.573513 0.875723 0.32625 ST
792.338 346.962 0.493773 0.753965 0.280889 774.297 396.391 0.753965 0.570648 0 744.601 352.342 0.5056 0.753965 0.269062 ST
934.739 541.774 0.41645 0.892393 0.50044 873.914 526.681 0.892393 0.874895 0 892.412 510.897 0.892393 0.846898 0 ST
819.748 505.494 1 0.598193 2.58213e-14 778.592 508.866 1 0.326673 2.58213e-14 806.168 486.911 1 0.140003 2.58213e-14 ST
839.101 347.168 0.536128 0.818639 0.304983 822.006 392.38 0.818639 0.748011 0 792.338 346.962 0.536128 0.818639 0.304983 ST
679.851 416.531 0.75273 0.428023 0 719.415 453.529 0.75273 0.050182 0 675.341 469.46 0.732067 0 0 ST
881.95 357.255 0.633594 0.944834 0.337176 906.11 412.051 0.737341 0.944834 0.23343 866.545 397.319 0.900371 0.944834 0.0703994 ST
744.601 352.342 0.500453 0.74629 0.266323 774.297 396.391 0.74629 0.564839 0 726.701 403.684 0.74629 0.482893 0 ST
899.9 462.142 1 1 0.0827589 949.612 442.393 0.500909 1 0.640293 942.933 492.745 0.500909 1 0.640293 ST
726.701 403.684 0.752267 0.486761 0 719.415 453.529 0.752267 0.0501511 0 679.851 416.531 0.752267 0.42776 0 ST
906.11 412.051 0.832248 1 0.263475 949.612 442.393 0.480947 1 0.614776 899.9 462.142 1 1 0.0794608 ST
839.101 347.168 0.573 0.874941 0.325958 866.545 397.319 0.833767 0.874941 0.0651917 822.006 392.38 0.874941 0.799456 0 ST
892.412 510.897 1 1 0 942.933 492.745 0.529626 1 0.677 934.739 541.774 0.548047 1 0.658578 ST
792.338 346.962 0.530488 0.810027 0.301775 822.006 392.38 0.810027 0.740142 0 774.297 396.391 0.810027 0.613079 0 ST
719.415 453.529 0.417669 0.0278446 0 759.856 493.644 0.345601 0 0 741.5 485.22 0.417669 0.106465 0 ST
873.914 526.681 1 1 3.28771e-05 841.848 532.985 1 0.337724 3.28771e-05 892.412 510.897 1 1 3.28771e-05 ST
899.9 462.142 1 1 0.08481 942.933 492.745 0.513324 1 0.656162 892.412 510.897 1 1 0 ST
866.545 397.319 0.958208 1 0.0749216 906.11 412.051 0.784705 1 0.248424 856.832 441.092 1 0.761046 0 ST
850.028 486.315 0.298039 0.150773 0 841.848 532.985 0.298039 0.0946713 0 819.748 505.494 0.298039 0.164798 0 ST
759.856 493.644 0.898804 4.47252e-13 4.47252e-13 806.168 486.911 1 0.140571 4.47252e-13 778.592 508.866 1 0.327999 4.47252e-13 ST
774.297 396.391 0.825516 0.624802 0 765.762 444.366 0.825516 0.197476 0 726.701 403.684 0.825516 0.534157 0 ST
726.701 403.684 0.825622 0.534226 0 765.762 444.366 0.825622 0.197502 0 719.415 453.529 0.825622 0.0550415 0 ST
906.11 412.051 0.806409 1 0.255295 899.9 462.142 0.98471 1 0.0769938 856.832 441.092 1 0.782095 0 ST
850.028 486.315 1 0.541956 6.03602e-15 819.748 505.494 1 0.592371 6.03602e-15 806.168 486.911 1 0.13864 6.03602e-15 ST
866.545 397.319 0.907275 0.952078 0.0709392 856.832 441.092 0.952078 0.720593 0 822.006 392.38 0.952078 0.869938 0 ST
822.006 392.38 0.889173 0.81246 0 812.981 439.196 0.889173 0.435869 0 774.297 396.391 0.889173 0.672982 0 ST
774.297 396.391 0.888203 0.672248 0 812.981 439.196 0.888203 0.435394 0 765.762 444.366 0.888203 0.212472 0 ST
856.832 441.092 0.947493 0.717122 0 812.981 439.196 0.947493 0.464457 0 822.006 392.38 0.947493 0.865749 0 ST
899.9 462.142 1 1 0.0818771 892.412 510.897 1 1 0 850.028 486.315 1 0.555903 0 ST
765.762 444.366 0.898428 0.214918 0 759.856 493.644 0.743405 0 0 719.415 453.529 0.898428 0.0598952 0 ST
856.832 441.092 1 0.810025 0 899.9 462.142 1 1 0.0797434 850.028 486.315 1 0.541415 0 ST
892.412 510.897 1 1 0 841.848 532.985 1 0.3576 0 850.028 486.315 1 0.569511 0 ST
812.981 439.196 1 0.500465 0 856.832 441.092 1 0.772717 0 850.028 486.315 1 0.51648 0 ST
812.981 439.196 0.956709 0.468975 0 806.168 486.911 0.956709 0.123809 0 765.762 444.366 0.956709 0.22886 0 ST
759.856 493.644 0.795292 0 0 765.762 444.366 0.961135 0.229919 0 806.168 486.911 0.961135 0.124382 0 ST
812.981 439.196 1 0.499455 0 850.028 486.315 1 0.515438 0 806.168 486.911 1 0.131856 0 ST
grestore
showpage
cleartomark
%%PageTrailer
%%Trailer
end
%%EOF
