%!PS-Adobe-3.0 EPSF-3.0
%%Title: gelly-03
%%Creator: GL2PS 1.4.3, (C) 1999-2020 C. Geuzaine
%%For: Gmsh
%%CreationDate: Sat Nov 23 23:33:05 2024
%%LanguageLevel: 3
%%DocumentData: Clean7Bit
%%Pages: 1
%%BoundingBox: 313 90 852 562
%%EndComments
%%BeginProlog
/gl2psdict 64 dict def gl2psdict begin
/tryPS3shading false def % set to false to force subdivision
/rThreshold 0.0666667 def % red component subdivision threshold
/gThreshold 0.05 def % green component subdivision threshold
/bThreshold 0.1 def % blue component subdivision threshold
/BD { bind def } bind def
/C  { setrgbcolor } BD
/G  { 0.082 mul exch 0.6094 mul add exch 0.3086 mul add neg 1.0 add setgray } BD
/W  { setlinewidth } BD
/LC  { setlinecap } BD
/LJ  { setlinejoin } BD
/FC { findfont exch /SH exch def SH scalefont setfont } BD
/SW { dup stringwidth pop } BD
/S  { FC moveto show } BD
/SBC{ FC moveto SW -2 div 0 rmoveto show } BD
/SBR{ FC moveto SW neg 0 rmoveto show } BD
/SCL{ FC moveto 0 SH -2 div rmoveto show } BD
/SCC{ FC moveto SW -2 div SH -2 div rmoveto show } BD
/SCR{ FC moveto SW neg SH -2 div rmoveto show } BD
/STL{ FC moveto 0 SH neg rmoveto show } BD
/STC{ FC moveto SW -2 div SH neg rmoveto show } BD
/STR{ FC moveto SW neg SH neg rmoveto show } BD
/FCT { FC translate 0 0 } BD
/SR  { gsave FCT moveto rotate show grestore } BD
/SBCR{ gsave FCT moveto rotate SW -2 div 0 rmoveto show grestore } BD
/SBRR{ gsave FCT moveto rotate SW neg 0 rmoveto show grestore } BD
/SCLR{ gsave FCT moveto rotate 0 SH -2 div rmoveto show grestore} BD
/SCCR{ gsave FCT moveto rotate SW -2 div SH -2 div rmoveto show grestore} BD
/SCRR{ gsave FCT moveto rotate SW neg SH -2 div rmoveto show grestore} BD
/STLR{ gsave FCT moveto rotate 0 SH neg rmoveto show grestore } BD
/STCR{ gsave FCT moveto rotate SW -2 div SH neg rmoveto show grestore } BD
/STRR{ gsave FCT moveto rotate SW neg SH neg rmoveto show grestore } BD
/P  { newpath 0.0 360.0 arc closepath fill } BD
/R  { newpath moveto lineto lineto lineto closepath fill } BD
/LS { newpath moveto } BD
/L  { lineto } BD
/LE { lineto stroke } BD
/T  { newpath moveto lineto lineto closepath fill } BD
/STshfill {
      /b1 exch def /g1 exch def /r1 exch def /y1 exch def /x1 exch def
      /b2 exch def /g2 exch def /r2 exch def /y2 exch def /x2 exch def
      /b3 exch def /g3 exch def /r3 exch def /y3 exch def /x3 exch def
      gsave << /ShadingType 4 /ColorSpace [/DeviceRGB]
      /DataSource [ 0 x1 y1 r1 g1 b1 0 x2 y2 r2 g2 b2 0 x3 y3 r3 g3 b3 ] >>
      shfill grestore } BD
/Tm { 3 -1 roll 8 -1 roll 13 -1 roll add add 3 div
      3 -1 roll 7 -1 roll 11 -1 roll add add 3 div
      3 -1 roll 6 -1 roll 9 -1 roll add add 3 div C T } BD
/STsplit {
      4 index 15 index add 0.5 mul
      4 index 15 index add 0.5 mul
      4 index 15 index add 0.5 mul
      4 index 15 index add 0.5 mul
      4 index 15 index add 0.5 mul
      5 copy 5 copy 25 15 roll
      9 index 30 index add 0.5 mul
      9 index 30 index add 0.5 mul
      9 index 30 index add 0.5 mul
      9 index 30 index add 0.5 mul
      9 index 30 index add 0.5 mul
      5 copy 5 copy 35 5 roll 25 5 roll 15 5 roll
      4 index 10 index add 0.5 mul
      4 index 10 index add 0.5 mul
      4 index 10 index add 0.5 mul
      4 index 10 index add 0.5 mul
      4 index 10 index add 0.5 mul
      5 copy 5 copy 40 5 roll 25 5 roll 15 5 roll 25 5 roll
      STnoshfill STnoshfill STnoshfill STnoshfill } BD
/STnoshfill {
      2 index 8 index sub abs rThreshold gt
      { STsplit }
      { 1 index 7 index sub abs gThreshold gt
        { STsplit }
        { dup 6 index sub abs bThreshold gt
          { STsplit }
          { 2 index 13 index sub abs rThreshold gt
            { STsplit }
            { 1 index 12 index sub abs gThreshold gt
              { STsplit }
              { dup 11 index sub abs bThreshold gt
                { STsplit }
                { 7 index 13 index sub abs rThreshold gt
                  { STsplit }
                  { 6 index 12 index sub abs gThreshold gt
                    { STsplit }
                    { 5 index 11 index sub abs bThreshold gt
                      { STsplit }
                      { Tm }
                      ifelse }
                    ifelse }
                  ifelse }
                ifelse }
              ifelse }
            ifelse }
          ifelse }
        ifelse }
      ifelse } BD
tryPS3shading
{ /shfill where
  { /ST { STshfill } BD }
  { /ST { STnoshfill } BD }
  ifelse }
{ /ST { STnoshfill } BD }
ifelse
end
%%EndProlog
%%BeginSetup
/DeviceRGB setcolorspace
gl2psdict begin
%%EndSetup
%%Page: 1 1
%%BeginPageSetup
%%EndPageSetup
mark
gsave
1.0 1.0 scale
1 W
1.05788 0.510338 0.0236322 C
793.091 332.656 LS
793.44 326.735 L
809.064 333.733 L
808.944 339.12 L
793.091 332.656 LE
777.267 324.681 LS
777.894 318.228 L
793.44 326.735 L
793.091 332.656 L
777.267 324.681 LE
761.797 315.342 LS
762.751 308.37 L
777.894 318.228 L
777.267 324.681 L
761.797 315.342 LE
746.909 304.89 LS
748.225 297.419 L
762.751 308.37 L
761.797 315.342 L
746.909 304.89 LE
732.703 293.609 LS
734.409 285.664 L
748.225 297.419 L
746.909 304.89 L
732.703 293.609 LE
719.173 281.762 LS
721.289 273.364 L
734.409 285.664 L
732.703 293.609 L
719.173 281.762 LE
706.238 269.556 LS
708.775 260.727 L
721.289 273.364 L
719.173 281.762 L
706.238 269.556 LE
693.771 257.139 LS
696.736 247.895 L
708.775 260.727 L
706.238 269.556 L
693.771 257.139 LE
681.624 244.611 LS
685.021 234.962 L
696.736 247.895 L
693.771 257.139 L
681.624 244.611 LE
669.639 232.036 LS
673.469 221.988 L
685.021 234.962 L
681.624 244.611 L
669.639 232.036 LE
659.286 221.165 LS
663.49 210.772 L
673.469 221.988 L
669.639 232.036 L
659.286 221.165 LE
648.71 210.202 LS
653.291 199.457 L
663.49 210.772 L
659.286 221.165 L
648.71 210.202 LE
637.682 199.073 LS
642.647 187.961 L
653.291 199.457 L
648.71 210.202 L
637.682 199.073 LE
625.965 187.742 LS
631.321 176.24 L
642.647 187.961 L
637.682 199.073 L
625.965 187.742 LE
613.317 176.238 LS
619.07 164.313 L
631.321 176.24 L
625.965 187.742 L
613.317 176.238 LE
599.5 164.689 LS
605.653 152.302 L
619.07 164.313 L
613.317 176.238 L
599.5 164.689 LE
584.317 153.351 LS
590.863 140.457 L
605.653 152.302 L
599.5 164.689 L
584.317 153.351 LE
567.66 142.62 LS
574.579 129.168 L
590.863 140.457 L
584.317 153.351 L
567.66 142.62 LE
549.577 132.993 LS
556.833 118.932 L
574.579 129.168 L
567.66 142.62 L
549.577 132.993 LE
530.334 124.95 LS
537.873 110.243 L
556.833 118.932 L
549.577 132.993 L
530.334 124.95 LE
510.4 118.816 LS
518.159 103.436 L
537.873 110.243 L
530.334 124.95 L
510.4 118.816 LE
490.343 114.643 LS
498.255 98.5864 L
518.159 103.436 L
510.4 118.816 L
490.343 114.643 LE
470.677 112.23 LS
478.682 95.507 L
498.255 98.5864 L
490.343 114.643 L
470.677 112.23 LE
451.755 111.226 LS
459.804 93.8624 L
478.682 95.507 L
470.677 112.23 L
451.755 111.226 LE
433.746 111.26 LS
441.806 93.2857 L
459.804 93.8624 L
451.755 111.226 L
433.746 111.26 LE
416.666 112.006 LS
424.709 93.452 L
441.806 93.2857 L
433.746 111.26 L
416.666 112.006 LE
400.411 113.215 LS
408.422 94.1107 L
424.709 93.452 L
416.666 112.006 L
400.411 113.215 LE
384.816 114.71 LS
392.785 95.0753 L
408.422 94.1107 L
400.411 113.215 L
384.816 114.71 LE
369.673 116.367 LS
377.595 96.218 L
392.785 95.0753 L
384.816 114.71 L
369.673 116.367 LE
354.761 118.094 LS
362.633 97.4395 L
377.595 96.218 L
369.673 116.367 L
354.761 118.094 LE
792.96 338.621 LS
793.091 332.656 L
808.944 339.12 L
809.026 344.535 L
792.96 338.621 LE
776.871 331.196 LS
777.267 324.681 L
793.091 332.656 L
792.96 338.621 L
776.871 331.196 LE
761.088 322.396 LS
761.797 315.342 L
777.267 324.681 L
776.871 331.196 L
761.088 322.396 LE
745.848 312.463 LS
746.909 304.89 L
761.797 315.342 L
761.088 322.396 L
745.848 312.463 LE
731.262 301.679 LS
732.703 293.609 L
746.909 304.89 L
745.848 312.463 L
731.262 301.679 LE
717.332 290.305 LS
719.173 281.762 L
732.703 293.609 L
731.262 301.679 L
717.332 290.305 LE
703.983 278.552 LS
706.238 269.556 L
719.173 281.762 L
717.332 290.305 L
703.983 278.552 LE
691.096 266.573 LS
693.771 257.139 L
706.238 269.556 L
703.983 278.552 L
691.096 266.573 LE
678.524 254.471 LS
681.624 244.611 L
693.771 257.139 L
691.096 266.573 L
678.524 254.471 LE
666.113 242.316 LS
669.639 232.036 L
681.624 244.611 L
678.524 254.471 L
666.113 242.316 LE
655.391 231.808 LS
659.286 221.165 L
669.639 232.036 L
666.113 242.316 L
655.391 231.808 LE
644.443 221.217 LS
648.71 210.202 L
659.286 221.165 L
655.391 231.808 L
644.443 221.217 LE
633.038 210.475 LS
637.682 199.073 L
648.71 210.202 L
644.443 221.217 L
633.038 210.475 LE
620.938 199.555 LS
625.965 187.742 L
637.682 199.073 L
633.038 210.475 L
620.938 199.555 LE
607.9 188.493 LS
613.317 176.238 L
625.965 187.742 L
620.938 199.555 L
607.9 188.493 LE
593.694 177.427 LS
599.5 164.689 L
613.317 176.238 L
607.9 188.493 L
593.694 177.427 LE
578.129 166.619 LS
584.317 153.351 L
599.5 164.689 L
593.694 177.427 L
578.129 166.619 LE
561.112 156.471 LS
567.66 142.62 L
584.317 153.351 L
578.129 166.619 L
561.112 156.471 LE
542.708 147.471 LS
549.577 132.993 L
567.66 142.62 L
561.112 156.471 L
542.708 147.471 LE
523.199 140.098 LS
530.334 124.95 L
549.577 132.993 L
542.708 147.471 L
523.199 140.098 LE
503.066 134.654 LS
510.4 118.816 L
530.334 124.95 L
523.199 140.098 L
503.066 134.654 LE
482.877 131.175 LS
490.343 114.643 L
510.4 118.816 L
503.066 134.654 L
482.877 131.175 LE
463.138 129.44 LS
470.677 112.23 L
490.343 114.643 L
482.877 131.175 L
463.138 129.44 LE
444.193 129.09 LS
451.755 111.226 L
470.677 112.23 L
463.138 129.44 L
444.193 129.09 LE
426.197 129.743 LS
433.746 111.26 L
451.755 111.226 L
444.193 129.09 L
426.197 129.743 LE
409.151 131.079 LS
416.666 112.006 L
433.746 111.26 L
426.197 129.743 L
409.151 131.079 LE
392.948 132.847 LS
400.411 113.215 L
416.666 112.006 L
409.151 131.079 L
392.948 132.847 LE
377.414 134.879 LS
384.816 114.71 L
400.411 113.215 L
392.948 132.847 L
377.414 134.879 LE
362.337 137.057 LS
369.673 116.367 L
384.816 114.71 L
377.414 134.879 L
362.337 137.057 LE
347.494 139.298 LS
354.761 118.094 L
369.673 116.367 L
362.337 137.057 L
347.494 139.298 LE
793.153 344.483 LS
792.96 338.621 L
809.026 344.535 L
809.422 349.816 L
793.153 344.483 LE
776.807 337.642 LS
776.871 331.196 L
792.96 338.621 L
793.153 344.483 L
776.807 337.642 LE
760.718 329.415 LS
761.088 322.396 L
776.871 331.196 L
776.807 337.642 L
760.718 329.415 LE
745.131 320.037 LS
745.848 312.463 L
761.088 322.396 L
760.718 329.415 L
745.131 320.037 LE
730.166 309.784 LS
731.262 301.679 L
745.848 312.463 L
745.131 320.037 L
730.166 309.784 LE
715.836 298.919 LS
717.332 290.305 L
731.262 301.679 L
730.166 309.784 L
715.836 298.919 LE
702.074 287.654 LS
703.983 278.552 L
717.332 290.305 L
715.836 298.919 L
702.074 287.654 LE
688.764 276.146 LS
691.096 266.573 L
703.983 278.552 L
702.074 287.654 L
688.764 276.146 LE
675.765 264.504 LS
678.524 254.471 L
691.096 266.573 L
688.764 276.146 L
675.765 264.504 LE
662.924 252.803 LS
666.113 242.316 L
678.524 254.471 L
675.765 264.504 L
662.924 252.803 LE
651.831 242.688 LS
655.391 231.808 L
666.113 242.316 L
662.924 252.803 L
651.831 242.688 LE
640.51 232.497 LS
644.443 221.217 L
655.391 231.808 L
651.831 242.688 L
640.51 232.497 LE
628.726 222.172 LS
633.038 210.475 L
644.443 221.217 L
640.51 232.497 L
628.726 222.172 LE
616.241 211.693 LS
620.938 199.555 L
633.038 210.475 L
628.726 222.172 L
616.241 211.693 LE
602.814 201.108 LS
607.9 188.493 L
620.938 199.555 L
616.241 211.693 L
602.814 201.108 LE
588.218 190.56 LS
593.694 177.427 L
607.9 188.493 L
602.814 201.108 L
588.218 190.56 LE
572.275 180.32 LS
578.129 166.619 L
593.694 177.427 L
588.218 190.56 L
572.275 180.32 LE
554.904 170.789 LS
561.112 156.471 L
578.129 166.619 L
572.275 180.32 L
554.904 170.789 LE
536.188 162.458 LS
542.708 147.471 L
561.112 156.471 L
554.904 170.789 L
536.188 162.458 LE
516.427 155.79 LS
523.199 140.098 L
542.708 147.471 L
536.188 162.458 L
516.427 155.79 LE
496.111 151.074 LS
503.066 134.654 L
523.199 140.098 L
516.427 155.79 L
496.111 151.074 LE
475.81 148.323 LS
482.877 131.175 L
503.066 134.654 L
496.111 151.074 L
475.81 148.323 LE
456.023 147.3 LS
463.138 129.44 L
482.877 131.175 L
475.81 148.323 L
456.023 147.3 LE
437.076 147.631 LS
444.193 129.09 L
463.138 129.44 L
456.023 147.3 L
437.076 147.631 LE
419.116 148.932 LS
426.197 129.743 L
444.193 129.09 L
437.076 147.631 L
419.116 148.932 LE
402.129 150.879 LS
409.151 131.079 L
426.197 129.743 L
419.116 148.932 L
402.129 150.879 LE
386 153.229 LS
392.948 132.847 L
409.151 131.079 L
402.129 150.879 L
386 153.229 LE
370.548 155.818 LS
377.414 134.879 L
392.948 132.847 L
386 153.229 L
370.548 155.818 LE
355.56 158.536 LS
362.337 137.057 L
377.414 134.879 L
370.548 155.818 L
355.56 158.536 LE
340.806 161.31 LS
347.494 139.298 L
362.337 137.057 L
355.56 158.536 L
340.806 161.31 LE
793.666 350.22 LS
793.153 344.483 L
809.422 349.816 L
810.122 354.941 L
793.666 350.22 LE
777.075 343.993 LS
776.807 337.642 L
793.153 344.483 L
793.666 350.22 L
777.075 343.993 LE
760.691 336.373 LS
760.718 329.415 L
776.807 337.642 L
777.075 343.993 L
760.691 336.373 LE
744.765 327.583 LS
745.131 320.037 L
760.718 329.415 L
760.691 336.373 L
744.765 327.583 LE
729.428 317.896 LS
730.166 309.784 L
745.131 320.037 L
744.765 327.583 L
729.428 317.896 LE
714.702 307.572 LS
715.836 298.919 L
730.166 309.784 L
729.428 317.896 L
714.702 307.572 LE
700.529 296.829 LS
702.074 287.654 L
715.836 298.919 L
714.702 307.572 L
700.529 296.829 LE
686.799 285.825 LS
688.764 276.146 L
702.074 287.654 L
700.529 296.829 L
686.799 285.825 LE
673.375 274.676 LS
675.765 264.504 L
688.764 276.146 L
686.799 285.825 L
673.375 274.676 LE
660.106 263.463 LS
662.924 252.803 L
675.765 264.504 L
673.375 274.676 L
660.106 263.463 LE
648.644 253.769 LS
651.831 242.688 L
662.924 252.803 L
660.106 263.463 L
648.644 253.769 LE
636.95 244.008 LS
640.51 232.497 L
651.831 242.688 L
648.644 253.769 L
636.95 244.008 LE
624.789 234.13 LS
628.726 222.172 L
640.51 232.497 L
636.95 244.008 L
624.789 234.13 LE
611.921 224.125 LS
616.241 211.693 L
628.726 222.172 L
624.789 234.13 L
611.921 224.125 LE
598.109 214.048 LS
602.814 201.108 L
616.241 211.693 L
611.921 224.125 L
598.109 214.048 LE
583.13 204.051 LS
588.218 190.56 L
602.814 201.108 L
598.109 214.048 L
583.13 204.051 LE
566.815 194.413 LS
572.275 180.32 L
588.218 190.56 L
583.13 204.051 L
566.815 194.413 LE
549.101 185.538 LS
554.904 170.789 L
572.275 180.32 L
566.815 194.413 L
549.101 185.538 LE
530.087 177.91 LS
536.188 162.458 L
554.904 170.789 L
549.101 185.538 L
530.087 177.91 LE
510.091 171.985 LS
516.427 155.79 L
536.188 162.458 L
530.087 177.91 L
510.091 171.985 LE
489.613 168.03 LS
496.111 151.074 L
516.427 155.79 L
510.091 171.985 L
489.613 168.03 LE
469.224 166.039 LS
475.81 148.323 L
496.111 151.074 L
489.613 168.03 L
469.224 166.039 LE
449.412 165.755 LS
456.023 147.3 L
475.81 148.323 L
469.224 166.039 L
449.412 165.755 LE
430.491 166.792 LS
437.076 147.631 L
456.023 147.3 L
449.412 165.755 L
430.491 166.792 LE
412.591 168.763 LS
419.116 148.932 L
437.076 147.631 L
430.491 166.792 L
412.591 168.763 LE
395.689 171.342 LS
402.129 150.879 L
419.116 148.932 L
412.591 168.763 L
395.689 171.342 LE
379.659 174.293 LS
386 153.229 L
402.129 150.879 L
395.689 171.342 L
379.659 174.293 LE
364.314 177.457 LS
370.548 155.818 L
386 153.229 L
379.659 174.293 L
364.314 177.457 LE
349.439 180.732 LS
355.56 158.536 L
370.548 155.818 L
364.314 177.457 L
349.439 180.732 LE
334.799 184.055 LS
340.806 161.31 L
355.56 158.536 L
349.439 180.732 L
334.799 184.055 LE
794.487 355.81 LS
793.666 350.22 L
810.122 354.941 L
811.112 359.895 L
794.487 355.81 LE
777.669 350.227 LS
777.075 343.993 L
793.666 350.22 L
794.487 355.81 L
777.669 350.227 LE
761.004 343.243 LS
760.691 336.373 L
777.075 343.993 L
777.669 350.227 L
761.004 343.243 LE
744.751 335.072 LS
744.765 327.583 L
760.691 336.373 L
761.004 343.243 L
744.751 335.072 LE
729.052 325.982 LS
729.428 317.896 L
744.765 327.583 L
744.751 335.072 L
729.052 325.982 LE
713.94 316.234 LS
714.702 307.572 L
729.428 317.896 L
729.052 325.982 L
713.94 316.234 LE
699.364 306.043 LS
700.529 296.829 L
714.702 307.572 L
713.94 316.234 L
699.364 306.043 LE
685.22 295.576 LS
686.799 285.825 L
700.529 296.829 L
699.364 306.043 L
685.22 295.576 LE
671.377 284.952 LS
673.375 274.676 L
686.799 285.825 L
685.22 295.576 L
671.377 284.952 LE
657.687 274.258 LS
660.106 263.463 L
673.375 274.676 L
671.377 284.952 L
657.687 274.258 LE
645.86 265.012 LS
648.644 253.769 L
660.106 263.463 L
657.687 274.258 L
645.86 265.012 LE
633.799 255.708 LS
636.95 244.008 L
648.644 253.769 L
645.86 265.012 L
633.799 255.708 LE
621.267 246.305 LS
624.789 234.13 L
636.95 244.008 L
633.799 255.708 L
621.267 246.305 LE
608.024 236.803 LS
611.921 224.125 L
624.789 234.13 L
621.267 246.305 L
608.024 236.803 LE
593.834 227.265 LS
598.109 214.048 L
611.921 224.125 L
608.024 236.803 L
593.834 227.265 LE
578.481 217.853 LS
583.13 204.051 L
598.109 214.048 L
593.834 227.265 L
578.481 217.853 LE
561.808 208.85 LS
566.815 194.413 L
583.13 204.051 L
578.481 217.853 L
561.808 208.85 LE
543.765 200.661 LS
549.101 185.538 L
566.815 194.413 L
561.808 208.85 L
543.765 200.661 LE
524.472 193.772 LS
530.087 177.91 L
549.101 185.538 L
543.765 200.661 L
524.472 193.772 LE
504.262 188.62 LS
510.091 171.985 L
530.087 177.91 L
524.472 193.772 L
504.262 188.62 LE
483.647 185.456 LS
489.613 168.03 L
510.091 171.985 L
504.262 188.62 L
483.647 185.456 LE
463.196 184.252 LS
469.224 166.039 L
489.613 168.03 L
483.647 185.456 L
463.196 184.252 LE
443.389 184.73 LS
449.412 165.755 L
469.224 166.039 L
463.196 184.252 L
443.389 184.73 LE
424.522 186.495 LS
430.491 166.792 L
449.412 165.755 L
443.389 184.73 L
424.522 186.495 LE
406.711 189.153 LS
412.591 168.763 L
430.491 166.792 L
424.522 186.495 L
406.711 189.153 LE
389.92 192.381 LS
395.689 171.342 L
412.591 168.763 L
406.711 189.153 L
389.92 192.381 LE
374.016 195.947 LS
379.659 174.293 L
395.689 171.342 L
389.92 192.381 L
374.016 195.947 LE
358.805 199.699 LS
364.314 177.457 L
379.659 174.293 L
374.016 195.947 L
358.805 199.699 LE
344.066 203.544 LS
349.439 180.732 L
364.314 177.457 L
358.805 199.699 L
344.066 203.544 LE
329.564 207.428 LS
334.799 184.055 L
349.439 180.732 L
344.066 203.544 L
329.564 207.428 LE
795.598 361.24 LS
794.487 355.81 L
811.112 359.895 L
812.372 364.666 L
795.598 361.24 LE
778.573 356.324 LS
777.669 350.227 L
794.487 355.81 L
795.598 361.24 L
778.573 356.324 LE
761.645 350.002 LS
761.004 343.243 L
777.669 350.227 L
778.573 356.324 L
761.645 350.002 LE
745.084 342.478 LS
744.751 335.072 L
761.004 343.243 L
761.645 350.002 L
745.084 342.478 LE
729.039 334.014 LS
729.052 325.982 L
744.751 335.072 L
745.084 342.478 L
729.039 334.014 LE
713.554 324.869 LS
713.94 316.234 L
729.052 325.982 L
729.039 334.014 L
713.554 324.869 LE
698.588 315.261 LS
699.364 306.043 L
713.94 316.234 L
713.554 324.869 L
698.588 315.261 LE
684.043 305.36 LS
685.22 295.576 L
699.364 306.043 L
698.588 315.261 L
684.043 305.36 LE
669.792 295.29 LS
671.377 284.952 L
685.22 295.576 L
684.043 305.36 L
669.792 295.29 LE
655.69 285.143 LS
657.687 274.258 L
671.377 284.952 L
669.792 295.29 L
655.69 285.143 LE
643.508 276.371 LS
645.86 265.012 L
657.687 274.258 L
655.69 285.143 L
643.508 276.371 LE
631.09 267.549 LS
633.799 255.708 L
645.86 265.012 L
643.508 276.371 L
631.09 267.549 LE
618.197 258.648 LS
621.267 246.305 L
633.799 255.708 L
631.09 267.549 L
618.197 258.648 LE
604.59 249.675 LS
608.024 236.803 L
621.267 246.305 L
618.197 258.648 L
604.59 249.675 LE
590.034 240.704 LS
593.834 227.265 L
608.024 236.803 L
604.59 249.675 L
590.034 240.704 LE
574.323 231.904 LS
578.481 217.853 L
593.834 227.265 L
590.034 240.704 L
574.323 231.904 LE
557.308 223.565 LS
561.808 208.85 L
578.481 217.853 L
574.323 231.904 L
557.308 223.565 LE
538.955 216.094 LS
543.765 200.661 L
561.808 208.85 L
557.308 223.565 L
538.955 216.094 LE
519.406 209.971 LS
524.472 193.772 L
543.765 200.661 L
538.955 216.094 L
519.406 209.971 LE
499.009 205.62 LS
504.262 188.62 L
524.472 193.772 L
519.406 209.971 L
499.009 205.62 LE
478.286 203.272 LS
483.647 185.456 L
504.262 188.62 L
499.009 205.62 L
478.286 203.272 LE
457.803 202.874 LS
463.196 184.252 L
483.647 185.456 L
478.286 203.272 L
457.803 202.874 LE
438.029 204.132 LS
443.389 184.73 L
463.196 184.252 L
457.803 202.874 L
438.029 204.132 LE
419.247 206.64 LS
424.522 186.495 L
443.389 184.73 L
438.029 204.132 L
419.247 206.64 LE
401.554 209.998 LS
406.711 189.153 L
424.522 186.495 L
419.247 206.64 L
401.554 209.998 LE
384.904 213.885 LS
389.92 192.381 L
406.711 189.153 L
401.554 209.998 L
384.904 213.885 LE
369.152 218.075 LS
374.016 195.947 L
389.92 192.381 L
384.904 213.885 L
369.152 218.075 LE
354.101 222.424 LS
358.805 199.699 L
374.016 195.947 L
369.152 218.075 L
354.101 222.424 LE
339.525 226.847 LS
344.066 203.544 L
358.805 199.699 L
354.101 222.424 L
339.525 226.847 LE
325.189 231.299 LS
329.564 207.428 L
344.066 203.544 L
339.525 226.847 L
325.189 231.299 LE
796.979 366.498 LS
795.598 361.24 L
812.372 364.666 L
813.876 369.25 L
796.979 366.498 LE
779.771 362.269 LS
778.573 356.324 L
795.598 361.24 L
796.979 366.498 L
779.771 362.269 LE
762.603 356.63 LS
761.645 350.002 L
778.573 356.324 L
779.771 362.269 L
762.603 356.63 LE
745.753 349.777 LS
745.084 342.478 L
761.645 350.002 L
762.603 356.63 L
745.753 349.777 LE
729.382 341.963 LS
729.039 334.014 L
745.084 342.478 L
745.753 349.777 L
729.382 341.963 LE
713.543 333.445 LS
713.554 324.869 L
729.039 334.014 L
729.382 341.963 L
713.543 333.445 LE
698.203 324.445 LS
698.588 315.261 L
713.554 324.869 L
713.543 333.445 L
698.203 324.445 LE
683.273 315.135 LS
684.043 305.36 L
698.588 315.261 L
698.203 324.445 L
683.273 315.135 LE
668.63 305.644 LS
669.792 295.29 L
684.043 305.36 L
683.273 315.135 L
668.63 305.644 LE
654.133 296.071 LS
655.69 285.143 L
669.792 295.29 L
668.63 305.644 L
654.133 296.071 LE
641.609 287.793 LS
643.508 276.371 L
655.69 285.143 L
654.133 296.071 L
641.609 287.793 LE
628.847 279.477 LS
631.09 267.549 L
643.508 276.371 L
641.609 287.793 L
628.847 279.477 LE
615.608 271.1 LS
618.197 258.648 L
631.09 267.549 L
628.847 279.477 L
615.608 271.1 LE
601.652 262.679 LS
604.59 249.675 L
618.197 258.648 L
615.608 271.1 L
601.652 262.679 LE
586.749 254.299 LS
590.034 240.704 L
604.59 249.675 L
601.652 262.679 L
586.749 254.299 LE
570.697 246.136 LS
574.323 231.904 L
590.034 240.704 L
586.749 254.299 L
570.697 246.136 LE
553.362 238.485 LS
557.308 223.565 L
574.323 231.904 L
570.697 246.136 L
553.362 238.485 LE
534.725 231.757 LS
538.955 216.094 L
557.308 223.565 L
553.362 238.485 L
534.725 231.757 LE
514.946 226.421 LS
519.406 209.971 L
538.955 216.094 L
534.725 231.757 L
514.946 226.421 LE
494.39 222.891 LS
499.009 205.62 L
519.406 209.971 L
514.946 226.421 L
494.39 222.891 LE
473.589 221.376 LS
478.286 203.272 L
499.009 205.62 L
494.39 222.891 L
473.589 221.376 LE
453.107 221.799 LS
457.803 202.874 L
478.286 203.272 L
473.589 221.376 L
453.107 221.799 LE
433.4 223.849 LS
438.029 204.132 L
457.803 202.874 L
453.107 221.799 L
433.4 223.849 LE
414.733 227.107 LS
419.247 206.64 L
438.029 204.132 L
433.4 223.849 L
414.733 227.107 LE
397.19 231.172 LS
401.554 209.998 L
419.247 206.64 L
414.733 227.107 L
397.19 231.172 LE
380.709 235.723 LS
384.904 213.885 L
401.554 209.998 L
397.19 231.172 L
380.709 235.723 LE
365.138 240.541 LS
369.152 218.075 L
384.904 213.885 L
380.709 235.723 L
365.138 240.541 LE
350.272 245.489 LS
354.101 222.424 L
369.152 218.075 L
365.138 240.541 L
350.272 245.489 LE
335.886 250.493 LS
339.525 226.847 L
354.101 222.424 L
350.272 245.489 L
335.886 250.493 LE
321.738 255.516 LS
325.189 231.299 L
339.525 226.847 L
335.886 250.493 L
321.738 255.516 LE
798.602 371.582 LS
796.979 366.498 L
813.876 369.25 L
815.597 373.648 L
798.602 371.582 LE
781.237 368.052 LS
779.771 362.269 L
796.979 366.498 L
798.602 371.582 L
781.237 368.052 LE
763.855 363.112 LS
762.603 356.63 L
779.771 362.269 L
781.237 368.052 L
763.855 363.112 LE
746.741 356.945 LS
745.753 349.777 L
762.603 356.63 L
763.855 363.112 L
746.741 356.945 LE
730.068 349.8 LS
729.382 341.963 L
745.753 349.777 L
746.741 356.945 L
730.068 349.8 LE
713.898 341.93 LS
713.543 333.445 L
729.382 341.963 L
730.068 349.8 L
713.898 341.93 LE
698.206 333.557 LS
698.203 324.445 L
713.543 333.445 L
713.898 341.93 L
698.206 333.557 LE
682.912 324.858 LS
683.273 315.135 L
698.203 324.445 L
698.206 333.557 L
682.912 324.858 LE
667.897 315.967 LS
668.63 305.644 L
683.273 315.135 L
682.912 324.858 L
667.897 315.967 LE
653.025 306.988 LS
654.133 296.071 L
668.63 305.644 L
667.897 315.967 L
653.025 306.988 LE
640.177 299.224 LS
641.609 287.793 L
654.133 296.071 L
653.025 306.988 L
640.177 299.224 LE
627.089 291.43 LS
628.847 279.477 L
641.609 287.793 L
640.177 299.224 L
627.089 291.43 LE
613.522 283.595 LS
615.608 271.1 L
628.847 279.477 L
627.089 291.43 L
613.522 283.595 LE
599.237 275.746 LS
601.652 262.679 L
615.608 271.1 L
613.522 283.595 L
599.237 275.746 LE
584.007 267.975 LS
586.749 254.299 L
601.652 262.679 L
599.237 275.746 L
584.007 267.975 LE
567.638 260.468 LS
570.697 246.136 L
586.749 254.299 L
584.007 267.975 L
567.638 260.468 LE
550.008 253.524 LS
553.362 238.485 L
570.697 246.136 L
567.638 260.468 L
550.008 253.524 LE
531.114 247.555 LS
534.725 231.757 L
553.362 238.485 L
550.008 253.524 L
531.114 247.555 LE
511.135 243.024 LS
514.946 226.421 L
534.725 231.757 L
531.114 247.555 L
511.135 243.024 LE
490.454 240.328 LS
494.39 222.891 L
514.946 226.421 L
511.135 243.024 L
490.454 240.328 LE
469.608 239.654 LS
473.589 221.376 L
494.39 222.891 L
490.454 240.328 L
469.608 239.654 LE
449.16 240.905 LS
453.107 221.799 L
473.589 221.376 L
469.608 239.654 L
449.16 240.905 LE
429.552 243.751 LS
433.4 223.849 L
453.107 221.799 L
449.16 240.905 L
429.552 243.751 LE
411.032 247.761 LS
414.733 227.107 L
433.4 223.849 L
429.552 243.751 L
411.032 247.761 LE
393.668 252.531 LS
397.19 231.172 L
414.733 227.107 L
411.032 247.761 L
393.668 252.531 LE
377.384 257.746 LS
380.709 235.723 L
397.19 231.172 L
393.668 252.531 L
377.384 257.746 LE
362.021 263.189 LS
365.138 240.541 L
380.709 235.723 L
377.384 257.746 L
362.021 263.189 LE
347.368 268.734 LS
350.272 245.489 L
365.138 240.541 L
362.021 263.189 L
347.368 268.734 LE
333.195 274.316 LS
335.886 250.493 L
350.272 245.489 L
347.368 268.734 L
333.195 274.316 LE
319.262 279.907 LS
321.738 255.516 L
335.886 250.493 L
333.195 274.316 L
319.262 279.907 LE
800.438 376.492 LS
798.602 371.582 L
815.597 373.648 L
817.502 377.869 L
800.438 376.492 LE
782.944 373.667 LS
781.237 368.052 L
798.602 371.582 L
800.438 376.492 L
782.944 373.667 LE
765.377 369.435 LS
763.855 363.112 L
781.237 368.052 L
782.944 373.667 L
765.377 369.435 LE
748.028 363.966 LS
746.741 356.945 L
763.855 363.112 L
765.377 369.435 L
748.028 363.966 LE
731.079 357.501 LS
730.068 349.8 L
746.741 356.945 L
748.028 363.966 L
731.079 357.501 LE
714.603 350.291 LS
713.898 341.93 L
730.068 349.8 L
731.079 357.501 L
714.603 350.291 LE
698.586 342.56 LS
698.206 333.557 L
713.898 341.93 L
714.603 350.291 L
698.586 342.56 LE
682.952 334.487 LS
682.912 324.858 L
698.206 333.557 L
698.586 342.56 L
682.952 334.487 LE
667.59 326.211 LS
667.897 315.967 L
682.912 324.858 L
682.952 334.487 L
667.59 326.211 LE
652.367 317.841 LS
653.025 306.988 L
667.897 315.967 L
667.59 326.211 L
652.367 317.841 LE
639.215 310.604 LS
640.177 299.224 L
653.025 306.988 L
652.367 317.841 L
639.215 310.604 LE
625.822 303.346 LS
627.089 291.43 L
640.177 299.224 L
639.215 310.604 L
625.822 303.346 LE
611.949 296.066 LS
613.522 283.595 L
627.089 291.43 L
625.822 303.346 L
611.949 296.066 LE
597.358 288.801 LS
599.237 275.746 L
613.522 283.595 L
611.949 296.066 L
597.358 288.801 LE
581.826 281.653 LS
584.007 267.975 L
599.237 275.746 L
597.358 288.801 L
581.826 281.653 LE
565.167 274.814 LS
567.638 260.468 L
584.007 267.975 L
581.826 281.653 L
565.167 274.814 LE
547.27 268.59 LS
550.008 253.524 L
567.638 260.468 L
565.167 274.814 L
547.27 268.59 LE
528.15 263.39 LS
531.114 247.555 L
550.008 253.524 L
547.27 268.59 L
528.15 263.39 LE
508.005 259.671 LS
511.135 243.024 L
531.114 247.555 L
528.15 263.39 L
508.005 259.671 LE
487.232 257.814 LS
490.454 240.328 L
511.135 243.024 L
508.005 259.671 L
487.232 257.814 LE
466.377 257.984 LS
469.608 239.654 L
490.454 240.328 L
487.232 257.814 L
466.377 257.984 LE
445.996 260.062 LS
449.16 240.905 L
469.608 239.654 L
466.377 257.984 L
445.996 260.062 LE
426.518 263.698 LS
429.552 243.751 L
449.16 240.905 L
445.996 260.062 L
426.518 263.698 LE
408.176 268.454 LS
411.032 247.761 L
429.552 243.751 L
426.518 263.698 L
408.176 268.454 LE
391.018 273.924 LS
393.668 252.531 L
411.032 247.761 L
408.176 268.454 L
391.018 273.924 LE
374.959 279.792 LS
377.384 257.746 L
393.668 252.531 L
391.018 273.924 L
374.959 279.792 LE
359.828 285.853 LS
362.021 263.189 L
377.384 257.746 L
374.959 279.792 L
359.828 285.853 LE
345.412 291.987 LS
347.368 268.734 L
362.021 263.189 L
359.828 285.853 L
345.412 291.987 LE
331.476 298.137 LS
333.195 274.316 L
347.368 268.734 L
345.412 291.987 L
331.476 298.137 LE
317.782 304.288 LS
319.262 279.907 L
333.195 274.316 L
331.476 298.137 L
317.782 304.288 LE
802.474 381.187 LS
800.438 376.492 L
817.502 377.869 L
819.581 381.871 L
802.474 381.187 LE
784.88 379.072 LS
782.944 373.667 L
800.438 376.492 L
802.474 381.187 L
784.88 379.072 LE
767.156 375.554 LS
765.377 369.435 L
782.944 373.667 L
784.88 379.072 L
767.156 375.554 LE
749.6 370.792 LS
748.028 363.966 L
765.377 369.435 L
767.156 375.554 L
749.6 370.792 LE
732.403 365.018 LS
731.079 357.501 L
748.028 363.966 L
749.6 370.792 L
732.403 365.018 LE
715.649 358.481 LS
714.603 350.291 L
731.079 357.501 L
732.403 365.018 L
715.649 358.481 LE
699.333 351.405 LS
698.586 342.56 L
714.603 350.291 L
715.649 358.481 L
699.333 351.405 LE
683.385 343.971 LS
682.952 334.487 L
698.586 342.56 L
699.333 351.405 L
683.385 343.971 LE
667.7 336.324 LS
667.59 326.211 L
682.952 334.487 L
683.385 343.971 L
667.7 336.324 LE
652.151 328.577 LS
652.367 317.841 L
667.59 326.211 L
667.7 336.324 L
652.151 328.577 LE
638.716 321.877 LS
639.215 310.604 L
652.367 317.841 L
652.151 328.577 L
638.716 321.877 LE
625.041 315.168 LS
625.822 303.346 L
639.215 310.604 L
638.716 321.877 L
625.041 315.168 LE
610.885 308.456 LS
611.949 296.066 L
625.822 303.346 L
625.041 315.168 L
610.885 308.456 LE
596.012 301.787 LS
597.358 288.801 L
611.949 296.066 L
610.885 308.456 L
596.012 301.787 LE
580.203 295.273 LS
581.826 281.653 L
597.358 288.801 L
596.012 301.787 L
580.203 295.273 LE
563.281 289.114 LS
565.167 274.814 L
581.826 281.653 L
580.203 295.273 L
563.281 289.114 LE
545.147 283.619 LS
547.27 268.59 L
565.167 274.814 L
563.281 289.114 L
545.147 283.619 LE
525.832 279.198 LS
528.15 263.39 L
547.27 268.59 L
545.147 283.619 L
525.832 279.198 LE
505.552 276.297 LS
508.005 259.671 L
528.15 263.39 L
525.832 279.198 L
505.552 276.297 LE
484.721 275.282 LS
487.232 257.814 L
508.005 259.671 L
505.552 276.297 L
484.721 275.282 LE
463.89 276.297 LS
466.377 257.984 L
487.232 257.814 L
484.721 275.282 L
463.89 276.297 LE
443.61 279.198 LS
445.996 260.062 L
466.377 257.984 L
463.89 276.297 L
443.61 279.198 LE
424.295 283.619 LS
426.518 263.698 L
445.996 260.062 L
443.61 279.198 L
424.295 283.619 LE
406.161 289.114 LS
408.176 268.454 L
426.518 263.698 L
424.295 283.619 L
406.161 289.114 LE
389.239 295.273 LS
391.018 273.924 L
408.176 268.454 L
406.161 289.114 L
389.239 295.273 LE
373.43 301.787 LS
374.959 279.792 L
391.018 273.924 L
389.239 295.273 L
373.43 301.787 LE
358.557 308.456 LS
359.828 285.853 L
374.959 279.792 L
373.43 301.787 L
358.557 308.456 LE
344.401 315.168 LS
345.412 291.987 L
359.828 285.853 L
358.557 308.456 L
344.401 315.168 LE
330.726 321.877 LS
331.476 298.137 L
345.412 291.987 L
344.401 315.168 L
330.726 321.877 LE
317.291 328.577 LS
317.782 304.288 L
331.476 298.137 L
330.726 321.877 L
317.291 328.577 LE
845.212 418.262 LS
848.708 422.363 L
832.575 428.09 L
828.894 423.439 L
845.212 418.262 LE
828.894 423.439 LS
832.575 428.09 L
815.457 432.671 L
811.63 427.437 L
828.894 423.439 LE
811.63 427.437 LS
815.457 432.671 L
797.696 435.997 L
793.767 430.16 L
811.63 427.437 LE
793.767 430.16 LS
797.696 435.997 L
779.628 438.107 L
775.637 431.656 L
793.767 430.16 LE
775.637 431.656 LS
779.628 438.107 L
761.518 439.144 L
757.502 432.078 L
775.637 431.656 LE
757.502 432.078 LS
761.518 439.144 L
743.534 439.307 L
739.524 431.632 L
757.502 432.078 LE
739.524 431.632 LS
743.534 439.307 L
725.756 438.807 L
721.773 430.53 L
739.524 431.632 LE
721.773 430.53 LS
725.756 438.807 L
708.188 437.839 L
704.247 428.966 L
721.773 430.53 LE
704.247 428.966 LS
708.188 437.839 L
690.784 436.574 L
686.896 427.112 L
704.247 428.966 LE
686.896 427.112 LS
690.784 436.574 L
673.469 435.166 L
669.639 425.118 L
686.896 427.112 LE
669.639 425.118 LS
673.469 435.166 L
658.506 433.944 L
654.727 423.39 L
669.639 425.118 LE
654.727 423.39 LS
658.506 433.944 L
643.316 432.802 L
639.584 421.734 L
654.727 423.39 LE
639.584 421.734 LS
643.316 432.802 L
627.679 431.837 L
623.989 420.239 L
639.584 421.734 LE
623.989 420.239 LS
627.679 431.837 L
611.393 431.179 L
607.734 419.029 L
623.989 420.239 LE
607.734 419.029 LS
611.393 431.179 L
594.296 431.012 L
590.653 418.283 L
607.734 419.029 LE
590.653 418.283 LS
594.296 431.012 L
576.297 431.589 L
572.644 418.25 L
590.653 418.283 LE
572.644 418.25 LS
576.297 431.589 L
557.42 433.233 L
553.722 419.253 L
572.644 418.25 LE
553.722 419.253 LS
557.42 433.233 L
537.847 436.313 L
534.055 421.667 L
553.722 419.253 LE
534.055 421.667 LS
537.847 436.313 L
517.942 441.163 L
514 425.84 L
534.055 421.667 LE
514 425.84 LS
517.942 441.163 L
498.229 447.969 L
494.065 431.974 L
514 425.84 LE
494.065 431.974 LS
498.229 447.969 L
479.269 456.659 L
474.823 440.017 L
494.065 431.974 LE
474.823 440.017 LS
479.269 456.659 L
461.523 466.894 L
456.74 449.645 L
474.823 440.017 LE
456.74 449.645 LS
461.523 466.894 L
445.239 478.182 L
440.082 460.374 L
456.74 449.645 LE
440.082 460.374 LS
445.239 478.182 L
430.449 490.028 L
424.9 471.712 L
440.082 460.374 LE
424.9 471.712 LS
430.449 490.028 L
417.032 502.04 L
411.082 483.262 L
424.9 471.712 LE
411.082 483.262 LS
417.032 502.04 L
404.78 513.966 L
398.435 494.766 L
411.082 483.262 LE
398.435 494.766 LS
404.78 513.966 L
393.455 525.688 L
386.717 506.097 L
398.435 494.766 LE
386.717 506.097 LS
393.455 525.688 L
382.811 537.183 L
375.69 517.226 L
386.717 506.097 LE
375.69 517.226 LS
382.811 537.183 L
372.612 548.498 L
365.114 528.188 L
375.69 517.226 LE
365.114 528.188 LS
372.612 548.498 L
362.633 559.714 L
354.761 539.059 L
365.114 528.188 LE
841.819 414.039 LS
845.212 418.262 L
828.894 423.439 L
825.33 418.649 L
841.819 414.039 LE
825.33 418.649 LS
828.894 423.439 L
811.63 427.437 L
807.939 422.05 L
825.33 418.649 LE
807.939 422.05 LS
811.63 427.437 L
793.767 430.16 L
789.993 424.156 L
807.939 422.05 LE
789.993 424.156 LS
793.767 430.16 L
775.637 431.656 L
771.823 425.025 L
789.993 424.156 LE
771.823 425.025 LS
775.637 431.656 L
757.502 432.078 L
753.684 424.822 L
771.823 425.025 LE
753.684 424.822 LS
757.502 432.078 L
739.524 431.632 L
735.732 423.757 L
753.684 424.822 LE
735.732 423.757 LS
739.524 431.632 L
721.773 430.53 L
718.029 422.043 L
735.732 423.757 LE
718.029 422.043 LS
721.773 430.53 L
704.247 428.966 L
700.568 419.877 L
718.029 422.043 LE
700.568 419.877 LS
704.247 428.966 L
686.896 427.112 L
683.291 417.425 L
700.568 419.877 LE
683.291 417.425 LS
686.896 427.112 L
669.639 425.118 L
666.113 414.838 L
683.291 417.425 LE
666.113 414.838 LS
669.639 425.118 L
654.727 423.39 L
651.269 412.596 L
666.113 414.838 LE
651.269 412.596 LS
654.727 423.39 L
639.584 421.734 L
636.192 410.419 L
651.269 412.596 LE
636.192 410.419 LS
639.584 421.734 L
623.989 420.239 L
620.658 408.388 L
636.192 410.419 LE
620.658 408.388 LS
623.989 420.239 L
607.734 419.029 L
604.455 406.618 L
620.658 408.388 LE
604.455 406.618 LS
607.734 419.029 L
590.653 418.283 L
587.409 405.284 L
604.455 406.618 LE
587.409 405.284 LS
590.653 418.283 L
572.644 418.25 L
569.413 404.629 L
587.409 405.284 LE
569.413 404.629 LS
572.644 418.25 L
553.722 419.253 L
550.467 404.98 L
569.413 404.629 LE
550.467 404.98 LS
553.722 419.253 L
534.055 421.667 L
530.729 406.715 L
550.467 404.98 LE
530.729 406.715 LS
534.055 421.667 L
514 425.84 L
510.541 410.194 L
530.729 406.715 LE
510.541 410.194 LS
514 425.84 L
494.065 431.974 L
490.407 415.637 L
510.541 410.194 LE
490.407 415.637 LS
494.065 431.974 L
474.823 440.017 L
470.898 423.011 L
490.407 415.637 LE
470.898 423.011 LS
474.823 440.017 L
456.74 449.645 L
452.494 432.01 L
470.898 423.011 LE
452.494 432.01 LS
456.74 449.645 L
440.082 460.374 L
435.476 442.159 L
452.494 432.01 LE
435.476 442.159 LS
440.082 460.374 L
424.9 471.712 L
419.912 452.966 L
435.476 442.159 LE
419.912 452.966 LS
424.9 471.712 L
411.082 483.262 L
405.706 464.034 L
419.912 452.966 LE
405.706 464.034 LS
411.082 483.262 L
398.435 494.766 L
392.668 475.094 L
405.706 464.034 LE
392.668 475.094 LS
398.435 494.766 L
386.717 506.097 L
380.568 486.015 L
392.668 475.094 LE
380.568 486.015 LS
386.717 506.097 L
375.69 517.226 L
369.163 496.756 L
380.568 486.015 LE
369.163 496.756 LS
375.69 517.226 L
365.114 528.188 L
358.215 507.348 L
369.163 496.756 LE
358.215 507.348 LS
365.114 528.188 L
354.761 539.059 L
347.494 517.856 L
358.215 507.348 LE
838.545 409.871 LS
841.819 414.039 L
825.33 418.649 L
821.902 413.886 L
838.545 409.871 LE
821.902 413.886 LS
825.33 418.649 L
807.939 422.05 L
804.401 416.66 L
821.902 413.886 LE
804.401 416.66 LS
807.939 422.05 L
789.993 424.156 L
786.389 418.118 L
804.401 416.66 LE
786.389 418.118 LS
789.993 424.156 L
771.823 425.025 L
768.2 418.334 L
786.389 418.118 LE
768.2 418.334 LS
771.823 425.025 L
753.684 424.822 L
750.08 417.478 L
768.2 418.334 LE
750.08 417.478 LS
753.684 424.822 L
735.732 423.757 L
732.177 415.768 L
750.08 417.478 LE
732.177 415.768 LS
735.732 423.757 L
718.029 422.043 L
714.548 413.419 L
732.177 415.768 LE
714.548 413.419 LS
718.029 422.043 L
700.568 419.877 L
697.176 410.626 L
714.548 413.419 LE
697.176 410.626 LS
700.568 419.877 L
683.291 417.425 L
679.998 407.555 L
697.176 410.626 LE
679.998 407.555 LS
683.291 417.425 L
666.113 414.838 L
662.924 404.351 L
679.998 407.555 LE
662.924 404.351 LS
666.113 414.838 L
651.269 412.596 L
648.171 401.577 L
662.924 404.351 LE
648.171 401.577 LS
651.269 412.596 L
636.192 410.419 L
633.182 398.859 L
648.171 401.577 LE
633.182 398.859 LS
636.192 410.419 L
620.658 408.388 L
617.731 396.27 L
633.182 398.859 LE
617.731 396.27 LS
620.658 408.388 L
604.455 406.618 L
601.602 393.919 L
617.731 396.27 LE
601.602 393.919 LS
604.455 406.618 L
587.409 405.284 L
584.615 391.973 L
601.602 393.919 LE
584.615 391.973 LS
587.409 405.284 L
569.413 404.629 L
566.654 390.671 L
584.615 391.973 LE
566.654 390.671 LS
569.413 404.629 L
550.467 404.98 L
547.708 390.34 L
566.654 390.671 LE
547.708 390.34 LS
550.467 404.98 L
530.729 406.715 L
527.92 391.364 L
547.708 390.34 LE
527.92 391.364 LS
530.729 406.715 L
510.541 410.194 L
507.62 394.115 L
527.92 391.364 LE
507.62 394.115 LS
510.541 410.194 L
490.407 415.637 L
487.304 398.831 L
507.62 394.115 LE
487.304 398.831 LS
490.407 415.637 L
470.898 423.011 L
467.543 405.498 L
487.304 398.831 LE
467.543 405.498 LS
470.898 423.011 L
452.494 432.01 L
448.827 413.83 L
467.543 405.498 LE
448.827 413.83 LS
452.494 432.01 L
435.476 442.159 L
431.455 423.36 L
448.827 413.83 LE
431.455 423.36 LS
435.476 442.159 L
419.912 452.966 L
415.512 433.601 L
431.455 423.36 LE
415.512 433.601 LS
419.912 452.966 L
405.706 464.034 L
400.917 444.149 L
415.512 433.601 LE
400.917 444.149 LS
405.706 464.034 L
392.668 475.094 L
387.489 454.735 L
400.917 444.149 LE
387.489 454.735 LS
392.668 475.094 L
380.568 486.015 L
375.004 465.212 L
387.489 454.735 LE
375.004 465.212 LS
380.568 486.015 L
369.163 496.756 L
363.221 475.538 L
375.004 465.212 LE
363.221 475.538 LS
369.163 496.756 L
358.215 507.348 L
351.899 485.729 L
363.221 475.538 LE
351.899 485.729 LS
358.215 507.348 L
347.494 517.856 L
340.806 495.844 L
351.899 485.729 LE
835.399 405.761 LS
838.545 409.871 L
821.902 413.886 L
818.617 409.152 L
835.399 405.761 LE
818.617 409.152 LS
821.902 413.886 L
804.401 416.66 L
801.024 411.27 L
818.617 409.152 LE
801.024 411.27 LS
804.401 416.66 L
786.389 418.118 L
782.972 412.056 L
801.024 411.27 LE
782.972 412.056 LS
786.389 418.118 L
768.2 418.334 L
764.787 411.593 L
782.972 412.056 LE
764.787 411.593 LS
768.2 418.334 L
750.08 417.478 L
746.711 410.061 L
764.787 411.593 LE
746.711 410.061 LS
750.08 417.478 L
732.177 415.768 L
728.885 407.684 L
746.711 410.061 LE
728.885 407.684 LS
732.177 415.768 L
714.548 413.419 L
711.356 404.679 L
728.885 407.684 LE
711.356 404.679 LS
714.548 413.419 L
697.176 410.626 L
694.1 401.239 L
711.356 404.679 LE
694.1 401.239 LS
697.176 410.626 L
679.998 407.555 L
677.049 397.529 L
694.1 401.239 LE
677.049 397.529 LS
679.998 407.555 L
662.924 404.351 L
660.106 393.691 L
677.049 397.529 LE
660.106 393.691 LS
662.924 404.351 L
648.171 401.577 L
645.466 390.368 L
660.106 393.691 LE
645.466 390.368 LS
648.171 401.577 L
633.182 398.859 L
630.59 387.093 L
645.466 390.368 LE
630.59 387.093 LS
633.182 398.859 L
617.731 396.27 L
615.246 383.929 L
630.59 387.093 LE
615.246 383.929 LS
617.731 396.27 L
601.602 393.919 L
599.216 380.978 L
615.246 383.929 LE
599.216 380.978 LS
601.602 393.919 L
584.615 391.973 L
582.313 378.399 L
599.216 380.978 LE
582.313 378.399 LS
584.615 391.973 L
566.654 390.671 L
564.413 376.428 L
582.313 378.399 LE
564.413 376.428 LS
566.654 390.671 L
547.708 390.34 L
545.493 375.391 L
564.413 376.428 LE
545.493 375.391 LS
547.708 390.34 L
527.92 391.364 L
525.681 375.675 L
545.493 375.391 LE
525.681 375.675 LS
527.92 391.364 L
507.62 394.115 L
505.292 377.666 L
525.681 375.675 LE
505.292 377.666 LS
507.62 394.115 L
487.304 398.831 L
484.814 381.621 L
505.292 377.666 LE
484.814 381.621 LS
487.304 398.831 L
467.543 405.498 L
464.817 387.546 L
484.814 381.621 LE
464.817 387.546 LS
467.543 405.498 L
448.827 413.83 L
445.804 395.173 L
464.817 387.546 LE
445.804 395.173 LS
448.827 413.83 L
431.455 423.36 L
428.089 404.049 L
445.804 395.173 LE
428.089 404.049 LS
431.455 423.36 L
415.512 433.601 L
411.775 413.688 L
428.089 404.049 LE
411.775 413.688 LS
415.512 433.601 L
400.917 444.149 L
396.796 423.684 L
411.775 413.688 LE
396.796 423.684 LS
400.917 444.149 L
387.489 454.735 L
382.983 433.761 L
396.796 423.684 LE
382.983 433.761 LS
387.489 454.735 L
375.004 465.212 L
370.116 443.766 L
382.983 433.761 LE
370.116 443.766 LS
375.004 465.212 L
363.221 475.538 L
357.955 453.643 L
370.116 443.766 LE
357.955 453.643 LS
363.221 475.538 L
351.899 485.729 L
346.261 463.405 L
357.955 453.643 LE
346.261 463.405 LS
351.899 485.729 L
340.806 495.844 L
334.799 473.099 L
346.261 463.405 LE
832.384 401.703 LS
835.399 405.761 L
818.617 409.152 L
815.486 404.446 L
832.384 401.703 LE
815.486 404.446 LS
818.617 409.152 L
801.024 411.27 L
797.824 405.886 L
815.486 404.446 LE
797.824 405.886 LS
801.024 411.27 L
782.972 412.056 L
779.755 405.976 L
797.824 405.886 LE
779.755 405.976 LS
782.972 412.056 L
764.787 411.593 L
761.601 404.813 L
779.755 405.976 LE
761.601 404.813 LS
764.787 411.593 L
746.711 410.061 L
743.598 402.587 L
761.601 404.813 LE
743.598 402.587 LS
746.711 410.061 L
728.885 407.684 L
725.876 399.526 L
743.598 402.587 LE
725.876 399.526 LS
728.885 407.684 L
711.356 404.679 L
708.476 395.848 L
725.876 399.526 LE
708.476 395.848 LS
711.356 404.679 L
694.1 401.239 L
691.365 391.747 L
708.476 395.848 LE
691.365 391.747 LS
694.1 401.239 L
677.049 397.529 L
674.469 387.384 L
691.365 391.747 LE
674.469 387.384 LS
677.049 397.529 L
660.106 393.691 L
657.687 382.896 L
674.469 387.384 LE
657.687 382.896 LS
660.106 393.691 L
645.466 390.368 L
643.186 379.013 L
657.687 382.896 LE
643.186 379.013 LS
645.466 390.368 L
630.59 387.093 L
628.447 375.167 L
643.186 379.013 LE
628.447 375.167 LS
630.59 387.093 L
615.246 383.929 L
613.235 371.415 L
628.447 375.167 LE
613.235 371.415 LS
615.246 383.929 L
599.216 380.978 L
597.331 367.849 L
613.235 371.415 LE
597.331 367.849 LS
599.216 380.978 L
582.313 378.399 L
580.54 364.621 L
597.331 367.849 LE
580.54 364.621 LS
582.313 378.399 L
564.413 376.428 L
562.729 361.964 L
580.54 364.621 LE
562.729 361.964 LS
564.413 376.428 L
545.493 375.391 L
543.864 360.198 L
562.729 361.964 LE
543.864 360.198 LS
545.493 375.391 L
525.681 375.675 L
524.055 359.72 L
543.864 360.198 LE
524.055 359.72 LS
525.681 375.675 L
505.292 377.666 L
503.604 360.925 L
524.055 359.72 LE
503.604 360.925 LS
505.292 377.666 L
484.814 381.621 L
482.99 364.089 L
503.604 360.925 LE
482.99 364.089 LS
484.814 381.621 L
464.817 387.546 L
462.779 369.24 L
482.99 364.089 LE
462.779 369.24 LS
464.817 387.546 L
445.804 395.173 L
443.487 376.13 L
462.779 369.24 LE
443.487 376.13 LS
445.804 395.173 L
428.089 404.049 L
425.443 384.318 L
443.487 376.13 LE
425.443 384.318 LS
428.089 404.049 L
411.775 413.688 L
408.771 393.321 L
425.443 384.318 LE
408.771 393.321 LS
411.775 413.688 L
396.796 423.684 L
393.417 402.734 L
408.771 393.321 LE
393.417 402.734 LS
396.796 423.684 L
382.983 433.761 L
379.227 412.272 L
393.417 402.734 LE
379.227 412.272 LS
382.983 433.761 L
370.116 443.766 L
365.985 421.774 L
379.227 412.272 LE
365.985 421.774 LS
370.116 443.766 L
357.955 453.643 L
353.452 431.176 L
365.985 421.774 LE
353.452 431.176 LS
357.955 453.643 L
346.261 463.405 L
341.391 440.481 L
353.452 431.176 LE
341.391 440.481 LS
346.261 463.405 L
334.799 473.099 L
329.564 449.726 L
341.391 440.481 LE
829.511 397.69 LS
832.384 401.703 L
815.486 404.446 L
812.517 399.764 L
829.511 397.69 LE
812.517 399.764 LS
815.486 404.446 L
797.824 405.886 L
794.812 400.506 L
812.517 399.764 LE
794.812 400.506 LS
797.824 405.886 L
779.755 405.976 L
776.753 399.884 L
794.812 400.506 LE
776.753 399.884 LS
779.755 405.976 L
761.601 404.813 L
758.66 398.007 L
776.753 399.884 LE
758.66 398.007 LS
761.601 404.813 L
743.598 402.587 L
740.758 395.073 L
758.66 398.007 LE
740.758 395.073 LS
743.598 402.587 L
725.876 399.526 L
723.171 391.315 L
740.758 395.073 LE
723.171 391.315 LS
725.876 399.526 L
708.476 395.848 L
705.929 386.955 L
723.171 391.315 LE
705.929 386.955 LS
708.476 395.848 L
691.365 391.747 L
688.993 382.182 L
705.929 386.955 LE
688.993 382.182 LS
691.365 391.747 L
674.469 387.384 L
672.283 377.156 L
688.993 382.182 LE
672.283 377.156 LS
674.469 387.384 L
657.687 382.896 L
655.69 372.011 L
672.283 377.156 LE
655.69 372.011 LS
657.687 382.896 L
643.186 379.013 L
641.354 367.558 L
655.69 372.011 LE
641.354 367.558 LS
643.186 379.013 L
628.447 375.167 L
626.777 363.135 L
641.354 367.558 LE
626.777 363.135 LS
628.447 375.167 L
613.235 371.415 L
611.726 358.786 L
626.777 363.135 LE
611.726 358.786 LS
613.235 371.415 L
597.331 367.849 L
595.974 354.596 L
611.726 358.786 LE
595.974 354.596 LS
597.331 367.849 L
580.54 364.621 L
579.324 350.709 L
595.974 354.596 LE
579.324 350.709 LS
580.54 364.621 L
562.729 361.964 L
561.632 347.351 L
579.324 350.709 LE
561.632 347.351 LS
562.729 361.964 L
543.864 360.198 L
542.85 344.844 L
561.632 347.351 LE
542.85 344.844 LS
543.864 360.198 L
524.055 359.72 L
523.076 343.585 L
542.85 344.844 LE
523.076 343.585 LS
524.055 359.72 L
503.604 360.925 L
502.593 343.983 L
523.076 343.585 LE
502.593 343.983 LS
503.604 360.925 L
482.99 364.089 L
481.869 346.331 L
502.593 343.983 LE
481.869 346.331 LS
482.99 364.089 L
462.779 369.24 L
461.472 350.682 L
481.869 346.331 LE
461.472 350.682 LS
462.779 369.24 L
443.487 376.13 L
441.923 356.806 L
461.472 350.682 LE
441.923 356.806 LS
443.487 376.13 L
425.443 384.318 L
423.57 364.276 L
441.923 356.806 LE
423.57 364.276 LS
425.443 384.318 L
408.771 393.321 L
406.556 372.616 L
423.57 364.276 LE
406.556 372.616 LS
408.771 393.321 L
393.417 402.734 L
390.844 381.416 L
406.556 372.616 LE
390.844 381.416 LS
393.417 402.734 L
379.227 412.272 L
376.289 390.387 L
390.844 381.416 LE
376.289 390.387 LS
379.227 412.272 L
365.985 421.774 L
362.681 399.36 L
376.289 390.387 LE
362.681 399.36 LS
365.985 421.774 L
353.452 431.176 L
349.789 408.261 L
362.681 399.36 LE
349.789 408.261 LS
353.452 431.176 L
341.391 440.481 L
337.371 417.082 L
349.789 408.261 LE
337.371 417.082 LS
341.391 440.481 L
329.564 449.726 L
325.189 425.855 L
337.371 417.082 LE
826.785 393.708 LS
829.511 397.69 L
812.517 399.764 L
809.721 395.1 L
826.785 393.708 LE
809.721 395.1 LS
812.517 399.764 L
794.812 400.506 L
792.001 395.132 L
809.721 395.1 LE
792.001 395.132 LS
794.812 400.506 L
776.753 399.884 L
773.982 393.787 L
792.001 395.132 LE
773.982 393.787 LS
776.753 399.884 L
758.66 398.007 L
755.978 391.185 L
773.982 393.787 LE
755.978 391.185 LS
758.66 398.007 L
740.758 395.073 L
738.208 387.537 L
755.978 391.185 LE
738.208 387.537 LS
740.758 395.073 L
723.171 391.315 L
720.786 383.077 L
738.208 387.537 LE
720.786 383.077 LS
723.171 391.315 L
705.929 386.955 L
703.733 378.029 L
720.786 383.077 LE
703.733 378.029 LS
705.929 386.955 L
688.993 382.182 L
687.002 372.582 L
703.733 378.029 LE
687.002 372.582 LS
688.993 382.182 L
672.283 377.156 L
670.506 366.89 L
687.002 372.582 LE
670.506 366.89 LS
672.283 377.156 L
655.69 372.011 L
654.133 361.083 L
670.506 366.89 LE
654.133 361.083 LS
655.69 372.011 L
641.354 367.558 L
639.986 356.06 L
654.133 361.083 LE
639.986 356.06 LS
641.354 367.558 L
626.777 363.135 L
625.599 351.056 L
639.986 356.06 LE
625.599 351.056 LS
626.777 363.135 L
611.726 358.786 L
610.734 346.107 L
625.599 351.056 LE
610.734 346.107 LS
611.726 358.786 L
595.974 354.596 L
595.163 341.29 L
610.734 346.107 LE
595.163 341.29 LS
595.974 354.596 L
579.324 350.709 L
578.682 336.738 L
595.163 341.29 LE
578.682 336.738 LS
579.324 350.709 L
561.632 347.351 L
561.139 332.674 L
578.682 336.738 LE
561.139 332.674 LS
561.632 347.351 L
542.85 344.844 L
542.473 329.416 L
561.139 332.674 LE
542.473 329.416 LS
542.85 344.844 L
523.076 343.585 L
522.764 327.365 L
542.473 329.416 LE
522.764 327.365 LS
523.076 343.585 L
502.593 343.983 L
502.282 326.942 L
522.764 327.365 LE
502.282 326.942 LS
502.593 343.983 L
481.869 346.331 L
481.481 328.458 L
502.282 326.942 LE
481.481 328.458 LS
481.869 346.331 L
461.472 350.682 L
460.927 331.988 L
481.481 328.458 LE
460.927 331.988 LS
461.472 350.682 L
441.923 356.806 L
441.147 337.323 L
460.927 331.988 LE
441.147 337.323 LS
441.923 356.806 L
423.57 364.276 L
422.511 344.052 L
441.147 337.323 LE
422.511 344.052 LS
423.57 364.276 L
406.556 372.616 L
405.175 351.702 L
422.511 344.052 LE
405.175 351.702 LS
406.556 372.616 L
390.844 381.416 L
389.123 359.865 L
405.175 351.702 LE
389.123 359.865 LS
390.844 381.416 L
376.289 390.387 L
374.22 368.246 L
389.123 359.865 LE
374.22 368.246 LS
376.289 390.387 L
362.681 399.36 L
360.264 376.666 L
374.22 368.246 LE
360.264 376.666 LS
362.681 399.36 L
349.789 408.261 L
347.025 385.044 L
360.264 376.666 LE
347.025 385.044 LS
349.789 408.261 L
337.371 417.082 L
334.263 393.36 L
347.025 385.044 LE
334.263 393.36 LS
337.371 417.082 L
325.189 425.855 L
321.738 401.637 L
334.263 393.36 LE
824.216 389.745 LS
826.785 393.708 L
809.721 395.1 L
807.111 390.446 L
824.216 389.745 LE
807.111 390.446 LS
809.721 395.1 L
792.001 395.132 L
789.403 389.762 L
807.111 390.446 LE
789.403 389.762 LS
792.001 395.132 L
773.982 393.787 L
771.454 387.689 L
789.403 389.762 LE
771.454 387.689 LS
773.982 393.787 L
755.978 391.185 L
753.569 384.362 L
771.454 387.689 LE
753.569 384.362 LS
755.978 391.185 L
738.208 387.537 L
735.962 379.997 L
753.569 384.362 LE
735.962 379.997 LS
738.208 387.537 L
720.786 383.077 L
718.734 374.837 L
735.962 379.997 LE
718.734 374.837 LS
720.786 383.077 L
703.733 378.029 L
701.899 369.103 L
718.734 374.837 LE
701.899 369.103 LS
703.733 378.029 L
687.002 372.582 L
685.402 362.984 L
701.899 369.103 LE
685.402 362.984 LS
687.002 372.582 L
670.506 366.89 L
669.15 356.63 L
685.402 362.984 LE
669.15 356.63 LS
670.506 366.89 L
654.133 361.083 L
653.025 350.166 L
669.15 356.63 LE
653.025 350.166 LS
654.133 361.083 L
639.986 356.06 L
639.093 344.575 L
653.025 350.166 LE
639.093 344.575 LS
639.986 356.06 L
625.599 351.056 L
624.92 338.993 L
639.093 344.575 LE
624.92 338.993 LS
625.599 351.056 L
610.734 346.107 L
610.267 333.448 L
624.92 338.993 LE
610.267 333.448 LS
610.734 346.107 L
595.163 341.29 L
594.904 328.004 L
610.267 333.448 LE
594.904 328.004 LS
595.163 341.29 L
578.682 336.738 L
578.62 322.79 L
594.904 328.004 LE
578.62 322.79 LS
578.682 336.738 L
561.139 332.674 L
561.255 318.019 L
578.62 322.79 LE
561.255 318.019 LS
561.139 332.674 L
542.473 329.416 L
542.736 314.009 L
561.255 318.019 LE
542.736 314.009 LS
542.473 329.416 L
522.764 327.365 L
523.127 311.164 L
542.736 314.009 LE
523.127 311.164 LS
522.764 327.365 L
502.282 326.942 L
502.679 309.913 L
523.127 311.164 LE
502.679 309.913 LS
502.282 326.942 L
481.481 328.458 L
481.834 310.586 L
502.679 309.913 LE
481.834 310.586 LS
481.481 328.458 L
460.927 331.988 L
461.153 313.282 L
481.834 310.586 LE
461.153 313.282 LS
460.927 331.988 L
441.147 337.323 L
441.174 317.813 L
461.153 313.282 LE
441.174 317.813 LS
441.147 337.323 L
422.511 344.052 L
422.281 323.783 L
441.174 317.813 LE
422.281 323.783 LS
422.511 344.052 L
405.175 351.702 L
404.65 330.726 L
422.281 323.783 LE
404.65 330.726 LS
405.175 351.702 L
389.123 359.865 L
388.281 338.233 L
404.65 330.726 LE
388.281 338.233 LS
389.123 359.865 L
374.22 368.246 L
373.051 346.005 L
388.281 338.233 LE
373.051 346.005 LS
374.22 368.246 L
360.264 376.666 L
358.766 353.854 L
373.051 346.005 LE
358.766 353.854 LS
360.264 376.666 L
347.025 385.044 L
345.199 361.689 L
358.766 353.854 LE
345.199 361.689 LS
347.025 385.044 L
334.263 393.36 L
332.112 369.482 L
345.199 361.689 LE
332.112 369.482 LS
334.263 393.36 L
321.738 401.637 L
319.262 377.246 L
332.112 369.482 LE
821.817 385.786 LS
824.216 389.745 L
807.111 390.446 L
804.697 385.795 L
821.817 385.786 LE
804.697 385.795 LS
807.111 390.446 L
789.403 389.762 L
787.032 384.394 L
804.697 385.795 LE
787.032 384.394 LS
789.403 389.762 L
771.454 387.689 L
769.18 381.596 L
787.032 384.394 LE
769.18 381.596 LS
771.454 387.689 L
753.569 384.362 L
751.445 377.548 L
769.18 381.596 LE
751.445 377.548 LS
753.569 384.362 L
735.962 379.997 L
734.029 372.475 L
751.445 377.548 LE
734.029 372.475 LS
735.962 379.997 L
718.734 374.837 L
717.024 366.622 L
734.029 372.475 LE
717.024 366.622 LS
718.734 374.837 L
701.899 369.103 L
700.434 360.212 L
717.024 366.622 LE
700.434 360.212 LS
701.899 369.103 L
685.402 362.984 L
684.199 353.43 L
700.434 360.212 LE
684.199 353.43 LS
685.402 362.984 L
669.15 356.63 L
668.217 346.424 L
684.199 353.43 LE
668.217 346.424 LS
669.15 356.63 L
653.025 350.166 L
652.367 339.312 L
668.217 346.424 LE
652.367 339.312 LS
653.025 350.166 L
639.093 344.575 L
638.672 333.162 L
652.367 339.312 LE
638.672 333.162 LS
639.093 344.575 L
624.92 338.993 L
624.737 327.012 L
638.672 333.162 LE
624.737 327.012 LS
624.92 338.993 L
610.267 333.448 L
610.32 320.878 L
624.737 327.012 LE
610.32 320.878 LS
610.267 333.448 L
594.904 328.004 L
595.19 314.817 L
610.32 320.878 LE
595.19 314.817 LS
594.904 328.004 L
578.62 322.79 L
579.13 308.948 L
595.19 314.817 LE
579.13 308.948 LS
578.62 322.79 L
561.255 318.019 L
561.973 303.479 L
579.13 308.948 LE
561.973 303.479 LS
561.255 318.019 L
542.736 314.009 L
543.631 298.723 L
561.973 303.479 LE
543.631 298.723 LS
542.736 314.009 L
523.127 311.164 L
524.153 295.086 L
543.631 298.723 LE
524.153 295.086 LS
523.127 311.164 L
502.679 309.913 L
503.772 293.009 L
524.153 295.086 LE
503.772 293.009 LS
502.679 309.913 L
481.834 310.586 L
482.917 292.838 L
503.772 293.009 LE
482.917 292.838 LS
481.834 310.586 L
461.153 313.282 L
462.144 294.695 L
482.917 292.838 LE
462.144 294.695 LS
461.153 313.282 L
441.174 317.813 L
441.999 298.414 L
462.144 294.695 LE
441.999 298.414 LS
441.174 317.813 L
422.281 323.783 L
422.879 303.614 L
441.999 298.414 LE
422.879 303.614 LS
422.281 323.783 L
404.65 330.726 L
404.981 309.839 L
422.879 303.614 LE
404.981 309.839 LS
404.65 330.726 L
388.281 338.233 L
388.322 316.678 L
404.981 309.839 LE
388.322 316.678 LS
388.281 338.233 L
373.051 346.005 L
372.79 323.826 L
388.322 316.678 LE
372.79 323.826 LS
373.051 346.005 L
358.766 353.854 L
358.199 331.091 L
372.79 323.826 LE
358.199 331.091 LS
358.766 353.854 L
345.199 361.689 L
344.327 338.371 L
358.199 331.091 LE
344.327 338.371 LS
345.199 361.689 L
332.112 369.482 L
330.934 345.628 L
344.327 338.371 LE
330.934 345.628 LS
332.112 369.482 L
319.262 377.246 L
317.782 352.866 L
330.934 345.628 LE
819.581 381.871 LS
821.817 385.786 L
804.697 385.795 L
802.474 381.187 L
819.581 381.871 LE
802.474 381.187 LS
804.697 385.795 L
787.032 384.394 L
784.88 379.072 L
802.474 381.187 LE
784.88 379.072 LS
787.032 384.394 L
769.18 381.596 L
767.156 375.554 L
784.88 379.072 LE
767.156 375.554 LS
769.18 381.596 L
751.445 377.548 L
749.6 370.792 L
767.156 375.554 LE
749.6 370.792 LS
751.445 377.548 L
734.029 372.475 L
732.403 365.018 L
749.6 370.792 LE
732.403 365.018 LS
734.029 372.475 L
717.024 366.622 L
715.649 358.481 L
732.403 365.018 LE
715.649 358.481 LS
717.024 366.622 L
700.434 360.212 L
699.333 351.405 L
715.649 358.481 LE
699.333 351.405 LS
700.434 360.212 L
684.199 353.43 L
683.385 343.971 L
699.333 351.405 LE
683.385 343.971 LS
684.199 353.43 L
668.217 346.424 L
667.7 336.324 L
683.385 343.971 LE
667.7 336.324 LS
668.217 346.424 L
652.367 339.312 L
652.151 328.577 L
667.7 336.324 LE
652.151 328.577 LS
652.367 339.312 L
638.672 333.162 L
638.716 321.877 L
652.151 328.577 LE
638.716 321.877 LS
638.672 333.162 L
624.737 327.012 L
625.041 315.168 L
638.716 321.877 LE
625.041 315.168 LS
624.737 327.012 L
610.32 320.878 L
610.885 308.456 L
625.041 315.168 LE
610.885 308.456 LS
610.32 320.878 L
595.19 314.817 L
596.012 301.787 L
610.885 308.456 LE
596.012 301.787 LS
595.19 314.817 L
579.13 308.948 L
580.203 295.273 L
596.012 301.787 LE
580.203 295.273 LS
579.13 308.948 L
561.973 303.479 L
563.281 289.114 L
580.203 295.273 LE
563.281 289.114 LS
561.973 303.479 L
543.631 298.723 L
545.147 283.619 L
563.281 289.114 LE
545.147 283.619 LS
543.631 298.723 L
524.153 295.086 L
525.832 279.198 L
545.147 283.619 LE
525.832 279.198 LS
524.153 295.086 L
503.772 293.009 L
505.552 276.297 L
525.832 279.198 LE
505.552 276.297 LS
503.772 293.009 L
482.917 292.838 L
484.721 275.282 L
505.552 276.297 LE
484.721 275.282 LS
482.917 292.838 L
462.144 294.695 L
463.89 276.297 L
484.721 275.282 LE
463.89 276.297 LS
462.144 294.695 L
441.999 298.414 L
443.61 279.198 L
463.89 276.297 LE
443.61 279.198 LS
441.999 298.414 L
422.879 303.614 L
424.295 283.619 L
443.61 279.198 LE
424.295 283.619 LS
422.879 303.614 L
404.981 309.839 L
406.161 289.114 L
424.295 283.619 LE
406.161 289.114 LS
404.981 309.839 L
388.322 316.678 L
389.239 295.273 L
406.161 289.114 LE
389.239 295.273 LS
388.322 316.678 L
372.79 323.826 L
373.43 301.787 L
389.239 295.273 LE
373.43 301.787 LS
372.79 323.826 L
358.199 331.091 L
358.557 308.456 L
373.43 301.787 LE
358.557 308.456 LS
358.199 331.091 L
344.327 338.371 L
344.401 315.168 L
358.557 308.456 LE
344.401 315.168 LS
344.327 338.371 L
330.934 345.628 L
330.726 321.877 L
344.401 315.168 LE
330.726 321.877 LS
330.934 345.628 L
317.782 352.866 L
317.291 328.577 L
330.726 321.877 LE

0 0 1 setrgbcolor 2.5 setlinewidth
317.291 328.577 LS
330.726 321.877 L
344.401 315.168 L
358.557 308.456 L
373.43 301.787 L
389.239 295.273 L
406.161 289.114 L
424.295 283.619 L
443.61 279.198 L
463.89 276.297 L
484.721 275.282 L
505.552 276.297 L
525.832 279.198 L
545.147 283.619 L
563.281 289.114 L
580.203 295.273 L
596.012 301.787 L
610.885 308.456 L
625.041 315.168 L
638.716 321.877 L
652.151 328.577 L
667.7 336.324 L
683.385 343.971 L
699.333 351.405 L
715.649 358.481 L
732.403 365.018 L
749.6 370.792 L
767.156 375.554 L
784.88 379.072 L
802.474 381.187 L
819.581 381.871 LE

1 0 0 setrgbcolor 2.5 setlinewidth
673.469 221.988 LS
669.639 232.036 L
666.113 242.316 L
662.924 252.803 L
660.106 263.463 L
657.687 274.258 L
655.69 285.143 L
654.133 296.071 L
653.025 306.988 L
652.367 317.841 L
652.151 328.577 L
652.367 339.312 L
653.025 350.166 L
654.133 361.083 L
655.69 372.011 L
657.687 382.896 L
660.106 393.691 L
662.924 404.351 L
666.113 414.838 L
669.639 425.118 L
673.469 435.166 LE

(D) 830 375 15 /Helvetica S
(A) 675 208 15 /Helvetica S
(B) 673 443 15 /Helvetica S
(C) 300 325 15 /Helvetica S
gsave 0 setgray % 0 0.35 0 setrgbcolor
652.151 328.577 moveto
652.151 328.577 3 0 360 arc fill
819.581 381.871 moveto
819.581 381.871 3 0 360 arc fill
673.469 221.988 moveto
673.469 221.988 3 0 360 arc fill
673.469 435.166 moveto
673.469 435.166 3 0 360 arc fill
317.291 328.577 moveto
317.291 328.577 3 0 360 arc fill
grestore

grestore
showpage
cleartomark
%%PageTrailer
%%Trailer
end
%%EOF
