%!PS-Adobe-3.0 EPSF-3.0
%%Title:                     bridge
%%BoundingBox:     -2   -3   175   120
%%EndComments


% these procedures have been posted in comp.lang.postscript
% by Bill Lee, bill@leeweyr.sccsi.com, on Apr 19 1995
% subject: arc with arrow head


%* _____________________________ Arrows ____________________________________
%* Procedure to draw the path for an arrow head. Note: the arrowhead will be
%* added to the current path. The arrowhead will also be drawn and filled.
%*
%*      Usage:  Linewidth PreviousX PreviousY
%*                      ArrowHead
%*              
%*                 where: LineWidth is the width in points of the arrow head
%*                        lines
%*
%*                        PreviousX and PreviousY along with the currentpoint
%*                        define the direction that the arrow points
%*
%*              Note: If Linewidth is zero, a value of 1 will be substituted
/ArrowHead {
          currentpoint moveto
          currentpoint
          4 2 roll exch 4 -1 roll exch
          sub 3 1 roll sub
          exch atan matrix currentmatrix exch rotate exch
          dup 0 eq
            { pop 1 } if
          dup scale
          -7 2 rlineto
          1 -2 rlineto
          -1 -2 rlineto
          7 2 rlineto
          currentpoint
          gsave
            newpath moveto
            -7 2 rlineto
            1 -2 rlineto
            -1 -2 rlineto
            closepath
            fill
          grestore
          setmatrix
} bind def

%* _____________________________ RLineto^ ____________________________________
%* Procedure to add a relative line to the current path and then add the
%* path for an arrow on its end.
%*
%*      Usage:  x y RLineto^
%*
%*                where: x and y are the offsets from the current point
%*              
/RLineto^ {
        currentlinewidth currentpoint 5 3 roll
        rlineto
        ArrowHead
} bind def

%* _____________________________ Lineto^ ____________________________________
%* Procedure to add a line to the current path and then add the
%* path for an arrow on its end.
%*
%*      Usage:  x y Lineto^
%*
%*                where: x and y are the new points for the path
%*              
/Lineto^ {
        currentlinewidth currentpoint 5 3 roll
        lineto
        ArrowHead
} bind def

%* _____________________________ Arc^ ____________________________________
%* Procedure to add an arc to the current path and then add the
%* path for arrow on its end.
%*
%*      Usage:  x y r ang1 ang2 Arc^
%*
%*                where: x, y, ang1, ang2, and r are the normal parameters
%*                       for drawing an arc.
%*              
/Arc^ {
        5 copy arc
        exch pop 2 sub
        dup cos 2 index mul 4 index add
        exch sin 2 index mul 3 index add
        currentlinewidth  3 1 roll
        ArrowHead pop pop pop
} bind def

%* _____________________________ Arcn^ ____________________________________
%* Procedure to add an arc to the current path and then add the
%* path for arrow on its end.
%*
%*      Usage:  x y r ang1 ang2 Arcn^
%*
%*                where: x, y, ang1, ang2, and r are the normal parameters
%*                       for drawing an arcn.
%*              
/Arcn^ {
        5 copy arcn
        exch pop 2 add
        dup cos 2 index mul 4 index add
        exch sin 2 index mul 3 index add
        currentlinewidth  3 1 roll
        ArrowHead pop pop pop
} bind def


1 setlinecap

gsave 0 setlinewidth 0.9 setgray
0 8 moveto 20 14 lineto
60 20 lineto 80 55 lineto 100 20 lineto
140 14 lineto 160 8 lineto
156 6 149 2 145 1 curveto
140 -1 132 -2 125 0 curveto
119 3 114 5 110 5 curveto
104 6 97 6 92 5 curveto
81 3 78 5 70 5 curveto
64 6 56 5 52 5 curveto
46 5 38 4 33 1 curveto
27 -2 18 -1 14 0 curveto
9 2 4 2 0 8 curveto
closepath fill grestore

1 0.5 0 setrgbcolor

0 8 moveto 20 14 Lineto^
60 20 Lineto^ 80 55 Lineto^ 100 20 Lineto^
140 14 Lineto^ 160 8 lineto stroke

170 110 moveto 130 95 Lineto^ 90 90 Lineto^
50 95 Lineto^ 10 110 Lineto^ stroke

0.5 setlinewidth

60 20 moveto 100 20 lineto stroke
20 14 moveto 14 0 lineto stroke
20 14 moveto 33 1 lineto stroke
60 20 moveto 52 5 lineto stroke
60 20 moveto 70 5 lineto stroke
100 20 moveto 92 5 lineto stroke
100 20 moveto 110 5 lineto stroke
140 14 moveto 125 0 lineto stroke
140 14 moveto 145 1 lineto stroke

gsave
0.9 setlinewidth 0.9 0.4 0.4 setrgbcolor
87 88 moveto 88 90 Lineto^ stroke
83 57 moveto 82 55 Lineto^ stroke
[3 3] 0 setdash
78 55 moveto 88 90 Lineto^ stroke
92 90 moveto 82 55 Lineto^ stroke
grestore

0 setgray
80 55 moveto 80 55 1.6 0 360 arc fill
0 0 1 setrgbcolor
90 90 moveto 90 90 2 0 360 arc fill
50 95 moveto 50 95 2 0 360 arc fill

/Helvetica findfont 10 scalefont setfont	
67 51 moveto (P) show
88 97 moveto (Q) show
52 26 moveto (A) show
103 24 moveto (B) show
130 85 moveto (E) show
50 83 moveto (F) show


showpage
%%Trailer
%EOF
