%!PS-Adobe-3.0 EPSF-3.0
%%Title:                     fill-angle-60
%%BoundingBox:     35   20   158   80
%%EndComments

1 setlinecap

0 setlinewidth 0.9 setgray
40 60 moveto
66 60 lineto   % A
85 35 lineto   % B
105 65 lineto  % C
138 66 lineto
155 72 lineto
155 67 148 59 144 55 curveto
137 50 131 44 130 36 curveto
129 32 131 29 127 25 curveto
123 22 117 24 113 25 curveto
106 27 94 27 90 25 curveto
86 23 79 22 75 25 curveto
66 30 62 42 58 45 curveto
53 51 42 51 40 60 curveto
closepath fill

1.2 setlinewidth
1 0.5 0 setrgbcolor
40 60 moveto
66 60 lineto   % A
85 35 lineto   % B
105 65 lineto  % C
138 66 lineto
155 72 lineto
% 120 35 lineto
% 150 40 lineto
stroke

0.7 setlinewidth
90 25 moveto
85 35 lineto
120 35 lineto
113 25 lineto
stroke

105 65 moveto 120 35 lineto 138 66 lineto 144 55 lineto stroke
120 35 moveto 130 36 lineto stroke
120 35 moveto 127 25 lineto stroke
66 60 moveto 58 45 lineto stroke
85 35 moveto 75 25 lineto stroke

gsave
[3 3] 0 setdash
0.8 setlinewidth
0.9 0.4 0.4 setrgbcolor
66 60 moveto 105 65 lineto stroke
grestore

% 0 setgray 85 35 moveto
% 85 35 1.6 0 360 arc fill

/Helvetica findfont 10 scalefont setfont	
60 63 moveto (A) show
74 32 moveto (B) show
100 67 moveto (C) show


showpage
%%Trailer
%EOF
