%!PS-Adobe-3.0 EPSF-3.0
%%Title: gelly-02
%%Creator: GL2PS 1.4.3, (C) 1999-2020 C. Geuzaine
%%For: Gmsh
%%CreationDate: Sat Nov 23 23:34:38 2024
%%LanguageLevel: 3
%%DocumentData: Clean7Bit
%%Pages: 1
%%BoundingBox: 163 123 1003 530
%%EndComments
%%BeginProlog
/gl2psdict 64 dict def gl2psdict begin
/tryPS3shading false def % set to false to force subdivision
/rThreshold 0.0666667 def % red component subdivision threshold
/gThreshold 0.05 def % green component subdivision threshold
/bThreshold 0.1 def % blue component subdivision threshold
/BD { bind def } bind def
/C  { setrgbcolor } BD
/G  { 0.082 mul exch 0.6094 mul add exch 0.3086 mul add neg 1.0 add setgray } BD
/W  { setlinewidth } BD
/LC  { setlinecap } BD
/LJ  { setlinejoin } BD
/FC { findfont exch /SH exch def SH scalefont setfont } BD
/SW { dup stringwidth pop } BD
/S  { FC moveto show } BD
/SBC{ FC moveto SW -2 div 0 rmoveto show } BD
/SBR{ FC moveto SW neg 0 rmoveto show } BD
/SCL{ FC moveto 0 SH -2 div rmoveto show } BD
/SCC{ FC moveto SW -2 div SH -2 div rmoveto show } BD
/SCR{ FC moveto SW neg SH -2 div rmoveto show } BD
/STL{ FC moveto 0 SH neg rmoveto show } BD
/STC{ FC moveto SW -2 div SH neg rmoveto show } BD
/STR{ FC moveto SW neg SH neg rmoveto show } BD
/FCT { FC translate 0 0 } BD
/SR  { gsave FCT moveto rotate show grestore } BD
/SBCR{ gsave FCT moveto rotate SW -2 div 0 rmoveto show grestore } BD
/SBRR{ gsave FCT moveto rotate SW neg 0 rmoveto show grestore } BD
/SCLR{ gsave FCT moveto rotate 0 SH -2 div rmoveto show grestore} BD
/SCCR{ gsave FCT moveto rotate SW -2 div SH -2 div rmoveto show grestore} BD
/SCRR{ gsave FCT moveto rotate SW neg SH -2 div rmoveto show grestore} BD
/STLR{ gsave FCT moveto rotate 0 SH neg rmoveto show grestore } BD
/STCR{ gsave FCT moveto rotate SW -2 div SH neg rmoveto show grestore } BD
/STRR{ gsave FCT moveto rotate SW neg SH neg rmoveto show grestore } BD
/P  { newpath 0.0 360.0 arc closepath fill } BD
/R  { newpath moveto lineto lineto lineto closepath fill } BD
/LS { newpath moveto } BD
/L  { lineto } BD
/LE { lineto stroke } BD
/T  { newpath moveto lineto lineto closepath fill } BD
/STshfill {
      /b1 exch def /g1 exch def /r1 exch def /y1 exch def /x1 exch def
      /b2 exch def /g2 exch def /r2 exch def /y2 exch def /x2 exch def
      /b3 exch def /g3 exch def /r3 exch def /y3 exch def /x3 exch def
      gsave << /ShadingType 4 /ColorSpace [/DeviceRGB]
      /DataSource [ 0 x1 y1 r1 g1 b1 0 x2 y2 r2 g2 b2 0 x3 y3 r3 g3 b3 ] >>
      shfill grestore } BD
/Tm { 3 -1 roll 8 -1 roll 13 -1 roll add add 3 div
      3 -1 roll 7 -1 roll 11 -1 roll add add 3 div
      3 -1 roll 6 -1 roll 9 -1 roll add add 3 div C T } BD
/STsplit {
      4 index 15 index add 0.5 mul
      4 index 15 index add 0.5 mul
      4 index 15 index add 0.5 mul
      4 index 15 index add 0.5 mul
      4 index 15 index add 0.5 mul
      5 copy 5 copy 25 15 roll
      9 index 30 index add 0.5 mul
      9 index 30 index add 0.5 mul
      9 index 30 index add 0.5 mul
      9 index 30 index add 0.5 mul
      9 index 30 index add 0.5 mul
      5 copy 5 copy 35 5 roll 25 5 roll 15 5 roll
      4 index 10 index add 0.5 mul
      4 index 10 index add 0.5 mul
      4 index 10 index add 0.5 mul
      4 index 10 index add 0.5 mul
      4 index 10 index add 0.5 mul
      5 copy 5 copy 40 5 roll 25 5 roll 15 5 roll 25 5 roll
      STnoshfill STnoshfill STnoshfill STnoshfill } BD
/STnoshfill {
      2 index 8 index sub abs rThreshold gt
      { STsplit }
      { 1 index 7 index sub abs gThreshold gt
        { STsplit }
        { dup 6 index sub abs bThreshold gt
          { STsplit }
          { 2 index 13 index sub abs rThreshold gt
            { STsplit }
            { 1 index 12 index sub abs gThreshold gt
              { STsplit }
              { dup 11 index sub abs bThreshold gt
                { STsplit }
                { 7 index 13 index sub abs rThreshold gt
                  { STsplit }
                  { 6 index 12 index sub abs gThreshold gt
                    { STsplit }
                    { 5 index 11 index sub abs bThreshold gt
                      { STsplit }
                      { Tm }
                      ifelse }
                    ifelse }
                  ifelse }
                ifelse }
              ifelse }
            ifelse }
          ifelse }
        ifelse }
      ifelse } BD
tryPS3shading
{ /shfill where
  { /ST { STshfill } BD }
  { /ST { STnoshfill } BD }
  ifelse }
{ /ST { STnoshfill } BD }
ifelse
end
%%EndProlog
%%BeginSetup
/DeviceRGB setcolorspace
gl2psdict begin
%%EndSetup
%%Page: 1 1
%%BeginPageSetup
%%EndPageSetup
mark
gsave
1.0 1.0 scale
1 W
1.05788 0.510338 0.0236322 C
958.447 511.474 LS
989.157 506.528 L
999.429 515.979 L
967.922 521.726 L
958.447 511.474 LE
949.225 500.795 LS
979.1 496.629 L
989.157 506.528 L
958.447 511.474 L
949.225 500.795 LE
940.309 489.703 LS
969.317 486.295 L
979.1 496.629 L
949.225 500.795 L
940.309 489.703 LE
931.757 478.225 LS
959.864 475.546 L
969.317 486.295 L
940.309 489.703 L
931.757 478.225 LE
923.619 466.39 LS
950.796 464.408 L
959.864 475.546 L
931.757 478.225 L
923.619 466.39 LE
915.947 454.242 LS
942.166 452.92 L
950.796 464.408 L
923.619 466.39 L
915.947 454.242 LE
908.785 441.83 LS
934.023 441.129 L
942.166 452.92 L
915.947 454.242 L
908.785 441.83 LE
902.167 429.214 LS
926.408 429.089 L
934.023 441.129 L
908.785 441.83 L
902.167 429.214 LE
896.123 416.457 LS
919.35 416.863 L
926.408 429.089 L
902.167 429.214 L
896.123 416.457 LE
890.668 403.628 LS
912.877 404.517 L
919.35 416.863 L
896.123 416.457 L
890.668 403.628 LE
885.733 390.59 LS
906.904 391.921 L
912.877 404.517 L
890.668 403.628 L
885.733 390.59 LE
881.276 377.196 LS
901.377 378.931 L
906.904 391.921 L
885.733 390.59 L
881.276 377.196 LE
877.328 363.507 LS
896.336 365.607 L
901.377 378.931 L
881.276 377.196 L
877.328 363.507 LE
873.917 349.589 LS
891.81 352.01 L
896.336 365.607 L
877.328 363.507 L
873.917 349.589 LE
871.055 335.509 LS
887.819 338.208 L
891.81 352.01 L
873.917 349.589 L
871.055 335.509 LE
868.747 321.334 LS
884.371 324.265 L
887.819 338.208 L
871.055 335.509 L
868.747 321.334 LE
866.984 307.127 LS
881.465 310.248 L
884.371 324.265 L
868.747 321.334 L
866.984 307.127 LE
865.751 292.951 LS
879.091 296.218 L
881.465 310.248 L
866.984 307.127 L
865.751 292.951 LE
865.026 278.859 LS
877.227 282.231 L
879.091 296.218 L
865.751 292.951 L
865.026 278.859 LE
864.778 264.902 LS
875.851 268.339 L
877.227 282.231 L
865.026 278.859 L
864.778 264.902 LE
927.036 513.661 LS
958.447 511.474 L
967.922 521.726 L
935.687 524.617 L
927.036 513.661 LE
918.669 502.299 LS
949.225 500.795 L
958.447 511.474 L
927.036 513.661 L
918.669 502.299 LE
910.642 490.549 LS
940.309 489.703 L
949.225 500.795 L
918.669 502.299 L
910.642 490.549 LE
903.005 478.442 LS
931.757 478.225 L
940.309 489.703 L
910.642 490.549 L
903.005 478.442 LE
895.81 466.011 LS
923.619 466.39 L
931.757 478.225 L
903.005 478.442 L
895.81 466.011 LE
889.103 453.305 LS
915.947 454.242 L
923.619 466.39 L
895.81 466.011 L
889.103 453.305 LE
882.924 440.375 LS
908.785 441.83 L
915.947 454.242 L
889.103 453.305 L
882.924 440.375 LE
877.306 427.284 LS
902.167 429.214 L
908.785 441.83 L
882.924 440.375 L
877.306 427.284 LE
872.269 414.096 LS
896.123 416.457 L
902.167 429.214 L
877.306 427.284 L
872.269 414.096 LE
867.825 400.883 LS
890.668 403.628 L
896.123 416.457 L
872.269 414.096 L
867.825 400.883 LE
863.919 387.501 LS
885.733 390.59 L
890.668 403.628 L
867.825 400.883 L
863.919 387.501 LE
860.512 373.802 LS
881.276 377.196 L
885.733 390.59 L
863.919 387.501 L
860.512 373.802 LE
857.639 359.848 LS
877.328 363.507 L
881.276 377.196 L
860.512 373.802 L
857.639 359.848 LE
855.317 345.708 LS
873.917 349.589 L
877.328 363.507 L
857.639 359.848 L
855.317 345.708 LE
853.557 331.448 LS
871.055 335.509 L
873.917 349.589 L
855.317 345.708 L
853.557 331.448 LE
852.354 317.136 LS
868.747 321.334 L
871.055 335.509 L
853.557 331.448 L
852.354 317.136 LE
851.698 302.836 LS
866.984 307.127 L
868.747 321.334 L
852.354 317.136 L
851.698 302.836 LE
851.57 288.607 LS
865.751 292.951 L
866.984 307.127 L
851.698 302.836 L
851.57 288.607 LE
851.939 274.501 LS
865.026 278.859 L
865.751 292.951 L
851.57 288.607 L
851.939 274.501 LE
852.775 260.566 LS
864.778 264.902 L
865.026 278.859 L
851.939 274.501 L
852.775 260.566 LE
895.715 513.082 LS
927.036 513.661 L
935.687 524.617 L
903.551 524.634 L
895.715 513.082 LE
888.191 501.143 LS
918.669 502.299 L
927.036 513.661 L
895.715 513.082 L
888.191 501.143 LE
881.034 488.844 LS
910.642 490.549 L
918.669 502.299 L
888.191 501.143 L
881.034 488.844 LE
874.293 476.215 LS
903.005 478.442 L
910.642 490.549 L
881.034 488.844 L
874.293 476.215 LE
868.016 463.298 LS
895.81 466.011 L
903.005 478.442 L
874.293 476.215 L
868.016 463.298 LE
862.246 450.139 LS
889.103 453.305 L
895.81 466.011 L
868.016 463.298 L
862.246 450.139 LE
857.019 436.797 LS
882.924 440.375 L
889.103 453.305 L
862.246 450.139 L
857.019 436.797 LE
852.361 423.333 LS
877.306 427.284 L
882.924 440.375 L
857.019 436.797 L
852.361 423.333 LE
848.291 409.816 LS
872.269 414.096 L
877.306 427.284 L
852.361 423.333 L
848.291 409.816 LE
844.815 396.316 LS
867.825 400.883 L
872.269 414.096 L
848.291 409.816 L
844.815 396.316 LE
841.886 382.687 LS
863.919 387.501 L
867.825 400.883 L
844.815 396.316 L
841.886 382.687 LE
839.479 368.777 LS
860.512 373.802 L
863.919 387.501 L
841.886 382.687 L
839.479 368.777 LE
837.624 354.652 LS
857.639 359.848 L
860.512 373.802 L
839.479 368.777 L
837.624 354.652 LE
836.33 340.38 LS
855.317 345.708 L
857.639 359.848 L
837.624 354.652 L
836.33 340.38 LE
835.606 326.031 LS
853.557 331.448 L
855.317 345.708 L
836.33 340.38 L
835.606 326.031 LE
835.441 311.67 LS
852.354 317.136 L
853.557 331.448 L
835.606 326.031 L
835.441 311.67 LE
835.822 297.359 LS
851.698 302.836 L
852.354 317.136 L
835.441 311.67 L
835.822 297.359 LE
836.721 283.158 LS
851.57 288.607 L
851.698 302.836 L
835.822 297.359 L
836.721 283.158 LE
838.111 269.116 LS
851.939 274.501 L
851.57 288.607 L
836.721 283.158 L
838.111 269.116 LE
839.951 255.278 LS
852.775 260.566 L
851.939 274.501 L
838.111 269.116 L
839.951 255.278 LE
865.368 509.907 LS
895.715 513.082 L
903.551 524.634 L
872.451 521.937 L
865.368 509.907 LE
858.623 497.514 LS
888.191 501.143 L
895.715 513.082 L
865.368 509.907 L
858.623 497.514 LE
852.264 484.784 LS
881.034 488.844 L
888.191 501.143 L
858.623 497.514 L
852.264 484.784 LE
846.343 471.75 LS
874.293 476.215 L
881.034 488.844 L
852.264 484.784 L
846.343 471.75 LE
840.903 458.458 LS
868.016 463.298 L
874.293 476.215 L
846.343 471.75 L
840.903 458.458 LE
835.984 444.959 LS
862.246 450.139 L
868.016 463.298 L
840.903 458.458 L
835.984 444.959 LE
831.618 431.31 LS
857.019 436.797 L
862.246 450.139 L
835.984 444.959 L
831.618 431.31 LE
827.829 417.577 LS
852.361 423.333 L
857.019 436.797 L
831.618 431.31 L
827.829 417.577 LE
824.63 403.827 LS
848.291 409.816 L
852.361 423.333 L
827.829 417.577 L
824.63 403.827 LE
822.022 390.133 LS
844.815 396.316 L
848.291 409.816 L
824.63 403.827 L
822.022 390.133 LE
819.968 376.345 LS
841.886 382.687 L
844.815 396.316 L
822.022 390.133 L
819.968 376.345 LE
818.455 362.309 LS
839.479 368.777 L
841.886 382.687 L
819.968 376.345 L
818.455 362.309 LE
817.503 348.095 LS
837.624 354.652 L
839.479 368.777 L
818.455 362.309 L
817.503 348.095 LE
817.123 333.77 LS
836.33 340.38 L
837.624 354.652 L
817.503 348.095 L
817.123 333.77 LE
817.315 319.403 LS
835.606 326.031 L
836.33 340.38 L
817.123 333.77 L
817.315 319.403 LE
818.068 305.061 LS
835.441 311.67 L
835.606 326.031 L
817.315 319.403 L
818.068 305.061 LE
819.36 290.804 LS
835.822 297.359 L
835.441 311.67 L
818.068 305.061 L
819.36 290.804 LE
821.164 276.689 LS
836.721 283.158 L
835.822 297.359 L
819.36 290.804 L
821.164 276.689 LE
823.446 262.764 LS
838.111 269.116 L
836.721 283.158 L
821.164 276.689 L
823.446 262.764 LE
826.166 249.072 LS
839.951 255.278 L
838.111 269.116 L
823.446 262.764 L
826.166 249.072 LE
836.577 504.557 LS
865.368 509.907 L
872.451 521.937 L
843.007 516.948 L
836.577 504.557 LE
830.503 491.821 LS
858.623 497.514 L
865.368 509.907 L
836.577 504.557 L
830.503 491.821 LE
824.835 478.768 LS
852.264 484.784 L
858.623 497.514 L
830.503 491.821 L
824.835 478.768 LE
819.619 465.438 LS
846.343 471.75 L
852.264 484.784 L
824.835 478.768 L
819.619 465.438 LE
814.897 451.874 LS
840.903 458.458 L
846.343 471.75 L
819.619 465.438 L
814.897 451.874 LE
810.707 438.131 LS
835.984 444.959 L
840.903 458.458 L
814.897 451.874 L
810.707 438.131 LE
807.077 424.268 LS
831.618 431.31 L
835.984 444.959 L
810.707 438.131 L
807.077 424.268 LE
804.028 410.352 LS
827.829 417.577 L
831.618 431.31 L
807.077 424.268 L
804.028 410.352 LE
801.568 396.451 LS
824.63 403.827 L
827.829 417.577 L
804.028 410.352 L
801.568 396.451 LE
799.697 382.637 LS
822.022 390.133 L
824.63 403.827 L
801.568 396.451 L
799.697 382.637 LE
798.383 368.759 LS
819.968 376.345 L
822.022 390.133 L
799.697 382.637 L
798.383 368.759 LE
797.621 354.663 LS
818.455 362.309 L
819.968 376.345 L
798.383 368.759 L
797.621 354.663 LE
797.431 340.418 LS
817.503 348.095 L
818.455 362.309 L
797.621 354.663 L
797.431 340.418 LE
797.817 326.093 LS
817.123 333.77 L
817.503 348.095 L
797.431 340.418 L
797.817 326.093 LE
798.777 311.757 LS
817.315 319.403 L
817.123 333.77 L
797.817 326.093 L
798.777 311.757 LE
800.296 297.475 LS
818.068 305.061 L
817.315 319.403 L
798.777 311.757 L
800.296 297.475 LE
802.349 283.308 LS
819.36 290.804 L
818.068 305.061 L
800.296 297.475 L
802.349 283.308 LE
804.905 269.31 LS
821.164 276.689 L
819.36 290.804 L
802.349 283.308 L
804.905 269.31 LE
807.927 255.527 LS
823.446 262.764 L
821.164 276.689 L
804.905 269.31 L
807.927 255.527 LE
811.376 241.999 LS
826.166 249.072 L
823.446 262.764 L
807.927 255.527 L
811.376 241.999 LE
809.595 497.533 LS
836.577 504.557 L
843.007 516.948 L
815.491 510.187 L
809.595 497.533 LE
804.07 484.549 LS
830.503 491.821 L
836.577 504.557 L
809.595 497.533 L
804.07 484.549 LE
798.963 471.267 LS
824.835 478.768 L
830.503 491.821 L
804.07 484.549 L
798.963 471.267 LE
794.32 457.726 LS
819.619 465.438 L
824.835 478.768 L
798.963 471.267 L
794.32 457.726 LE
790.181 443.973 LS
814.897 451.874 L
819.619 465.438 L
794.32 457.726 L
790.181 443.973 LE
786.58 430.063 LS
810.707 438.131 L
814.897 451.874 L
790.181 443.973 L
786.58 430.063 LE
783.545 416.059 LS
807.077 424.268 L
810.707 438.131 L
786.58 430.063 L
783.545 416.059 LE
781.092 402.025 LS
804.028 410.352 L
807.077 424.268 L
783.545 416.059 L
781.092 402.025 LE
779.227 388.032 LS
801.568 396.451 L
804.028 410.352 L
781.092 402.025 L
779.227 388.032 LE
777.946 374.151 LS
799.697 382.637 L
801.568 396.451 L
779.227 388.032 L
777.946 374.151 LE
777.225 360.229 LS
798.383 368.759 L
799.697 382.637 L
777.946 374.151 L
777.225 360.229 LE
777.065 346.113 LS
797.621 354.663 L
798.383 368.759 L
777.225 360.229 L
777.065 346.113 LE
777.482 331.873 LS
797.431 340.418 L
797.621 354.663 L
777.065 346.113 L
777.482 331.873 LE
778.479 317.578 LS
797.817 326.093 L
797.431 340.418 L
777.482 331.873 L
778.479 317.578 LE
780.049 303.296 LS
798.777 311.757 L
797.817 326.093 L
778.479 317.578 L
780.049 303.296 LE
782.175 289.092 LS
800.296 297.475 L
798.777 311.757 L
780.049 303.296 L
782.175 289.092 LE
784.83 275.025 LS
802.349 283.308 L
800.296 297.475 L
782.175 289.092 L
784.83 275.025 LE
787.98 261.148 LS
804.905 269.31 L
802.349 283.308 L
784.83 275.025 L
787.98 261.148 LE
791.588 247.507 LS
807.927 255.527 L
804.905 269.31 L
787.98 261.148 L
791.588 247.507 LE
795.61 234.139 LS
811.376 241.999 L
807.927 255.527 L
791.588 247.507 L
795.61 234.139 LE
784.433 489.298 LS
809.595 497.533 L
815.491 510.187 L
789.92 502.134 L
784.433 489.298 LE
779.328 476.143 LS
804.07 484.549 L
809.595 497.533 L
784.433 489.298 L
779.328 476.143 LE
774.65 462.705 LS
798.963 471.267 L
804.07 484.549 L
779.328 476.143 L
774.65 462.705 LE
770.444 449.021 LS
794.32 457.726 L
798.963 471.267 L
774.65 462.705 L
770.444 449.021 LE
766.749 435.143 LS
790.181 443.973 L
794.32 457.726 L
770.444 449.021 L
766.749 435.143 LE
763.596 421.125 LS
786.58 430.063 L
790.181 443.973 L
766.749 435.143 L
763.596 421.125 LE
761.012 407.03 LS
783.545 416.059 L
786.58 430.063 L
763.596 421.125 L
761.012 407.03 LE
759.011 392.924 LS
781.092 402.025 L
783.545 416.059 L
761.012 407.03 L
759.011 392.924 LE
757.597 378.879 LS
779.227 388.032 L
781.092 402.025 L
759.011 392.924 L
757.597 378.879 LE
756.762 364.964 LS
777.946 374.151 L
779.227 388.032 L
757.597 378.879 L
756.762 364.964 LE
756.488 351.026 LS
777.225 360.229 L
777.946 374.151 L
756.762 364.964 L
756.488 351.026 LE
756.782 336.912 LS
777.065 346.113 L
777.225 360.229 L
756.488 351.026 L
756.782 336.912 LE
757.656 322.693 LS
777.482 331.873 L
777.065 346.113 L
756.782 336.912 L
757.656 322.693 LE
759.112 308.437 LS
778.479 317.578 L
777.482 331.873 L
757.656 322.693 L
759.112 308.437 LE
761.14 294.213 LS
780.049 303.296 L
778.479 317.578 L
759.112 308.437 L
761.14 294.213 LE
763.721 280.084 LS
782.175 289.092 L
780.049 303.296 L
761.14 294.213 L
763.721 280.084 LE
766.826 266.11 LS
784.83 275.025 L
782.175 289.092 L
763.721 280.084 L
766.826 266.11 LE
770.421 252.342 LS
787.98 261.148 L
784.83 275.025 L
766.826 266.11 L
770.421 252.342 LE
774.464 238.823 LS
791.588 247.507 L
787.98 261.148 L
770.421 252.342 L
774.464 238.823 LE
778.913 225.591 LS
795.61 234.139 L
791.588 247.507 L
774.464 238.823 L
778.913 225.591 LE
760.954 480.233 LS
784.433 489.298 L
789.92 502.134 L
766.154 493.188 L
760.954 480.233 LE
756.143 466.968 LS
779.328 476.143 L
784.433 489.298 L
760.954 480.233 L
756.143 466.968 LE
751.766 453.428 LS
774.65 462.705 L
779.328 476.143 L
756.143 466.968 L
751.766 453.428 LE
747.865 439.654 LS
770.444 449.021 L
774.65 462.705 L
751.766 453.428 L
747.865 439.654 LE
744.479 425.697 LS
766.749 435.143 L
770.444 449.021 L
747.865 439.654 L
744.479 425.697 LE
741.64 411.612 LS
763.596 421.125 L
766.749 435.143 L
744.479 425.697 L
741.64 411.612 LE
739.371 397.463 LS
761.012 407.03 L
763.596 421.125 L
741.64 411.612 L
739.371 397.463 LE
737.684 383.317 LS
759.011 392.924 L
761.012 407.03 L
739.371 397.463 L
737.684 383.317 LE
736.582 369.243 LS
757.597 378.879 L
759.011 392.924 L
737.684 383.317 L
736.582 369.243 LE
736.058 355.313 LS
756.762 364.964 L
757.597 378.879 L
736.582 369.243 L
736.058 355.313 LE
736.094 341.372 LS
756.488 351.026 L
756.762 364.964 L
736.058 355.313 L
736.094 341.372 LE
736.702 327.269 LS
756.782 336.912 L
756.488 351.026 L
736.094 341.372 L
736.702 327.269 LE
737.892 313.072 LS
757.656 322.693 L
756.782 336.912 L
736.702 327.269 L
737.892 313.072 LE
739.665 298.853 LS
759.112 308.437 L
757.656 322.693 L
737.892 313.072 L
739.665 298.853 LE
742.009 284.677 LS
761.14 294.213 L
759.112 308.437 L
739.665 298.853 L
742.009 284.677 LE
744.904 270.61 LS
763.721 280.084 L
761.14 294.213 L
742.009 284.677 L
744.904 270.61 LE
748.319 256.708 LS
766.826 266.11 L
763.721 280.084 L
744.904 270.61 L
748.319 256.708 LE
752.219 243.023 LS
770.421 252.342 L
766.826 266.11 L
748.319 256.708 L
752.219 243.023 LE
756.563 229.598 LS
774.464 238.823 L
770.421 252.342 L
752.219 243.023 L
756.563 229.598 LE
761.306 216.468 LS
778.913 225.591 L
774.464 238.823 L
756.563 229.598 L
761.306 216.468 LE
738.958 470.618 LS
760.954 480.233 L
766.154 493.188 L
743.988 483.641 L
738.958 470.618 LE
734.32 457.292 LS
756.143 466.968 L
760.954 480.233 L
738.958 470.618 L
734.32 457.292 LE
730.12 443.696 LS
751.766 453.428 L
756.143 466.968 L
734.32 457.292 L
730.12 443.696 LE
726.4 429.873 LS
747.865 439.654 L
751.766 453.428 L
730.12 443.696 L
726.4 429.873 LE
723.197 415.872 LS
744.479 425.697 L
747.865 439.654 L
726.4 429.873 L
723.197 415.872 LE
720.542 401.752 LS
741.64 411.612 L
744.479 425.697 L
723.197 415.872 L
720.542 401.752 LE
718.457 387.574 LS
739.371 397.463 L
741.64 411.612 L
720.542 401.752 L
718.457 387.574 LE
716.955 373.407 LS
737.684 383.317 L
739.371 397.463 L
718.457 387.574 L
716.955 373.407 LE
716.037 359.321 LS
736.582 369.243 L
737.684 383.317 L
716.955 373.407 L
716.037 359.321 LE
715.694 345.384 LS
736.058 355.313 L
736.582 369.243 L
716.037 359.321 L
715.694 345.384 LE
715.913 331.446 LS
736.094 341.372 L
736.058 355.313 L
715.694 345.384 L
715.913 331.446 LE
716.704 317.351 LS
736.702 327.269 L
736.094 341.372 L
715.913 331.446 L
716.704 317.351 LE
718.08 303.171 LS
737.892 313.072 L
736.702 327.269 L
716.704 317.351 L
718.08 303.171 LE
720.038 288.976 LS
739.665 298.853 L
737.892 313.072 L
718.08 303.171 L
720.038 288.976 LE
722.567 274.832 LS
742.009 284.677 L
739.665 298.853 L
720.038 288.976 L
722.567 274.832 LE
725.645 260.804 LS
744.904 270.61 L
742.009 284.677 L
722.567 274.832 L
725.645 260.804 LE
729.242 246.948 LS
748.319 256.708 L
744.904 270.61 L
725.645 260.804 L
729.242 246.948 LE
733.32 233.315 LS
752.219 243.023 L
748.319 256.708 L
729.242 246.948 L
733.32 233.315 LE
737.839 219.948 LS
756.563 229.598 L
752.219 243.023 L
733.32 233.315 L
737.839 219.948 LE
742.752 206.881 LS
761.306 216.468 L
756.563 229.598 L
737.839 219.948 L
742.752 206.881 LE
718.212 460.663 LS
738.958 470.618 L
743.988 483.641 L
723.184 473.708 L
718.212 460.663 LE
713.634 447.316 LS
734.32 457.292 L
738.958 470.618 L
718.212 460.663 L
713.634 447.316 LE
709.494 433.702 LS
730.12 443.696 L
734.32 457.292 L
713.634 447.316 L
709.494 433.702 LE
705.836 419.862 LS
726.4 429.873 L
730.12 443.696 L
709.494 433.702 L
705.836 419.862 LE
702.695 405.847 LS
723.197 415.872 L
726.4 429.873 L
705.836 419.862 L
702.695 405.847 LE
700.103 391.715 LS
720.542 401.752 L
723.197 415.872 L
702.695 405.847 L
700.103 391.715 LE
698.081 377.529 LS
718.457 387.574 L
720.542 401.752 L
700.103 391.715 L
698.081 377.529 LE
696.643 363.355 LS
716.955 373.407 L
718.457 387.574 L
698.081 377.529 L
696.643 363.355 LE
695.788 349.264 LS
716.037 359.321 L
716.955 373.407 L
696.643 363.355 L
695.788 349.264 LE
695.507 335.327 LS
715.694 345.384 L
716.037 359.321 L
695.788 349.264 L
695.507 335.327 LE
695.788 321.389 LS
715.913 331.446 L
715.694 345.384 L
695.507 335.327 L
695.788 321.389 LE
696.643 307.298 LS
716.704 317.351 L
715.913 331.446 L
695.788 321.389 L
696.643 307.298 LE
698.081 293.125 LS
718.08 303.171 L
716.704 317.351 L
696.643 307.298 L
698.081 293.125 LE
700.103 278.938 LS
720.038 288.976 L
718.08 303.171 L
698.081 293.125 L
700.103 278.938 LE
702.695 264.806 LS
722.567 274.832 L
720.038 288.976 L
700.103 278.938 L
702.695 264.806 LE
705.836 250.791 LS
725.645 260.804 L
722.567 274.832 L
702.695 264.806 L
705.836 250.791 LE
709.494 236.952 LS
729.242 246.948 L
725.645 260.804 L
705.836 250.791 L
709.494 236.952 LE
713.634 223.337 LS
733.32 233.315 L
729.242 246.948 L
709.494 236.952 L
713.634 223.337 LE
718.212 209.99 LS
737.839 219.948 L
733.32 233.315 L
713.634 223.337 L
718.212 209.99 LE
723.184 196.945 LS
742.752 206.881 L
737.839 219.948 L
718.212 209.99 L
723.184 196.945 LE
405.182 388.224 LS
388.138 396.095 L
374.715 392.258 L
391.784 384.3 L
405.182 388.224 LE
391.784 384.3 LS
374.715 392.258 L
361.286 387.925 L
378.385 379.879 L
391.784 384.3 LE
378.385 379.879 LS
361.286 387.925 L
347.908 383.08 L
365.036 374.948 L
378.385 379.879 LE
365.036 374.948 LS
347.908 383.08 L
334.635 377.716 L
351.799 369.497 L
365.036 374.948 LE
351.799 369.497 LS
334.635 377.716 L
321.533 371.832 L
338.737 363.528 L
351.799 369.497 LE
338.737 363.528 LS
321.533 371.832 L
308.667 365.438 L
325.912 357.051 L
338.737 363.528 LE
325.912 357.051 LS
308.667 365.438 L
296.098 358.555 L
313.387 350.087 L
325.912 357.051 LE
313.387 350.087 LS
296.098 358.555 L
283.888 351.214 L
301.226 342.666 L
313.387 350.087 LE
301.226 342.666 LS
283.888 351.214 L
272.095 343.454 L
289.484 334.83 L
301.226 342.666 LE
289.484 334.83 LS
272.095 343.454 L
260.77 335.327 L
278.212 326.629 L
289.484 334.83 LE
278.212 326.629 LS
260.77 335.327 L
249.78 326.75 L
267.278 317.981 L
278.212 326.629 LE
267.278 317.981 LS
249.78 326.75 L
239.013 317.622 L
256.569 308.783 L
267.278 317.981 LE
256.569 308.783 LS
239.013 317.622 L
228.527 307.977 L
246.148 299.07 L
256.569 308.783 LE
246.148 299.07 LS
228.527 307.977 L
218.381 297.857 L
236.068 288.885 L
246.148 299.07 LE
236.068 288.885 LS
218.381 297.857 L
208.621 287.313 L
226.376 278.277 L
236.068 288.885 LE
226.376 278.277 LS
208.621 287.313 L
199.283 276.4 L
217.11 267.305 L
226.376 278.277 LE
217.11 267.305 LS
199.283 276.4 L
190.397 265.178 L
208.295 256.025 L
217.11 267.305 LE
208.295 256.025 LS
190.397 265.178 L
181.977 253.706 L
199.95 244.498 L
208.295 256.025 LE
199.95 244.498 LS
181.977 253.706 L
174.036 242.043 L
192.085 232.783 L
199.95 244.498 LE
192.085 232.783 LS
174.036 242.043 L
166.571 230.245 L
184.698 220.938 L
192.085 232.783 LE
422.314 380.777 LS
405.182 388.224 L
391.784 384.3 L
408.957 376.72 L
422.314 380.777 LE
408.957 376.72 LS
391.784 384.3 L
378.385 379.879 L
395.602 372.166 L
408.957 376.72 LE
395.602 372.166 LS
378.385 379.879 L
365.036 374.948 L
382.304 367.102 L
395.602 372.166 LE
382.304 367.102 LS
365.036 374.948 L
351.799 369.497 L
369.121 361.519 L
382.304 367.102 LE
369.121 361.519 LS
351.799 369.497 L
338.737 363.528 L
356.119 355.42 L
369.121 361.519 LE
356.119 355.42 LS
338.737 363.528 L
325.912 357.051 L
343.359 348.815 L
356.119 355.42 LE
343.359 348.815 LS
325.912 357.051 L
313.387 350.087 L
330.906 341.726 L
343.359 348.815 LE
330.906 341.726 LS
313.387 350.087 L
301.226 342.666 L
318.82 334.184 L
330.906 341.726 LE
318.82 334.184 LS
301.226 342.666 L
289.484 334.83 L
307.156 326.231 L
318.82 334.184 LE
307.156 326.231 LS
289.484 334.83 L
278.212 326.629 L
295.966 317.918 L
307.156 326.231 LE
295.966 317.918 LS
278.212 326.629 L
267.278 317.981 L
285.118 309.161 L
295.966 317.918 LE
285.118 309.161 LS
267.278 317.981 L
256.569 308.783 L
274.502 299.857 L
285.118 309.161 LE
274.502 299.857 LS
256.569 308.783 L
246.148 299.07 L
264.179 290.04 L
274.502 299.857 LE
264.179 290.04 LS
246.148 299.07 L
236.068 288.885 L
254.2 279.755 L
264.179 290.04 LE
254.2 279.755 LS
236.068 288.885 L
226.376 278.277 L
244.616 269.051 L
254.2 279.755 LE
244.616 269.051 LS
226.376 278.277 L
217.11 267.305 L
235.459 257.986 L
244.616 269.051 LE
235.459 257.986 LS
217.11 267.305 L
208.295 256.025 L
226.758 246.619 L
235.459 257.986 LE
226.758 246.619 LS
208.295 256.025 L
199.95 244.498 L
218.529 235.009 L
226.758 246.619 LE
218.529 235.009 LS
199.95 244.498 L
192.085 232.783 L
210.781 223.217 L
218.529 235.009 LE
210.781 223.217 LS
192.085 232.783 L
184.698 220.938 L
203.512 211.298 L
210.781 223.217 LE
439.577 374.258 LS
422.314 380.777 L
408.957 376.72 L
426.292 369.968 L
439.577 374.258 LE
426.292 369.968 LS
408.957 376.72 L
395.602 372.166 L
413.019 365.182 L
426.292 369.968 LE
413.019 365.182 LS
395.602 372.166 L
382.304 367.102 L
399.812 359.886 L
413.019 365.182 LE
399.812 359.886 LS
382.304 367.102 L
369.121 361.519 L
386.729 354.074 L
399.812 359.886 LE
386.729 354.074 LS
369.121 361.519 L
356.119 355.42 L
373.835 347.749 L
386.729 354.074 LE
373.835 347.749 LS
356.119 355.42 L
343.359 348.815 L
361.191 340.923 L
373.835 347.749 LE
361.191 340.923 LS
343.359 348.815 L
330.906 341.726 L
348.864 333.618 L
361.191 340.923 LE
348.864 333.618 LS
330.906 341.726 L
318.82 334.184 L
336.91 325.866 L
348.864 333.618 LE
336.91 325.866 LS
318.82 334.184 L
307.156 326.231 L
325.389 317.711 L
336.91 325.866 LE
325.389 317.711 LS
307.156 326.231 L
295.966 317.918 L
314.345 309.204 L
325.389 317.711 LE
314.345 309.204 LS
295.966 317.918 L
285.118 309.161 L
303.652 300.259 L
314.345 309.204 LE
303.652 300.259 LS
285.118 309.161 L
274.502 299.857 L
293.2 290.771 L
303.652 300.259 LE
293.2 290.771 LS
274.502 299.857 L
264.179 290.04 L
283.048 280.776 L
293.2 290.771 LE
283.048 280.776 LS
264.179 290.04 L
254.2 279.755 L
273.251 270.318 L
283.048 280.776 LE
273.251 270.318 LS
254.2 279.755 L
244.616 269.051 L
263.853 259.448 L
273.251 270.318 LE
263.853 259.448 LS
244.616 269.051 L
235.459 257.986 L
254.892 248.225 L
263.853 259.448 LE
254.892 248.225 LS
235.459 257.986 L
226.758 246.619 L
246.391 236.708 L
254.892 248.225 LE
246.391 236.708 LS
226.758 246.619 L
218.529 235.009 L
238.366 224.957 L
246.391 236.708 LE
238.366 224.957 LS
218.529 235.009 L
210.781 223.217 L
230.825 213.031 L
238.366 224.957 LE
230.825 213.031 LS
210.781 223.217 L
203.512 211.298 L
223.766 200.987 L
230.825 213.031 LE
457.146 368.848 LS
439.577 374.258 L
426.292 369.968 L
443.977 364.213 L
457.146 368.848 LE
443.977 364.213 LS
426.292 369.968 L
413.019 365.182 L
430.833 359.082 L
443.977 364.213 LE
430.833 359.082 LS
413.019 365.182 L
399.812 359.886 L
417.768 353.443 L
430.833 359.082 LE
417.768 353.443 LS
399.812 359.886 L
386.729 354.074 L
404.842 347.292 L
417.768 353.443 LE
404.842 347.292 LS
386.729 354.074 L
373.835 347.749 L
392.116 340.632 L
404.842 347.292 LE
392.116 340.632 LS
373.835 347.749 L
361.191 340.923 L
379.656 333.478 L
392.116 340.632 LE
379.656 333.478 LS
361.191 340.923 L
348.864 333.618 L
367.523 325.853 L
379.656 333.478 LE
367.523 325.853 LS
348.864 333.618 L
336.91 325.866 L
355.777 317.792 L
367.523 325.853 LE
355.777 317.792 LS
336.91 325.866 L
325.389 317.711 L
344.472 309.339 L
355.777 317.792 LE
344.472 309.339 LS
325.389 317.711 L
314.345 309.204 L
333.653 300.547 L
344.472 309.339 LE
333.653 300.547 LS
314.345 309.204 L
303.652 300.259 L
323.198 291.326 L
333.653 300.547 LE
323.198 291.326 LS
303.652 300.259 L
293.2 290.771 L
312.997 281.568 L
323.198 291.326 LE
312.997 281.568 LS
293.2 290.771 L
283.048 280.776 L
303.109 271.311 L
312.997 281.568 LE
303.109 271.311 LS
283.048 280.776 L
273.251 270.318 L
293.589 260.601 L
303.109 271.311 LE
293.589 260.601 LS
273.251 270.318 L
263.853 259.448 L
284.479 249.49 L
293.589 260.601 LE
284.479 249.49 LS
263.853 259.448 L
254.892 248.225 L
275.814 238.037 L
284.479 249.49 LE
275.814 238.037 LS
254.892 248.225 L
246.391 236.708 L
267.616 226.302 L
275.814 238.037 LE
267.616 226.302 LS
246.391 236.708 L
238.366 224.957 L
259.9 214.345 L
267.616 226.302 LE
259.9 214.345 LS
238.366 224.957 L
230.825 213.031 L
252.672 202.226 L
259.9 214.345 LE
252.672 202.226 LS
230.825 213.031 L
223.766 200.987 L
245.93 190.003 L
252.672 202.226 LE
475.103 364.838 LS
457.146 368.848 L
443.977 364.213 L
462.112 359.727 L
475.103 364.838 LE
462.112 359.727 LS
443.977 364.213 L
430.833 359.082 L
449.164 354.121 L
462.112 359.727 LE
449.164 354.121 LS
430.833 359.082 L
417.768 353.443 L
436.312 348.011 L
449.164 354.121 LE
436.312 348.011 LS
417.768 353.443 L
404.842 347.292 L
423.619 341.393 L
436.312 348.011 LE
423.619 341.393 LS
404.842 347.292 L
392.116 340.632 L
411.144 334.275 L
423.619 341.393 LE
411.144 334.275 LS
392.116 340.632 L
379.656 333.478 L
398.952 326.673 L
411.144 334.275 LE
398.952 326.673 LS
379.656 333.478 L
367.523 325.853 L
387.104 318.612 L
398.952 326.673 LE
387.104 318.612 LS
367.523 325.853 L
355.777 317.792 L
375.659 310.129 L
387.104 318.612 LE
375.659 310.129 LS
355.777 317.792 L
344.472 309.339 L
364.668 301.27 L
375.659 310.129 LE
364.668 301.27 LS
344.472 309.339 L
333.653 300.547 L
354.178 292.09 L
364.668 301.27 LE
354.178 292.09 LS
333.653 300.547 L
323.198 291.326 L
344.065 282.495 L
354.178 292.09 LE
344.065 282.495 LS
323.198 291.326 L
312.997 281.568 L
334.224 272.372 L
344.065 282.495 LE
334.224 272.372 LS
312.997 281.568 L
303.109 271.311 L
324.718 261.762 L
334.224 272.372 LE
324.718 261.762 LS
303.109 271.311 L
293.589 260.601 L
315.593 250.713 L
324.718 261.762 LE
315.593 250.713 LS
293.589 260.601 L
284.479 249.49 L
306.893 239.279 L
315.593 250.713 LE
306.893 239.279 LS
284.479 249.49 L
275.814 238.037 L
298.649 227.518 L
306.893 239.279 LE
298.649 227.518 LS
275.814 238.037 L
267.616 226.302 L
290.883 215.492 L
298.649 227.518 LE
290.883 215.492 LS
267.616 226.302 L
259.9 214.345 L
283.609 203.262 L
290.883 215.492 LE
283.609 203.262 LS
259.9 214.345 L
252.672 202.226 L
276.827 190.888 L
283.609 203.262 LE
276.827 190.888 LS
252.672 202.226 L
245.93 190.003 L
270.533 178.427 L
276.827 190.888 LE
493.406 362.616 LS
475.103 364.838 L
462.112 359.727 L
480.677 356.881 L
493.406 362.616 LE
480.677 356.881 LS
462.112 359.727 L
449.164 354.121 L
468.016 350.654 L
480.677 356.881 LE
468.016 350.654 LS
449.164 354.121 L
436.312 348.011 L
455.475 343.929 L
468.016 350.654 LE
455.475 343.929 LS
436.312 348.011 L
423.619 341.393 L
443.117 336.704 L
455.475 343.929 LE
443.117 336.704 LS
423.619 341.393 L
411.144 334.275 L
431.003 328.99 L
443.117 336.704 LE
431.003 328.99 LS
411.144 334.275 L
398.952 326.673 L
419.193 320.805 L
431.003 328.99 LE
419.193 320.805 LS
398.952 326.673 L
387.104 318.612 L
407.751 312.18 L
419.193 320.805 LE
407.751 312.18 LS
387.104 318.612 L
375.659 310.129 L
396.728 303.152 L
407.751 312.18 LE
396.728 303.152 LS
375.659 310.129 L
364.668 301.27 L
386.181 293.771 L
396.728 303.152 LE
386.181 293.771 LS
364.668 301.27 L
354.178 292.09 L
376.147 284.093 L
386.181 293.771 LE
376.147 284.093 LS
354.178 292.09 L
344.065 282.495 L
366.51 274.02 L
376.147 284.093 LE
366.51 274.02 LS
344.065 282.495 L
334.224 272.372 L
357.174 263.433 L
366.51 274.02 LE
357.174 263.433 LS
334.224 272.372 L
324.718 261.762 L
348.191 252.375 L
357.174 263.433 LE
348.191 252.375 LS
324.718 261.762 L
315.593 250.713 L
339.613 240.896 L
348.191 252.375 LE
339.613 240.896 LS
315.593 250.713 L
306.893 239.279 L
331.476 229.053 L
339.613 240.896 LE
331.476 229.053 LS
306.893 239.279 L
298.649 227.518 L
323.813 216.907 L
331.476 229.053 LE
323.813 216.907 LS
298.649 227.518 L
290.883 215.492 L
316.639 204.519 L
323.813 216.907 LE
316.639 204.519 LS
290.883 215.492 L
283.609 203.262 L
309.965 191.951 L
316.639 204.519 LE
309.965 191.951 LS
283.609 203.262 L
276.827 190.888 L
303.79 179.263 L
309.965 191.951 LE
303.79 179.263 LS
276.827 190.888 L
270.533 178.427 L
298.108 166.513 L
303.79 179.263 LE
511.852 362.605 LS
493.406 362.616 L
480.677 356.881 L
499.504 356.092 L
511.852 362.605 LE
499.504 356.092 LS
480.677 356.881 L
468.016 350.654 L
487.252 349.092 L
499.504 356.092 LE
487.252 349.092 LS
468.016 350.654 L
455.475 343.929 L
475.153 341.601 L
487.252 349.092 LE
475.153 341.601 LS
455.475 343.929 L
443.117 336.704 L
463.268 333.623 L
475.153 341.601 LE
463.268 333.623 LS
443.117 336.704 L
431.003 328.99 L
451.655 325.173 L
463.268 333.623 LE
451.655 325.173 LS
431.003 328.99 L
419.193 320.805 L
440.377 316.271 L
451.655 325.173 LE
440.377 316.271 LS
419.193 320.805 L
407.751 312.18 L
429.49 306.952 L
440.377 316.271 LE
429.49 306.952 LS
407.751 312.18 L
396.728 303.152 L
419.051 297.258 L
429.49 306.952 LE
419.051 297.258 LS
396.728 303.152 L
386.181 293.771 L
409.104 287.241 L
419.051 297.258 LE
409.104 287.241 LS
386.181 293.771 L
376.147 284.093 L
399.69 276.96 L
409.104 287.241 LE
399.69 276.96 LS
376.147 284.093 L
366.51 274.02 L
390.698 266.307 L
399.69 276.96 LE
390.698 266.307 LS
366.51 274.02 L
357.174 263.433 L
382.035 255.161 L
390.698 266.307 LE
382.035 255.161 LS
357.174 263.433 L
348.191 252.375 L
373.756 243.567 L
382.035 255.161 LE
373.756 243.567 LS
348.191 252.375 L
339.613 240.896 L
365.905 231.579 L
373.756 243.567 LE
365.905 231.579 LS
339.613 240.896 L
331.476 229.053 L
358.52 219.254 L
365.905 231.579 LE
358.52 219.254 LS
331.476 229.053 L
323.813 216.907 L
351.625 206.656 L
358.52 219.254 LE
351.625 206.656 LS
323.813 216.907 L
316.639 204.519 L
345.234 193.847 L
351.625 206.656 LE
345.234 193.847 LS
316.639 204.519 L
309.965 191.951 L
339.351 180.889 L
345.234 193.847 LE
339.351 180.889 LS
309.965 191.951 L
303.79 179.263 L
333.977 167.842 L
339.351 180.889 LE
333.977 167.842 LS
303.79 179.263 L
298.108 166.513 L
329.096 154.764 L
333.977 167.842 LE
530.1 365.133 LS
511.852 362.605 L
499.504 356.092 L
518.284 357.701 L
530.1 365.133 LE
518.284 357.701 LS
499.504 356.092 L
487.252 349.092 L
506.599 349.791 L
518.284 357.701 LE
506.599 349.791 LS
487.252 349.092 L
475.153 341.601 L
495.104 341.403 L
506.599 349.791 LE
495.104 341.403 LS
475.153 341.601 L
463.268 333.623 L
483.857 332.546 L
495.104 341.403 LE
483.857 332.546 LS
463.268 333.623 L
451.655 325.173 L
472.92 323.238 L
483.857 332.546 LE
472.92 323.238 LS
451.655 325.173 L
440.377 316.271 L
462.349 313.506 L
472.92 323.238 LE
462.349 313.506 LS
440.377 316.271 L
429.49 306.952 L
452.203 303.388 L
462.349 313.506 LE
452.203 303.388 LS
429.49 306.952 L
419.051 297.258 L
442.529 292.929 L
452.203 303.388 LE
442.529 292.929 LS
419.051 297.258 L
409.104 287.241 L
433.372 282.185 L
442.529 292.929 LE
433.372 282.185 LS
409.104 287.241 L
399.69 276.96 L
424.766 271.219 L
433.372 282.185 LE
424.766 271.219 LS
399.69 276.96 L
390.698 266.307 L
416.607 259.915 L
424.766 271.219 LE
416.607 259.915 LS
390.698 266.307 L
382.035 255.161 L
408.816 248.143 L
416.607 259.915 LE
408.816 248.143 LS
382.035 255.161 L
373.756 243.567 L
401.442 235.954 L
408.816 248.143 LE
401.442 235.954 LS
373.756 243.567 L
365.905 231.579 L
394.524 223.404 L
401.442 235.954 LE
394.524 223.404 LS
365.905 231.579 L
358.52 219.254 L
388.096 210.555 L
394.524 223.404 LE
388.096 210.555 LS
358.52 219.254 L
351.625 206.656 L
382.176 197.469 L
388.096 210.555 LE
382.176 197.469 LS
351.625 206.656 L
345.234 193.847 L
376.777 184.212 L
382.176 197.469 LE
376.777 184.212 LS
345.234 193.847 L
339.351 180.889 L
371.895 170.845 L
376.777 184.212 LE
371.895 170.845 LS
339.351 180.889 L
333.977 167.842 L
367.526 157.428 L
371.895 170.845 LE
367.526 157.428 LS
333.977 167.842 L
329.096 154.764 L
363.653 144.016 L
367.526 157.428 LE
547.776 370.253 LS
530.1 365.133 L
518.284 357.701 L
536.657 361.813 L
547.776 370.253 LE
536.657 361.813 LS
518.284 357.701 L
506.599 349.791 L
525.712 352.907 L
536.657 361.813 LE
525.712 352.907 LS
506.599 349.791 L
495.104 341.403 L
514.997 343.542 L
525.712 352.907 LE
514.997 343.542 LS
495.104 341.403 L
483.857 332.546 L
504.573 333.732 L
514.997 343.542 LE
504.573 333.732 LS
483.857 332.546 L
472.92 323.238 L
494.495 323.5 L
504.573 333.732 LE
494.495 323.5 LS
472.92 323.238 L
462.349 313.506 L
484.819 312.877 L
494.495 323.5 LE
484.819 312.877 LS
462.349 313.506 L
452.203 303.388 L
475.6 301.907 L
484.819 312.877 LE
475.6 301.907 LS
452.203 303.388 L
442.529 292.929 L
466.882 290.639 L
475.6 301.907 LE
466.882 290.639 LS
442.529 292.929 L
433.372 282.185 L
458.704 279.133 L
466.882 290.639 LE
458.704 279.133 LS
433.372 282.185 L
424.766 271.219 L
451.094 267.453 L
458.704 279.133 LE
451.094 267.453 LS
424.766 271.219 L
416.607 259.915 L
443.959 255.476 L
451.094 267.453 LE
443.959 255.476 LS
416.607 259.915 L
408.816 248.143 L
437.233 243.066 L
443.959 255.476 LE
437.233 243.066 LS
408.816 248.143 L
401.442 235.954 L
430.956 230.277 L
437.233 243.066 LE
430.956 230.277 LS
401.442 235.954 L
394.524 223.404 L
425.169 217.168 L
430.956 230.277 LE
425.169 217.168 LS
394.524 223.404 L
388.096 210.555 L
419.893 203.803 L
425.169 217.168 LE
419.893 203.803 LS
388.096 210.555 L
382.176 197.469 L
415.146 190.248 L
419.893 203.803 LE
415.146 190.248 LS
382.176 197.469 L
376.777 184.212 L
410.931 176.567 L
415.146 190.248 LE
410.931 176.567 LS
376.777 184.212 L
371.895 170.845 L
407.241 162.825 L
410.931 176.567 LE
407.241 162.825 LS
371.895 170.845 L
367.526 157.428 L
404.067 149.075 L
407.241 162.825 LE
404.067 149.075 LS
367.526 157.428 L
363.653 144.016 L
401.386 135.375 L
404.067 149.075 LE
564.64 377.639 LS
547.776 370.253 L
536.657 361.813 L
554.371 368.182 L
564.64 377.639 LE
554.371 368.182 LS
536.657 361.813 L
525.712 352.907 L
544.319 358.279 L
554.371 368.182 LE
544.319 358.279 LS
525.712 352.907 L
514.997 343.542 L
534.541 347.941 L
544.319 358.279 LE
534.541 347.941 LS
514.997 343.542 L
504.573 333.732 L
525.094 337.187 L
534.541 347.941 LE
525.094 337.187 LS
504.573 333.732 L
494.495 323.5 L
516.03 326.045 L
525.094 337.187 LE
516.03 326.045 LS
494.495 323.5 L
484.819 312.877 L
507.406 314.553 L
516.03 326.045 LE
507.406 314.553 LS
484.819 312.877 L
475.6 301.907 L
499.269 302.758 L
507.406 314.553 LE
499.269 302.758 LS
475.6 301.907 L
466.882 290.639 L
491.658 290.714 L
499.269 302.758 LE
491.658 290.714 LS
466.882 290.639 L
458.704 279.133 L
484.607 278.485 L
491.658 290.714 LE
484.607 278.485 LS
458.704 279.133 L
451.094 267.453 L
478.138 266.136 L
484.607 278.485 LE
478.138 266.136 LS
451.094 267.453 L
443.959 255.476 L
472.173 253.537 L
478.138 266.136 LE
472.173 253.537 LS
443.959 255.476 L
437.233 243.066 L
466.651 240.545 L
472.173 253.537 LE
466.651 240.545 LS
437.233 243.066 L
430.956 230.277 L
461.617 227.218 L
466.651 240.545 LE
461.617 227.218 LS
430.956 230.277 L
425.169 217.168 L
457.097 213.619 L
461.617 227.218 LE
457.097 213.619 LS
425.169 217.168 L
419.893 203.803 L
453.113 199.815 L
457.097 213.619 LE
453.113 199.815 LS
419.893 203.803 L
415.146 190.248 L
449.672 185.871 L
453.113 199.815 LE
449.672 185.871 LS
415.146 190.248 L
410.931 176.567 L
446.773 171.853 L
449.672 185.871 LE
446.773 171.853 LS
410.931 176.567 L
407.241 162.825 L
444.404 157.821 L
446.773 171.853 LE
444.404 157.821 LS
407.241 162.825 L
404.067 149.075 L
442.547 143.833 L
444.404 157.821 LE
442.547 143.833 LS
404.067 149.075 L
401.386 135.375 L
441.178 129.941 L
442.547 143.833 LE
580.724 386.655 LS
564.64 377.639 L
554.371 368.182 L
571.397 376.267 L
580.724 386.655 LE
571.397 376.267 LS
554.371 368.182 L
544.319 358.279 L
562.33 365.456 L
571.397 376.267 LE
562.33 365.456 LS
544.319 358.279 L
534.541 347.941 L
553.577 354.237 L
562.33 365.456 LE
553.577 354.237 LS
534.541 347.941 L
525.094 337.187 L
545.191 342.635 L
553.577 354.237 LE
545.191 342.635 LS
525.094 337.187 L
516.03 326.045 L
537.224 330.684 L
545.191 342.635 LE
537.224 330.684 LS
516.03 326.045 L
507.406 314.553 L
529.729 318.427 L
537.224 330.684 LE
529.729 318.427 LS
507.406 314.553 L
499.269 302.758 L
522.745 305.913 L
529.729 318.427 LE
522.745 305.913 LS
499.269 302.758 L
491.658 290.714 L
516.312 293.203 L
522.745 305.913 LE
516.312 293.203 LS
491.658 290.714 L
484.607 278.485 L
510.453 280.36 L
516.312 293.203 LE
510.453 280.36 LS
484.607 278.485 L
478.138 266.136 L
505.183 267.453 L
510.453 280.36 LE
505.183 267.453 LS
478.138 266.136 L
472.173 253.537 L
500.438 254.345 L
505.183 267.453 LE
500.438 254.345 LS
472.173 253.537 L
466.651 240.545 L
496.175 240.888 L
500.438 254.345 LE
496.175 240.888 LS
466.651 240.545 L
461.617 227.218 L
492.426 227.144 L
496.175 240.888 LE
492.426 227.144 LS
461.617 227.218 L
457.097 213.619 L
489.216 213.178 L
492.426 227.144 LE
489.216 213.178 LS
457.097 213.619 L
453.113 199.815 L
486.557 199.058 L
489.216 213.178 LE
486.557 199.058 LS
453.113 199.815 L
449.672 185.871 L
484.454 184.851 L
486.557 199.058 LE
484.454 184.851 LS
449.672 185.871 L
446.773 171.853 L
482.897 170.62 L
484.454 184.851 LE
482.897 170.62 LS
446.773 171.853 L
444.404 157.821 L
481.869 156.427 L
482.897 170.62 LE
481.869 156.427 LS
444.404 157.821 L
442.547 143.833 L
481.347 142.326 L
481.869 156.427 LE
481.347 142.326 LS
442.547 143.833 L
441.178 129.941 L
481.302 128.366 L
481.347 142.326 LE
596.294 396.593 LS
580.724 386.655 L
571.397 376.267 L
587.916 385.427 L
596.294 396.593 LE
587.916 385.427 LS
571.397 376.267 L
562.33 365.456 L
579.833 373.861 L
587.916 385.427 LE
579.833 373.861 LS
562.33 365.456 L
553.577 354.237 L
572.098 361.917 L
579.833 373.861 LE
572.098 361.917 LS
553.577 354.237 L
545.191 342.635 L
564.763 349.624 L
572.098 361.917 LE
564.763 349.624 LS
545.191 342.635 L
537.224 330.684 L
557.877 337.02 L
564.763 349.624 LE
557.877 337.02 LS
537.224 330.684 L
529.729 318.427 L
551.487 324.151 L
557.877 337.02 LE
551.487 324.151 LS
529.729 318.427 L
522.745 305.913 L
545.629 311.073 L
551.487 324.151 LE
545.629 311.073 LS
522.745 305.913 L
516.312 293.203 L
540.336 297.846 L
545.629 311.073 LE
540.336 297.846 LS
516.312 293.203 L
510.453 280.36 L
535.627 284.538 L
540.336 297.846 LE
535.627 284.538 LS
510.453 280.36 L
505.183 267.453 L
531.512 271.219 L
535.627 284.538 LE
531.512 271.219 LS
505.183 267.453 L
500.438 254.345 L
527.936 257.745 L
531.512 271.219 LE
527.936 257.745 LS
500.438 254.345 L
496.175 240.888 L
524.871 243.965 L
527.936 257.745 LE
524.871 243.965 LS
496.175 240.888 L
492.426 227.144 L
522.343 229.945 L
524.871 243.965 LE
522.343 229.945 LS
492.426 227.144 L
489.216 213.178 L
520.372 215.751 L
522.343 229.945 LE
520.372 215.751 LS
489.216 213.178 L
486.557 199.058 L
518.963 201.452 L
520.372 215.751 LE
518.963 201.452 LS
486.557 199.058 L
484.454 184.851 L
518.116 187.115 L
518.963 201.452 LE
518.116 187.115 LS
484.454 184.851 L
482.897 170.62 L
517.815 172.803 L
518.116 187.115 LE
517.815 172.803 LS
482.897 170.62 L
481.869 156.427 L
518.036 158.575 L
517.815 172.803 LE
518.036 158.575 LS
481.869 156.427 L
481.347 142.326 L
518.754 144.484 L
518.036 158.575 LE
518.754 144.484 LS
481.347 142.326 L
481.302 128.366 L
519.935 130.574 L
518.754 144.484 LE
611.663 406.89 LS
596.294 396.593 L
587.916 385.427 L
604.157 395.12 L
611.663 406.89 LE
604.157 395.12 LS
587.916 385.427 L
579.833 373.861 L
596.976 382.974 L
604.157 395.12 LE
596.976 382.974 LS
579.833 373.861 L
572.098 361.917 L
590.17 370.477 L
596.976 382.974 LE
590.17 370.477 LS
572.098 361.917 L
564.763 349.624 L
583.79 357.662 L
590.17 370.477 LE
583.79 357.662 LS
564.763 349.624 L
557.877 337.02 L
577.881 344.572 L
583.79 357.662 LE
577.881 344.572 LS
557.877 337.02 L
551.487 324.151 L
572.486 331.255 L
577.881 344.572 LE
572.486 331.255 LS
551.487 324.151 L
545.629 311.073 L
567.639 317.77 L
572.486 331.255 LE
567.639 317.77 LS
545.629 311.073 L
540.336 297.846 L
563.365 304.18 L
567.639 317.77 LE
563.365 304.18 LS
540.336 297.846 L
535.627 284.538 L
559.68 290.553 L
563.365 304.18 LE
559.68 290.553 LS
535.627 284.538 L
531.512 271.219 L
556.588 276.96 L
559.68 290.553 LE
556.588 276.96 LS
531.512 271.219 L
527.936 257.745 L
554.046 263.253 L
556.588 276.96 LE
554.046 263.253 LS
527.936 257.745 L
524.871 243.965 L
552.034 249.28 L
554.046 263.253 LE
552.034 249.28 LS
524.871 243.965 L
522.343 229.945 L
550.578 235.109 L
552.034 249.28 LE
550.578 235.109 LS
522.343 229.945 L
520.372 215.751 L
549.691 220.806 L
550.578 235.109 LE
549.691 220.806 LS
520.372 215.751 L
518.963 201.452 L
549.373 206.442 L
549.691 220.806 LE
549.373 206.442 LS
518.963 201.452 L
518.116 187.115 L
549.615 192.081 L
549.373 206.442 LE
549.615 192.081 LS
518.116 187.115 L
517.815 172.803 L
550.401 177.788 L
549.615 192.081 LE
550.401 177.788 LS
517.815 172.803 L
518.036 158.575 L
551.703 163.618 L
550.401 177.788 LE
551.703 163.618 LS
518.036 158.575 L
518.754 144.484 L
553.49 149.62 L
551.703 163.618 LE
553.49 149.62 LS
518.754 144.484 L
519.935 130.574 L
555.722 135.84 L
553.49 149.62 LE
627.04 417.191 LS
611.663 406.89 L
604.157 395.12 L
620.279 404.977 L
627.04 417.191 LE
620.279 404.977 LS
604.157 395.12 L
596.976 382.974 L
613.865 392.409 L
620.279 404.977 LE
613.865 392.409 LS
596.976 382.974 L
590.17 370.477 L
607.847 379.514 L
613.865 392.409 LE
607.847 379.514 LS
590.17 370.477 L
583.79 357.662 L
602.274 366.328 L
607.847 379.514 LE
602.274 366.328 LS
583.79 357.662 L
577.881 344.572 L
597.189 352.896 L
602.274 366.328 LE
597.189 352.896 LS
577.881 344.572 L
572.486 331.255 L
592.63 339.271 L
597.189 352.896 LE
592.63 339.271 LS
572.486 331.255 L
567.639 317.77 L
588.629 325.511 L
592.63 339.271 LE
588.629 325.511 LS
567.639 317.77 L
563.365 304.18 L
585.206 311.682 L
588.629 325.511 LE
585.206 311.682 LS
563.365 304.18 L
559.68 290.553 L
582.374 297.852 L
585.206 311.682 LE
582.374 297.852 LS
559.68 290.553 L
556.588 276.96 L
580.131 284.093 L
582.374 297.852 LE
580.131 284.093 LS
556.588 276.96 L
554.046 263.253 L
578.444 270.256 L
580.131 284.093 LE
578.444 270.256 LS
554.046 263.253 L
552.034 249.28 L
577.303 256.185 L
578.444 270.256 LE
577.303 256.185 LS
552.034 249.28 L
550.578 235.109 L
576.729 241.95 L
577.303 256.185 LE
576.729 241.95 LS
550.578 235.109 L
549.691 220.806 L
576.73 227.62 L
576.729 241.95 LE
576.73 227.62 LS
549.691 220.806 L
549.373 206.442 L
577.304 213.264 L
576.73 227.62 LE
577.304 213.264 LS
549.373 206.442 L
549.615 192.081 L
578.438 198.946 L
577.304 213.264 LE
578.438 198.946 LS
549.615 192.081 L
550.401 177.788 L
580.109 184.729 L
578.438 198.946 LE
580.109 184.729 LS
550.401 177.788 L
551.703 163.618 L
582.287 170.667 L
580.109 184.729 LE
582.287 170.667 LS
551.703 163.618 L
553.49 149.62 L
584.938 156.808 L
582.287 170.667 LE
584.938 156.808 LS
553.49 149.62 L
555.722 135.84 L
588.021 143.193 L
584.938 156.808 LE
642.505 427.304 LS
627.04 417.191 L
620.279 404.977 L
636.344 414.777 L
642.505 427.304 LE
636.344 414.777 LS
620.279 404.977 L
613.865 392.409 L
630.546 401.913 L
636.344 414.777 LE
630.546 401.913 LS
613.865 392.409 L
607.847 379.514 L
625.161 388.741 L
630.546 401.913 LE
625.161 388.741 LS
607.847 379.514 L
602.274 366.328 L
620.233 375.301 L
625.161 388.741 LE
620.233 375.301 LS
602.274 366.328 L
597.189 352.896 L
615.805 361.638 L
620.233 375.301 LE
615.805 361.638 LS
597.189 352.896 L
592.63 339.271 L
611.911 347.808 L
615.805 361.638 LE
611.911 347.808 LS
592.63 339.271 L
588.629 325.511 L
608.581 333.87 L
611.911 347.808 LE
608.581 333.87 LS
588.629 325.511 L
585.206 311.682 L
605.833 319.891 L
608.581 333.87 LE
605.833 319.891 LS
585.206 311.682 L
582.374 297.852 L
603.674 305.941 L
605.833 319.891 LE
603.674 305.941 LS
582.374 297.852 L
580.131 284.093 L
602.1 292.09 L
603.674 305.941 LE
602.1 292.09 LS
580.131 284.093 L
578.444 270.256 L
601.086 278.186 L
602.1 292.09 LE
601.086 278.186 LS
578.444 270.256 L
577.303 256.185 L
600.628 264.077 L
601.086 278.186 LE
600.628 264.077 LS
577.303 256.185 L
576.729 241.95 L
600.745 249.831 L
600.628 264.077 LE
600.745 249.831 LS
576.729 241.95 L
576.73 227.62 L
601.44 235.518 L
600.745 249.831 LE
601.44 235.518 LS
576.73 227.62 L
577.304 213.264 L
602.709 221.206 L
601.44 235.518 LE
602.709 221.206 LS
577.304 213.264 L
578.438 198.946 L
604.535 206.961 L
602.709 221.206 LE
604.535 206.961 LS
578.438 198.946 L
580.109 184.729 L
606.893 192.841 L
604.535 206.961 LE
606.893 192.841 LS
580.109 184.729 L
582.287 170.667 L
609.75 178.901 L
606.893 192.841 LE
609.75 178.901 LS
582.287 170.667 L
584.938 156.808 L
613.069 165.187 L
609.75 178.901 LE
613.069 165.187 LS
584.938 156.808 L
588.021 143.193 L
616.809 151.736 L
613.069 165.187 LE
658.084 437.141 LS
642.505 427.304 L
636.344 414.777 L
652.382 424.398 L
658.084 437.141 LE
652.382 424.398 LS
636.344 414.777 L
630.546 401.913 L
647.056 411.332 L
652.382 424.398 LE
647.056 411.332 LS
630.546 401.913 L
625.161 388.741 L
642.153 397.973 L
647.056 411.332 LE
642.153 397.973 LS
625.161 388.741 L
620.233 375.301 L
637.718 384.362 L
642.153 397.973 LE
637.718 384.362 LS
620.233 375.301 L
615.805 361.638 L
633.789 370.548 L
637.718 384.362 LE
633.789 370.548 LS
615.805 361.638 L
611.911 347.808 L
630.402 356.585 L
633.789 370.548 LE
630.402 356.585 LS
611.911 347.808 L
608.581 333.87 L
627.581 342.535 L
630.402 356.585 LE
627.581 342.535 LS
608.581 333.87 L
605.833 319.891 L
625.343 328.466 L
627.581 342.535 LE
625.343 328.466 LS
605.833 319.891 L
603.674 305.941 L
623.693 314.446 L
625.343 328.466 LE
623.693 314.446 LS
603.674 305.941 L
602.1 292.09 L
622.624 300.547 L
623.693 314.446 LE
622.624 300.547 LS
602.1 292.09 L
601.086 278.186 L
622.116 286.615 L
622.624 300.547 LE
622.116 286.615 LS
601.086 278.186 L
600.628 264.077 L
622.172 272.499 L
622.116 286.615 LE
622.172 272.499 LS
600.628 264.077 L
600.745 249.831 L
622.807 258.267 L
622.172 272.499 LE
622.807 258.267 LS
600.745 249.831 L
601.44 235.518 L
624.022 243.988 L
622.807 258.267 LE
624.022 243.988 LS
601.44 235.518 L
602.709 221.206 L
625.811 229.732 L
624.022 243.988 LE
625.811 229.732 LS
602.709 221.206 L
604.535 206.961 L
628.154 215.562 L
625.811 229.732 LE
628.154 215.562 LS
604.535 206.961 L
606.893 192.841 L
631.024 201.538 L
628.154 215.562 LE
631.024 201.538 LS
606.893 192.841 L
609.75 178.901 L
634.386 187.711 L
631.024 201.538 LE
634.386 187.711 LS
609.75 178.901 L
613.069 165.187 L
638.202 174.126 L
634.386 187.711 LE
638.202 174.126 LS
613.069 165.187 L
616.809 151.736 L
642.428 160.821 L
638.202 174.126 LE
673.815 446.677 LS
658.084 437.141 L
652.382 424.398 L
668.448 433.79 L
673.815 446.677 LE
668.448 433.79 LS
652.382 424.398 L
647.056 411.332 L
663.465 420.589 L
668.448 433.79 LE
663.465 420.589 LS
647.056 411.332 L
642.153 397.973 L
658.913 407.107 L
663.465 420.589 LE
658.913 407.107 LS
642.153 397.973 L
637.718 384.362 L
654.834 393.385 L
658.913 407.107 LE
654.834 393.385 LS
637.718 384.362 L
633.789 370.548 L
651.267 379.472 L
654.834 393.385 LE
651.267 379.472 LS
633.789 370.548 L
630.402 356.585 L
648.245 365.426 L
651.267 379.472 LE
648.245 365.426 LS
630.402 356.585 L
627.581 342.535 L
645.793 351.307 L
648.245 365.426 LE
645.793 351.307 LS
627.581 342.535 L
625.343 328.466 L
643.922 337.184 L
645.793 351.307 LE
643.922 337.184 LS
625.343 328.466 L
623.693 314.446 L
642.639 323.126 L
643.922 337.184 LE
642.639 323.126 LS
623.693 314.446 L
622.624 300.547 L
641.933 309.204 L
642.639 323.126 LE
641.933 309.204 LS
622.624 300.547 L
622.116 286.615 L
641.789 295.264 L
641.933 309.204 LE
641.789 295.264 LS
622.116 286.615 L
622.172 272.499 L
642.214 281.154 L
641.789 295.264 LE
642.214 281.154 LS
622.172 272.499 L
622.807 258.267 L
643.219 266.943 L
642.214 281.154 LE
643.219 266.943 LS
622.807 258.267 L
624.022 243.988 L
644.807 252.701 L
643.219 266.943 LE
644.807 252.701 LS
624.022 243.988 L
625.811 229.732 L
646.968 238.497 L
644.807 252.701 LE
646.968 238.497 LS
625.811 229.732 L
628.154 215.562 L
649.68 224.393 L
646.968 238.497 LE
649.68 224.393 LS
628.154 215.562 L
631.024 201.538 L
652.914 210.448 L
649.68 224.393 LE
652.914 210.448 LS
631.024 201.538 L
634.386 187.711 L
656.637 196.713 L
652.914 210.448 LE
656.637 196.713 LS
634.386 187.711 L
638.202 174.126 L
660.806 183.233 L
656.637 196.713 LE
660.806 183.233 LS
638.202 174.126 L
642.428 160.821 L
665.378 170.043 L
660.806 183.233 LE
689.791 455.926 LS
673.815 446.677 L
668.448 433.79 L
684.649 442.948 L
689.791 455.926 LE
684.649 442.948 LS
668.448 433.79 L
663.465 420.589 L
679.897 429.662 L
684.649 442.948 LE
679.897 429.662 LS
663.465 420.589 L
658.913 407.107 L
675.581 416.102 L
679.897 429.662 LE
675.581 416.102 LS
658.913 407.107 L
654.834 393.385 L
671.742 402.311 L
675.581 416.102 LE
671.742 402.311 LS
654.834 393.385 L
651.267 379.472 L
668.419 388.339 L
671.742 402.311 LE
668.419 388.339 LS
651.267 379.472 L
648.245 365.426 L
665.642 374.242 L
668.419 388.339 LE
665.642 374.242 LS
648.245 365.426 L
645.793 351.307 L
663.436 360.083 L
665.642 374.242 LE
663.436 360.083 LS
645.793 351.307 L
643.922 337.184 L
661.813 345.929 L
663.436 360.083 LE
661.813 345.929 LS
643.922 337.184 L
642.639 323.126 L
660.774 331.851 L
661.813 345.929 LE
660.774 331.851 LS
642.639 323.126 L
641.933 309.204 L
660.312 317.918 L
660.774 331.851 LE
660.312 317.918 LS
641.933 309.204 L
641.789 295.264 L
660.411 303.978 L
660.312 317.918 LE
660.411 303.978 LS
641.789 295.264 L
642.214 281.154 L
661.081 289.877 L
660.411 303.978 LE
661.081 289.877 LS
642.214 281.154 L
643.219 266.943 L
662.335 275.686 L
661.081 289.877 LE
662.335 275.686 LS
643.219 266.943 L
644.807 252.701 L
664.171 261.474 L
662.335 275.686 LE
664.171 261.474 LS
644.807 252.701 L
646.968 238.497 L
666.579 247.31 L
664.171 261.474 LE
666.579 247.31 LS
646.968 238.497 L
649.68 224.393 L
669.537 233.255 L
666.579 247.31 LE
669.537 233.255 LS
649.68 224.393 L
652.914 210.448 L
673.014 219.369 L
669.537 233.255 LE
673.014 219.369 LS
652.914 210.448 L
656.637 196.713 L
676.976 205.701 L
673.014 219.369 LE
676.976 205.701 LS
656.637 196.713 L
660.806 183.233 L
681.379 192.296 L
676.976 205.701 LE
681.379 192.296 LS
660.806 183.233 L
665.378 170.043 L
686.181 179.187 L
681.379 192.296 LE
706.165 464.925 LS
689.791 455.926 L
684.649 442.948 L
701.153 451.896 L
706.165 464.925 LE
701.153 451.896 LS
684.649 442.948 L
679.897 429.662 L
696.534 438.563 L
701.153 451.896 LE
696.534 438.563 LS
679.897 429.662 L
675.581 416.102 L
692.353 424.961 L
696.534 438.563 LE
692.353 424.961 LS
675.581 416.102 L
671.742 402.311 L
688.652 411.132 L
692.353 424.961 LE
688.652 411.132 LS
671.742 402.311 L
668.419 388.339 L
685.469 397.127 L
688.652 411.132 LE
685.469 397.127 LS
668.419 388.339 L
665.642 374.242 L
682.834 383.003 L
685.469 397.127 LE
682.834 383.003 LS
665.642 374.242 L
663.436 360.083 L
680.769 368.823 L
682.834 383.003 LE
680.769 368.823 LS
663.436 360.083 L
661.813 345.929 L
679.287 354.654 L
680.769 368.823 LE
679.287 354.654 LS
661.813 345.929 L
660.774 331.851 L
678.389 340.566 L
679.287 354.654 LE
678.389 340.566 LS
660.774 331.851 L
660.312 317.918 L
678.066 326.629 L
678.389 340.566 LE
678.066 326.629 LS
660.312 317.918 L
660.411 303.978 L
678.304 312.691 L
678.066 326.629 LE
678.304 312.691 LS
660.411 303.978 L
661.081 289.877 L
679.116 298.597 L
678.304 312.691 LE
679.116 298.597 LS
661.081 289.877 L
662.335 275.686 L
680.511 284.419 L
679.116 298.597 LE
680.511 284.419 LS
662.335 275.686 L
664.171 261.474 L
682.489 270.227 L
680.511 284.419 LE
682.489 270.227 LS
664.171 261.474 L
666.579 247.31 L
685.038 256.087 L
682.489 270.227 LE
685.038 256.087 LS
666.579 247.31 L
669.537 233.255 L
688.136 242.062 L
685.038 256.087 LE
688.136 242.062 LS
669.537 233.255 L
673.014 219.369 L
691.752 228.212 L
688.136 242.062 LE
691.752 228.212 LS
673.014 219.369 L
676.976 205.701 L
695.85 214.584 L
691.752 228.212 LE
695.85 214.584 LS
676.976 205.701 L
681.379 192.296 L
700.387 201.223 L
695.85 214.584 LE
700.387 201.223 LS
681.379 192.296 L
686.181 179.187 L
705.319 188.164 L
700.387 201.223 LE
723.184 473.708 LS
706.165 464.925 L
701.153 451.896 L
718.212 460.663 L
723.184 473.708 LE
718.212 460.663 LS
701.153 451.896 L
696.534 438.563 L
713.634 447.316 L
718.212 460.663 LE
713.634 447.316 LS
696.534 438.563 L
692.353 424.961 L
709.494 433.702 L
713.634 447.316 LE
709.494 433.702 LS
692.353 424.961 L
688.652 411.132 L
705.836 419.862 L
709.494 433.702 LE
705.836 419.862 LS
688.652 411.132 L
685.469 397.127 L
702.695 405.847 L
705.836 419.862 LE
702.695 405.847 LS
685.469 397.127 L
682.834 383.003 L
700.103 391.715 L
702.695 405.847 LE
700.103 391.715 LS
682.834 383.003 L
680.769 368.823 L
698.081 377.529 L
700.103 391.715 LE
698.081 377.529 LS
680.769 368.823 L
679.287 354.654 L
696.643 363.355 L
698.081 377.529 LE
696.643 363.355 LS
679.287 354.654 L
678.389 340.566 L
695.788 349.264 L
696.643 363.355 LE
695.788 349.264 LS
678.389 340.566 L
678.066 326.629 L
695.507 335.327 L
695.788 349.264 LE
695.507 335.327 LS
678.066 326.629 L
678.304 312.691 L
695.788 321.389 L
695.507 335.327 LE
695.788 321.389 LS
678.304 312.691 L
679.116 298.597 L
696.643 307.298 L
695.788 321.389 LE
696.643 307.298 LS
679.116 298.597 L
680.511 284.419 L
698.081 293.125 L
696.643 307.298 LE
698.081 293.125 LS
680.511 284.419 L
682.489 270.227 L
700.103 278.938 L
698.081 293.125 LE
700.103 278.938 LS
682.489 270.227 L
685.038 256.087 L
702.695 264.806 L
700.103 278.938 LE
702.695 264.806 LS
685.038 256.087 L
688.136 242.062 L
705.836 250.791 L
702.695 264.806 LE
705.836 250.791 LS
688.136 242.062 L
691.752 228.212 L
709.494 236.952 L
705.836 250.791 LE
709.494 236.952 LS
691.752 228.212 L
695.85 214.584 L
713.634 223.337 L
709.494 236.952 LE
713.634 223.337 LS
695.85 214.584 L
700.387 201.223 L
718.212 209.99 L
713.634 223.337 LE
718.212 209.99 LS
700.387 201.223 L
705.319 188.164 L
723.184 196.945 L
718.212 209.99 LE

0 0 1 setrgbcolor 2.5 setlinewidth
723.184 196.945 LS
718.212 209.99 L
713.634 223.337 L
709.494 236.952 L
705.836 250.791 L
702.695 264.806 L
700.103 278.938 L
698.081 293.125 L
696.643 307.298 L
695.788 321.389 L
695.507 335.327 L
695.788 349.264 L
696.643 363.355 L
698.081 377.529 L
700.103 391.715 L
702.695 405.847 L
705.836 419.862 L
709.494 433.702 L
713.634 447.316 L
718.212 460.663 L
723.184 473.708 LE

1 0 0 setrgbcolor 2.5 setlinewidth
260.77 335.327 LS
278.212 326.629 L
295.966 317.918 L
314.345 309.204 L
333.653 300.547 L
354.178 292.09 L
376.147 284.093 L
399.69 276.96 L
424.766 271.219 L
451.094 267.453 L
478.138 266.136 L
505.183 267.453 L
531.512 271.219 L
556.588 276.96 L
580.131 284.093 L
602.1 292.09 L
622.624 300.547 L
641.933 309.204 L
660.312 317.918 L
678.066 326.629 L
695.507 335.327 L
715.694 345.384 L
736.058 355.313 L
756.762 364.964 L
777.946 374.151 L
799.697 382.637 L
822.022 390.133 L
844.815 396.316 L
867.825 400.883 L
890.668 403.628 L
912.877 404.517 LE

(D) 924 400 15 /Helvetica S
(A) 723 177 15 /Helvetica S
(B) 720 485 15 /Helvetica S
(C) 237 337 15 /Helvetica S
gsave 0 setgray % 0 0.35 0 setrgbcolor
695.507 335.327 moveto
695.507 335.327 3 0 360 arc fill
912.877 404.517 moveto
912.877 404.517 3 0 360 arc fill
723.184 196.945 moveto
723.184 196.945 3 0 360 arc fill
723.184 473.708 moveto
723.184 473.708 3 0 360 arc fill
260.77 335.327 moveto
260.77 335.327 3 0 360 arc fill
grestore
grestore
showpage
cleartomark
%%PageTrailer
%%Trailer
end
%%EOF
