%!PS-Adobe-3.0 EPSF-3.0
%%Title: star
%%Creator: GL2PS 1.4.3, (C) 1999-2020 C. Geuzaine
%%For: Gmsh
%%CreationDate: Tue Aug 06 21:59:03 2024
%%LanguageLevel: 3
%%DocumentData: Clean7Bit
%%Pages: 1
%%BoundingBox: 475 85 1105 757
%%EndComments
%%BeginProlog
/gl2psdict 64 dict def gl2psdict begin
/tryPS3shading false def % set to false to force subdivision
/rThreshold 0.0666667 def % red component subdivision threshold
/gThreshold 0.05 def % green component subdivision threshold
/bThreshold 0.1 def % blue component subdivision threshold
/BD { bind def } bind def
/C  { setrgbcolor } BD
/G  { 0.082 mul exch 0.6094 mul add exch 0.3086 mul add neg 1.0 add setgray } BD
/W  { setlinewidth } BD
/LC  { setlinecap } BD
/LJ  { setlinejoin } BD
/FC { findfont exch /SH exch def SH scalefont setfont } BD
/SW { dup stringwidth pop } BD
/S  { FC moveto show } BD
/SBC{ FC moveto SW -2 div 0 rmoveto show } BD
/SBR{ FC moveto SW neg 0 rmoveto show } BD
/SCL{ FC moveto 0 SH -2 div rmoveto show } BD
/SCC{ FC moveto SW -2 div SH -2 div rmoveto show } BD
/SCR{ FC moveto SW neg SH -2 div rmoveto show } BD
/STL{ FC moveto 0 SH neg rmoveto show } BD
/STC{ FC moveto SW -2 div SH neg rmoveto show } BD
/STR{ FC moveto SW neg SH neg rmoveto show } BD
/FCT { FC translate 0 0 } BD
/SR  { gsave FCT moveto rotate show grestore } BD
/SBCR{ gsave FCT moveto rotate SW -2 div 0 rmoveto show grestore } BD
/SBRR{ gsave FCT moveto rotate SW neg 0 rmoveto show grestore } BD
/SCLR{ gsave FCT moveto rotate 0 SH -2 div rmoveto show grestore} BD
/SCCR{ gsave FCT moveto rotate SW -2 div SH -2 div rmoveto show grestore} BD
/SCRR{ gsave FCT moveto rotate SW neg SH -2 div rmoveto show grestore} BD
/STLR{ gsave FCT moveto rotate 0 SH neg rmoveto show grestore } BD
/STCR{ gsave FCT moveto rotate SW -2 div SH neg rmoveto show grestore } BD
/STRR{ gsave FCT moveto rotate SW neg SH neg rmoveto show grestore } BD
/P  { newpath 0.0 360.0 arc closepath fill } BD
/R  { newpath moveto lineto lineto lineto closepath fill } BD
/LS { newpath moveto } BD
/L  { lineto } BD
/LE { lineto stroke } BD
/T  { newpath moveto lineto lineto closepath fill } BD
/STshfill {
      /b1 exch def /g1 exch def /r1 exch def /y1 exch def /x1 exch def
      /b2 exch def /g2 exch def /r2 exch def /y2 exch def /x2 exch def
      /b3 exch def /g3 exch def /r3 exch def /y3 exch def /x3 exch def
      gsave << /ShadingType 4 /ColorSpace [/DeviceRGB]
      /DataSource [ 0 x1 y1 r1 g1 b1 0 x2 y2 r2 g2 b2 0 x3 y3 r3 g3 b3 ] >>
      shfill grestore } BD
/Tm { 3 -1 roll 8 -1 roll 13 -1 roll add add 3 div
      3 -1 roll 7 -1 roll 11 -1 roll add add 3 div
      3 -1 roll 6 -1 roll 9 -1 roll add add 3 div C T } BD
/STsplit {
      4 index 15 index add 0.5 mul
      4 index 15 index add 0.5 mul
      4 index 15 index add 0.5 mul
      4 index 15 index add 0.5 mul
      4 index 15 index add 0.5 mul
      5 copy 5 copy 25 15 roll
      9 index 30 index add 0.5 mul
      9 index 30 index add 0.5 mul
      9 index 30 index add 0.5 mul
      9 index 30 index add 0.5 mul
      9 index 30 index add 0.5 mul
      5 copy 5 copy 35 5 roll 25 5 roll 15 5 roll
      4 index 10 index add 0.5 mul
      4 index 10 index add 0.5 mul
      4 index 10 index add 0.5 mul
      4 index 10 index add 0.5 mul
      4 index 10 index add 0.5 mul
      5 copy 5 copy 40 5 roll 25 5 roll 15 5 roll 25 5 roll
      STnoshfill STnoshfill STnoshfill STnoshfill } BD
/STnoshfill {
      2 index 8 index sub abs rThreshold gt
      { STsplit }
      { 1 index 7 index sub abs gThreshold gt
        { STsplit }
        { dup 6 index sub abs bThreshold gt
          { STsplit }
          { 2 index 13 index sub abs rThreshold gt
            { STsplit }
            { 1 index 12 index sub abs gThreshold gt
              { STsplit }
              { dup 11 index sub abs bThreshold gt
                { STsplit }
                { 7 index 13 index sub abs rThreshold gt
                  { STsplit }
                  { 6 index 12 index sub abs gThreshold gt
                    { STsplit }
                    { 5 index 11 index sub abs bThreshold gt
                      { STsplit }
                      { Tm }
                      ifelse }
                    ifelse }
                  ifelse }
                ifelse }
              ifelse }
            ifelse }
          ifelse }
        ifelse }
      ifelse } BD
tryPS3shading
{ /shfill where
  { /ST { STshfill } BD }
  { /ST { STnoshfill } BD }
  ifelse }
{ /ST { STnoshfill } BD }
ifelse
end
%%EndProlog
%%BeginSetup
/DeviceRGB setcolorspace
gl2psdict begin
%%EndSetup
%%Page: 1 1
%%BeginPageSetup
%%EndPageSetup
mark
gsave
1.0 1.0 scale
0 0 0 C
(-0.525) 519.611 89.5357 15 /Helvetica S
(-0.263) 655.139 89.5357 15 /Helvetica S
(0) 807 89.5357 15 /Helvetica S
(0.263) 928.528 89.5357 15 /Helvetica S
(0.525) 1064.06 89.5357 15 /Helvetica S
(-0.602) 480.522 118.952 15 /Helvetica S
(-0.301) 480.522 274.31 15 /Helvetica S
(0) 513.189 429.667 15 /Helvetica S
(0.301) 485.189 585.024 15 /Helvetica S
(0.602) 485.189 740.381 15 /Helvetica S
1 W
539.945 124.286 LS
539.945 109.286 LE
675.472 124.286 LS
675.472 109.286 LE
811 124.286 LS
811 109.286 LE
946.528 124.286 LS
946.528 109.286 LE
1082.06 124.286 LS
1082.06 109.286 LE
539.945 124.286 LS
524.94 124.286 LE
539.945 279.643 LS
524.94 279.643 LE
539.945 435 LS
524.94 435 LE
539.945 590.357 LS
524.94 590.357 LE
539.945 745.714 LS
524.94 745.714 LE
539.945 124.286 LS
1082.06 124.286 LE
539.945 124.286 LS
539.945 745.714 LE
539.945 124.286 LS
539.945 124.286 LE
539.945 745.714 LS
1082.06 745.714 LE
1082.06 124.286 LS
1082.06 745.714 LE
1082.06 124.286 LS
1082.06 124.286 LE
539.945 124.286 LS
1082.06 124.286 LE
539.945 124.286 LS
539.945 745.714 L
539.945 745.714 L
1082.06 745.714 LE
1082.06 124.286 LS
1082.06 745.714 L
1082.06 745.714 LE
1 0.470588 0 C
811 745.714 LS
825.03 721.763 L
843.051 696.797 L
865.582 671.928 L
892.541 648.507 L
923.221 627.959 L
956.313 611.45 L
990.167 599.579 L
1023.17 592.296 L
1054.07 589.025 L
1082.06 590.357 L
1068.34 566.238 L
1055.92 538.15 L
1045.86 506.314 L
1039.27 471.493 L
1036.96 435 L
1039.27 398.507 L
1045.86 363.686 L
1055.92 331.85 L
1068.34 303.762 L
1082.06 279.643 L
1054.07 280.975 L
1023.17 277.704 L
990.167 270.421 L
956.313 258.55 L
923.221 242.041 L
892.541 221.493 L
865.582 198.072 L
843.051 173.203 L
825.03 148.237 L
811 124.286 L
796.97 148.237 L
778.949 173.203 L
756.418 198.072 L
729.459 221.493 L
698.779 242.041 L
665.687 258.55 L
631.833 270.421 L
598.83 277.704 L
567.927 280.975 L
539.945 279.643 L
553.663 303.762 L
566.084 331.85 L
576.138 363.686 L
582.734 398.507 L
585.038 435 L
582.734 471.493 L
576.138 506.314 L
566.084 538.15 L
553.663 566.238 L
539.945 590.357 L
567.927 589.025 L
598.83 592.296 L
631.833 599.579 L
665.687 611.45 L
698.779 627.959 L
729.459 648.507 L
756.418 671.928 L
778.949 696.797 L
796.97 721.763 L
811 745.714 LE
(A) 1040 560 15 /Helvetica S
(B) 800 700 15 /Helvetica S
(C) 565 560 15 /Helvetica S
(D) 564 294 15 /Helvetica S
(E) 800 150 15 /Helvetica S
(F) 1040 294 15 /Helvetica S
grestore
showpage
cleartomark
%%PageTrailer
%%Trailer
end
%%EOF
