%!PS-Adobe-3.0 EPSF-3.0
%%Title:                     maniFEM
%%BoundingBox:  -40  20  360  300
%%EndComments
%%BeginSetup
<< /PageSize [620 320] >> setpagedevice
%%EndSetup

%* _____________________________ Arrows ____________________________________ 

%* Procedure to draw the path for an arrow head. Note: the arrowhead will be 
%* added to the current path. The arrowhead will also be drawn and filled. 
%* 
%* Usage: Linewidth deltaX deltaY ArrowHead 
%* 
%* where: LineWidth is the width in points of the arrow head lines 
%* 
%* deltaX and deltaY define the direction that the arrow points 
%* 
%* Note: If Linewidth is zero, a value of 1 will be substituted 
%*
/rArrowHead { 
exch atan matrix currentmatrix exch rotate exch 
dup 0 eq 
{ pop 1 } if 
dup scale 
-7 2 rlineto 
1 -2 rlineto 
-1 -2 rlineto 
7 2 rlineto 
currentpoint 
gsave 
newpath moveto 
-7 2 rlineto 
1 -2 rlineto 
-1 -2 rlineto 
closepath 
fill 
grestore 
setmatrix 
} def 

%* Procedure to draw the path for an arrow head. Note: the arrowhead will be 
%* added to the current path. The arrowhead will also be drawn and filled. 
%* 
%* Usage: Linewidth PreviousX PreviousY ArrowHead 
%* 
%* where: LineWidth is the width in points of the arrow head lines 
%* 
%* PreviousX and PreviousY along with the currentpoint 
%* define the direction that the arrow points 
%* 
%* Note: If Linewidth is zero, a value of 1 will be substituted 
%*
/ArrowHead { 
currentpoint 
4 2 roll exch 4 -1 roll exch 
sub 3 1 roll sub
rArrowHead
} def 

%* _____________________________ RLineto^ ____________________________________ 
%* Procedure to add a relative line to the current path and then add the 
%* path for an arrow on its end. 
%* 
%* Usage: x y RLineto^ 
%* 
%* where: x and y are the offsets from the current point 
%* 
/RLineto^ { 
currentlinewidth currentpoint 5 3 roll 
rlineto 
ArrowHead 
} def 

%* _____________________________ Lineto^ ____________________________________ 
%* Procedure to add a line to the current path and then add the 
%* path for an arrow on its end. 
%* 
%* Usage: x y Lineto^ 
%* 
%* where: x and y are the new points for the path 
%* 
/Lineto^ { 
currentlinewidth currentpoint 5 3 roll 
lineto 
ArrowHead 
} def 

gsave
40 40 scale
4 4 translate
0.02 setlinewidth

0.4 setgray
-4.7 0 moveto 4.7 0 Lineto^ stroke
0 -3.3 moveto 0 3.3 Lineto^ stroke
-0.08 3 moveto 0.08 3 lineto stroke
-0.08 2 moveto 0.08 2 lineto stroke
-0.08 1 moveto 0.08 1 lineto stroke
-0.08 -1 moveto 0.08 -1 lineto stroke
-0.08 -2 moveto 0.08 -2 lineto stroke
-0.08 -3 moveto 0.08 -3 lineto stroke

0 setgray
-4.71238898038469 -3.0 moveto
-4.594579255875073 -2.996917333733128 lineto
-4.476769531365456 -2.9876883405951378 lineto
-4.358959806855838 -2.972369920397677 lineto
-4.241150082346221 -2.9510565162951536 lineto
-4.123340357836604 -2.923879532511287 lineto
-4.005530633326986 -2.891006524188368 lineto
-3.8877209088173688 -2.852640164354092 lineto
-3.7699111843077517 -2.8090169943749475 lineto
-3.6521014597981347 -2.7604059656000306 lineto
-3.5342917352885173 -2.7071067811865475 lineto
-3.4164820107789 -2.6494480483301834 lineto
-3.2986722862692828 -2.587785252292473 lineto
-3.1808625617596658 -2.522498564715949 lineto
-3.0630528372500483 -2.4539904997395467 lineto
-2.945243112740431 -2.3826834323650896 lineto
-2.827433388230814 -2.3090169943749475 lineto
-2.709623663721197 -2.2334453638559055 lineto
-2.5918139392115793 -2.1564344650402307 lineto
-2.474004214701962 -2.078459095727845 lineto
-2.356194490192345 -2.0 lineto stroke
-2.356194490192345 -2.0 moveto
-2.238384765682728 -1.9184582380052828 lineto
-2.1205750411731104 -1.8312538755549068 lineto
-2.002765316663493 -1.738924556541771 lineto
-1.8849555921538759 -1.6420395219202062 lineto
-1.7671458676442586 -1.541196100146197 lineto
-1.6493361431346414 -1.437016024448821 lineto
-1.5315264186250241 -1.3301415996381434 lineto
-1.413716694115407 -1.2212317420824743 lineto
-1.2959069696057897 -1.1109579172698472 lineto
-1.1780972450961724 -0.9999999999999999 lineto
-1.0602875205865552 -0.8890420827301527 lineto
-0.9424777960769379 -0.7787682579175257 lineto
-0.8246680715673207 -0.6698584003618565 lineto
-0.7068583470577035 -0.5629839755511789 lineto
-0.5890486225480862 -0.4588038998538031 lineto
-0.47123889803846897 -0.3579604780797938 lineto
-0.3534291735288517 -0.26107544345822886 lineto
-0.23561944901923448 -0.16874612444509307 lineto
-0.11780972450961724 -0.08154176199471697 lineto
0.0 0.0 lineto stroke
0.0 0.0 moveto
0.11780972450961724 0.08154176199471698 lineto
0.23561944901923448 0.1687461244450931 lineto
0.3534291735288517 0.26107544345822886 lineto
0.47123889803846897 0.35796047807979386 lineto
0.5890486225480862 0.45880389985380304 lineto
0.7068583470577035 0.5629839755511789 lineto
0.8246680715673207 0.6698584003618565 lineto
0.9424777960769379 0.7787682579175257 lineto
1.0602875205865552 0.8890420827301527 lineto
1.1780972450961724 0.9999999999999999 lineto
1.2959069696057897 1.1109579172698472 lineto
1.413716694115407 1.2212317420824743 lineto
1.5315264186250241 1.3301415996381434 lineto
1.6493361431346414 1.437016024448821 lineto
1.7671458676442586 1.541196100146197 lineto
1.8849555921538759 1.6420395219202062 lineto
2.002765316663493 1.738924556541771 lineto
2.1205750411731104 1.8312538755549068 lineto
2.238384765682728 1.9184582380052828 lineto
2.356194490192345 2.0 lineto stroke
2.356194490192345 2.0 moveto
2.474004214701962 2.078459095727845 lineto
2.5918139392115793 2.1564344650402307 lineto
2.709623663721197 2.2334453638559055 lineto
2.827433388230814 2.3090169943749475 lineto
2.945243112740431 2.3826834323650896 lineto
3.0630528372500483 2.4539904997395467 lineto
3.1808625617596658 2.522498564715949 lineto
3.2986722862692828 2.587785252292473 lineto
3.4164820107789 2.6494480483301834 lineto
3.5342917352885173 2.7071067811865475 lineto
3.6521014597981347 2.7604059656000306 lineto
3.7699111843077517 2.8090169943749475 lineto
3.8877209088173688 2.852640164354092 lineto
4.005530633326986 2.891006524188368 lineto
4.123340357836604 2.923879532511287 lineto
4.241150082346221 2.9510565162951536 lineto
4.358959806855838 2.972369920397677 lineto
4.476769531365456 2.9876883405951378 lineto
4.594579255875073 2.996917333733128 lineto
4.71238898038469 3.0 lineto stroke

grestore

gsave
-53 52 translate
0.7 dup scale
0.8 setgray
87 66 moveto
105 65 lineto
120 35 lineto
146 54 lineto
163 49 lineto
158 47 152 44 148 40 curveto
144 36 138 32 135 28 curveto
130 24 125 18 115 20 curveto
105 23 103 30 102 35 curveto
102 44 99 48 95 51 curveto
90 55 88 61 87 66 curveto
closepath fill
1 0.5 0 setrgbcolor 0.8 setlinewidth
87 66 moveto
105 65 lineto
120 35 lineto
146 54 lineto
163 49 lineto
stroke
0 setgray
120 35 moveto 120 35 2 0 360 arc fill
grestore

gsave
20 113 translate
0.7 dup scale
0.8 setgray
60 30 moveto
85 35 lineto
120 35 lineto
146 54 lineto
163 49 lineto
158 44 153 43 148 40 curveto
141 37 140 30 132 25 curveto
123 20 115 21 111 22 curveto
104 23 99 23 94 22 curveto
89 21 84 21 78 22 curveto
71 24 65 25 60 30 curveto
closepath fill
1 0.5 0 setrgbcolor 0.8 setlinewidth
60 30 moveto
85 35 lineto
120 35 lineto
146 54 lineto
163 49 lineto
stroke
0 setgray
120 35 moveto 120 35 2 0 360 arc fill
grestore

gsave
145 155 translate
0.7 dup scale
0.8 setgray
60 30 moveto
85 35 lineto
105 65 lineto
138 58 lineto
156 60 lineto
152 55 152 50 146 45 curveto
142 41 140 41 137 35 curveto
135 30 132 24 128 23 curveto
122 21 115 22 111 22 curveto
104 23 99 23 94 22 curveto
89 21 84 21 78 22 curveto
71 24 65 25 60 30 curveto
closepath fill
1 0.5 0 setrgbcolor 0.8 setlinewidth
60 30 moveto
85 35 lineto
105 65 lineto 
138 58 lineto
156 60 lineto
stroke
0 setgray
105 65 moveto 105 65 2 0 360 arc fill
grestore

gsave
224 215 translate
0.7 dup scale
0.8 setgray
60 30 moveto
85 35 lineto
105 65 lineto
120 35 lineto
140 30 lineto
135 23 129 23 125 22 curveto
119 22 115 23 111 22 curveto
104 21 99 21 94 22 curveto
89 23 84 21 78 22 curveto
71 24 65 25 60 30 curveto
closepath fill
1 0.5 0 setrgbcolor 0.8 setlinewidth
60 30 moveto
85 35 lineto
105 65 lineto
120 35 lineto
140 30 lineto
stroke
0 setgray
105 65 moveto 105 65 2 0 360 arc fill
grestore


/Helvetica findfont 10 scalefont setfont	
165 285 moveto (q) show
135 37 moveto (-3) show
135 77 moveto (-2) show
135 117 moveto (-1) show
165 197 moveto (1) show
165 237 moveto (2) show
145 277 moveto (3) show
165 145 moveto (O) show


showpage
%%Trailer
%EOF
