%!PS-Adobe-3.0 EPSF-3.0
%%Title: composed
%%Creator: GL2PS 1.4.3, (C) 1999-2020 C. Geuzaine
%%For: Gmsh
%%CreationDate: Fri Nov 10 08:38:10 2023
%%LanguageLevel: 3
%%DocumentData: Clean7Bit
%%Pages: 1
%%BoundingBox: 350 300 1016 606
%%EndComments
%%BeginProlog
/gl2psdict 64 dict def gl2psdict begin
/tryPS3shading false def % set to false to force subdivision
/rThreshold 0.0666667 def % red component subdivision threshold
/gThreshold 0.05 def % green component subdivision threshold
/bThreshold 0.1 def % blue component subdivision threshold
/BD { bind def } bind def
/C  { setrgbcolor } BD
/G  { 0.082 mul exch 0.6094 mul add exch 0.3086 mul add neg 1.0 add setgray } BD
/W  { setlinewidth } BD
/LC  { setlinecap } BD
/LJ  { setlinejoin } BD
/FC { findfont exch /SH exch def SH scalefont setfont } BD
/SW { dup stringwidth pop } BD
/S  { FC moveto show } BD
/SBC{ FC moveto SW -2 div 0 rmoveto show } BD
/SBR{ FC moveto SW neg 0 rmoveto show } BD
/SCL{ FC moveto 0 SH -2 div rmoveto show } BD
/SCC{ FC moveto SW -2 div SH -2 div rmoveto show } BD
/SCR{ FC moveto SW neg SH -2 div rmoveto show } BD
/STL{ FC moveto 0 SH neg rmoveto show } BD
/STC{ FC moveto SW -2 div SH neg rmoveto show } BD
/STR{ FC moveto SW neg SH neg rmoveto show } BD
/FCT { FC translate 0 0 } BD
/SR  { gsave FCT moveto rotate show grestore } BD
/SBCR{ gsave FCT moveto rotate SW -2 div 0 rmoveto show grestore } BD
/SBRR{ gsave FCT moveto rotate SW neg 0 rmoveto show grestore } BD
/SCLR{ gsave FCT moveto rotate 0 SH -2 div rmoveto show grestore} BD
/SCCR{ gsave FCT moveto rotate SW -2 div SH -2 div rmoveto show grestore} BD
/SCRR{ gsave FCT moveto rotate SW neg SH -2 div rmoveto show grestore} BD
/STLR{ gsave FCT moveto rotate 0 SH neg rmoveto show grestore } BD
/STCR{ gsave FCT moveto rotate SW -2 div SH neg rmoveto show grestore } BD
/STRR{ gsave FCT moveto rotate SW neg SH neg rmoveto show grestore } BD
/P  { newpath 0.0 360.0 arc closepath fill } BD
/R  { newpath moveto lineto lineto lineto closepath fill } BD
/LS { newpath moveto } BD
/L  { lineto } BD
/LE { lineto stroke } BD
/T  { newpath moveto lineto lineto closepath fill } BD
/STshfill {
      /b1 exch def /g1 exch def /r1 exch def /y1 exch def /x1 exch def
      /b2 exch def /g2 exch def /r2 exch def /y2 exch def /x2 exch def
      /b3 exch def /g3 exch def /r3 exch def /y3 exch def /x3 exch def
      gsave << /ShadingType 4 /ColorSpace [/DeviceRGB]
      /DataSource [ 0 x1 y1 r1 g1 b1 0 x2 y2 r2 g2 b2 0 x3 y3 r3 g3 b3 ] >>
      shfill grestore } BD
/Tm { 3 -1 roll 8 -1 roll 13 -1 roll add add 3 div
      3 -1 roll 7 -1 roll 11 -1 roll add add 3 div
      3 -1 roll 6 -1 roll 9 -1 roll add add 3 div C T } BD
/STsplit {
      4 index 15 index add 0.5 mul
      4 index 15 index add 0.5 mul
      4 index 15 index add 0.5 mul
      4 index 15 index add 0.5 mul
      4 index 15 index add 0.5 mul
      5 copy 5 copy 25 15 roll
      9 index 30 index add 0.5 mul
      9 index 30 index add 0.5 mul
      9 index 30 index add 0.5 mul
      9 index 30 index add 0.5 mul
      9 index 30 index add 0.5 mul
      5 copy 5 copy 35 5 roll 25 5 roll 15 5 roll
      4 index 10 index add 0.5 mul
      4 index 10 index add 0.5 mul
      4 index 10 index add 0.5 mul
      4 index 10 index add 0.5 mul
      4 index 10 index add 0.5 mul
      5 copy 5 copy 40 5 roll 25 5 roll 15 5 roll 25 5 roll
      STnoshfill STnoshfill STnoshfill STnoshfill } BD
/STnoshfill {
      2 index 8 index sub abs rThreshold gt
      { STsplit }
      { 1 index 7 index sub abs gThreshold gt
        { STsplit }
        { dup 6 index sub abs bThreshold gt
          { STsplit }
          { 2 index 13 index sub abs rThreshold gt
            { STsplit }
            { 1 index 12 index sub abs gThreshold gt
              { STsplit }
              { dup 11 index sub abs bThreshold gt
                { STsplit }
                { 7 index 13 index sub abs rThreshold gt
                  { STsplit }
                  { 6 index 12 index sub abs gThreshold gt
                    { STsplit }
                    { 5 index 11 index sub abs bThreshold gt
                      { STsplit }
                      { Tm }
                      ifelse }
                    ifelse }
                  ifelse }
                ifelse }
              ifelse }
            ifelse }
          ifelse }
        ifelse }
      ifelse } BD
tryPS3shading
{ /shfill where
  { /ST { STshfill } BD }
  { /ST { STnoshfill } BD }
  ifelse }
{ /ST { STnoshfill } BD }
ifelse
end
%%EndProlog
%%BeginSetup
/DeviceRGB setcolorspace
gl2psdict begin
%%EndSetup
%%Page: 1 1
%%BeginPageSetup
%%EndPageSetup
mark
gsave
1.0 1.0 scale
711.275 596.568 0.944578 0.740845 4.96171e-13 714.393 599.3 0.76372 0.598996 1.41004e-08 672.293 598.389 0.746908 0.58581 2.96831e-09 ST
673.107 595.743 0.944578 0.740845 4.96171e-13 672.293 598.389 0.746908 0.58581 2.96831e-09 630.444 595.77 0.727602 0.570668 2.33718e-10 ST
748.728 595.825 0.943268 0.739818 2.87252e-13 755.705 598.48 0.793614 0.622442 6.04852e-08 714.393 599.3 0.76372 0.598996 1.41004e-08 ST
635.165 593.368 0.951789 0.746501 7.79215e-13 630.444 595.77 0.727602 0.570668 2.33718e-10 589.874 591.506 0.715333 0.561045 2.29665e-11 ST
673.107 595.743 0.944578 0.740845 4.96171e-13 711.275 596.568 0.944578 0.740845 4.96171e-13 672.293 598.389 0.746908 0.58581 2.96831e-09 ST
635.165 593.368 0.951789 0.746501 7.79215e-13 673.107 595.743 0.944578 0.740845 4.96171e-13 630.444 595.77 0.727602 0.570668 2.33718e-10 ST
711.275 596.568 0.944578 0.740845 4.96171e-13 748.728 595.825 0.943268 0.739818 2.87252e-13 714.393 599.3 0.76372 0.598996 1.41004e-08 ST
598.384 589.502 0.951789 0.746501 7.79215e-13 635.165 593.368 0.951789 0.746501 7.79215e-13 589.874 591.506 0.715333 0.561045 2.29665e-11 ST
784.546 593.53 0.937284 0.735125 3.12694e-13 795.212 595.949 0.822515 0.64511 2.27911e-07 755.705 598.48 0.793614 0.622442 6.04852e-08 ST
598.384 589.502 0.951789 0.746501 7.79215e-13 589.874 591.506 0.715333 0.561045 2.29665e-11 551.583 585.703 0.710592 0.557327 3.11543e-12 ST
748.728 595.825 0.943268 0.739818 2.87252e-13 784.546 593.53 0.937284 0.735125 3.12694e-13 755.705 598.48 0.793614 0.622442 6.04852e-08 ST
708.421 586.169 1 0.840498 1.97901e-22 711.275 596.568 0.944578 0.740845 4.96171e-13 673.107 595.743 0.944578 0.740845 4.96171e-13 ST
674.185 585.429 1 0.864791 2.17004e-20 673.107 595.743 0.944578 0.740845 4.96171e-13 635.165 593.368 0.951789 0.746501 7.79215e-13 ST
742.017 585.502 1 0.812554 3.23427e-24 748.728 595.825 0.943268 0.739818 2.87252e-13 711.275 596.568 0.944578 0.740845 4.96171e-13 ST
640.152 583.298 1 0.879185 8.87676e-19 635.165 593.368 0.951789 0.746501 7.79215e-13 598.384 589.502 0.951789 0.746501 7.79215e-13 ST
674.185 585.429 1 0.864791 2.17004e-20 708.421 586.169 1 0.840498 1.97901e-22 673.107 595.743 0.944578 0.740845 4.96171e-13 ST
563.669 584.241 0.953016 0.747463 1.32155e-12 598.384 589.502 0.951789 0.746501 7.79215e-13 551.583 585.703 0.710592 0.557327 3.11543e-12 ST
640.152 583.298 1 0.879185 8.87676e-19 674.185 585.429 1 0.864791 2.17004e-20 635.165 593.368 0.951789 0.746501 7.79215e-13 ST
708.421 586.169 1 0.840498 1.97901e-22 742.017 585.502 1 0.812554 3.23427e-24 711.275 596.568 0.944578 0.740845 4.96171e-13 ST
817.846 589.741 0.937284 0.735125 3.12694e-13 831.942 591.769 0.850085 0.666733 5.59255e-07 795.212 595.949 0.822515 0.64511 2.27911e-07 ST
784.546 593.53 0.937284 0.735125 3.12694e-13 817.846 589.741 0.937284 0.735125 3.12694e-13 795.212 595.949 0.822515 0.64511 2.27911e-07 ST
563.669 584.241 0.953016 0.747463 1.32155e-12 551.583 585.703 0.710592 0.557327 3.11543e-12 516.514 578.504 0.704073 0.552214 2.08172e-13 ST
774.146 583.444 1 0.788841 7.76968e-26 784.546 593.53 0.937284 0.735125 3.12694e-13 748.728 595.825 0.943268 0.739818 2.87252e-13 ST
607.16 579.831 1 0.894845 9.93626e-17 640.152 583.298 1 0.879185 8.87676e-19 598.384 589.502 0.951789 0.746501 7.79215e-13 ST
607.16 579.831 1 0.894845 9.93626e-17 598.384 589.502 0.951789 0.746501 7.79215e-13 563.669 584.241 0.953016 0.747463 1.32155e-12 ST
742.017 585.502 1 0.812554 3.23427e-24 774.146 583.444 1 0.788841 7.76968e-26 748.728 595.825 0.943268 0.739818 2.87252e-13 ST
706.113 569.12 1 0.883541 0 708.421 586.169 1 0.840498 1.97901e-22 674.185 585.429 1 0.864791 2.17004e-20 ST
675.423 568.457 1 0.919372 0 674.185 585.429 1 0.864791 2.17004e-20 640.152 583.298 1 0.879185 8.87676e-19 ST
736.229 568.523 1 0.834482 0 742.017 585.502 1 0.812554 3.23427e-24 708.421 586.169 1 0.840498 1.97901e-22 ST
531.875 577.714 0.953016 0.747463 1.32155e-12 563.669 584.241 0.953016 0.747463 1.32155e-12 516.514 578.504 0.704073 0.552214 2.08172e-13 ST
644.916 566.547 1 0.954333 3.81084e-30 640.152 583.298 1 0.879185 8.87676e-19 607.16 579.831 1 0.894845 9.93626e-17 ST
679.887 454.405 0.39333 0.308494 0 707.762 455.008 0.333919 0.261897 0 679.566 473.262 0.662693 0.519759 0 ST
675.423 568.457 1 0.919372 0 706.113 569.12 1 0.883541 0 674.185 585.429 1 0.864791 2.17004e-20 ST
576.02 575.112 1 0.901345 4.76525e-15 607.16 579.831 1 0.894845 9.93626e-17 563.669 584.241 0.953016 0.747463 1.32155e-12 ST
644.916 566.547 1 0.954333 3.81084e-30 675.423 568.457 1 0.919372 0 640.152 583.298 1 0.879185 8.87676e-19 ST
707.762 455.008 0.333919 0.261897 0 735.116 454.465 0.298039 0.233756 0 705.634 473.826 0.589255 0.462161 0 ST
706.113 569.12 1 0.883541 0 736.229 568.523 1 0.834482 0 708.421 586.169 1 0.840498 1.97901e-22 ST
804.016 580.045 0.963692 0.755837 1.89474e-27 817.846 589.741 0.937284 0.735125 3.12694e-13 784.546 593.53 0.937284 0.735125 3.12694e-13 ST
817.846 589.741 0.937284 0.735125 3.12694e-13 847.808 584.55 0.931259 0.730399 3.39465e-13 831.942 591.769 0.850085 0.666733 5.59255e-07 ST
774.146 583.444 1 0.788841 7.76968e-26 804.016 580.045 0.963692 0.755837 1.89474e-27 784.546 593.53 0.937284 0.735125 3.12694e-13 ST
707.762 455.008 0.333919 0.261897 0 705.634 473.826 0.589255 0.462161 0 679.566 473.262 0.662693 0.519759 0 ST
576.02 575.112 1 0.901345 4.76525e-15 563.669 584.241 0.953016 0.747463 1.32155e-12 531.875 577.714 0.953016 0.747463 1.32155e-12 ST
679.887 454.405 0.39333 0.308494 0 679.566 473.262 0.662693 0.519759 0 653.653 471.64 0.727956 0.570946 0 ST
847.808 584.55 0.931259 0.730399 3.39465e-13 864.99 586.044 0.883154 0.69267 9.1619e-07 831.942 591.769 0.850085 0.666733 5.59255e-07 ST
531.875 577.714 0.953016 0.747463 1.32155e-12 516.514 578.504 0.704073 0.552214 2.08172e-13 485.53 570.085 0.710726 0.557432 1.06645e-14 ST
615.341 563.439 1 0.978825 4.35612e-24 644.916 566.547 1 0.954333 3.81084e-30 607.16 579.831 1 0.894845 9.93626e-17 ST
765.029 566.677 1 0.786009 0 774.146 583.444 1 0.788841 7.76968e-26 742.017 585.502 1 0.812554 3.23427e-24 ST
615.341 563.439 1 0.978825 4.35612e-24 607.16 579.831 1 0.894845 9.93626e-17 576.02 575.112 1 0.901345 4.76525e-15 ST
735.116 454.465 0.298039 0.233756 0 731.214 473.318 0.49645 0.389372 0 705.634 473.826 0.589255 0.462161 0 ST
736.229 568.523 1 0.834482 0 765.029 566.677 1 0.786009 0 742.017 585.502 1 0.812554 3.23427e-24 ST
704.576 547.091 1 0.857323 0 706.113 569.12 1 0.883541 0 675.423 568.457 1 0.919372 0 ST
676.7 546.488 1 0.911509 0 675.423 568.457 1 0.919372 0 644.916 566.547 1 0.954333 3.81084e-30 ST
679.566 473.262 0.662693 0.519759 0 705.634 473.826 0.589255 0.462161 0 678.878 496.441 0.896156 0.702868 0 ST
676.7 546.488 1 0.911509 0 704.576 547.091 1 0.857323 0 675.423 568.457 1 0.919372 0 ST
731.929 546.548 1 0.797581 0 736.229 568.523 1 0.834482 0 706.113 569.12 1 0.883541 0 ST
648.991 544.753 1 0.954333 0 644.916 566.547 1 0.954333 3.81084e-30 615.341 563.439 1 0.978825 4.35612e-24 ST
653.653 471.64 0.727956 0.570946 0 679.566 473.262 0.662693 0.519759 0 653.584 494.858 0.961373 0.754018 0 ST
648.991 544.753 1 0.954333 0 676.7 546.488 1 0.911509 0 644.916 566.547 1 0.954333 3.81084e-30 ST
705.634 473.826 0.589255 0.462161 0 731.214 473.318 0.49645 0.389372 0 704.323 496.992 0.817709 0.641341 0 ST
704.576 547.091 1 0.857323 0 731.929 546.548 1 0.797581 0 706.113 569.12 1 0.883541 0 ST
705.634 473.826 0.589255 0.462161 0 704.323 496.992 0.817709 0.641341 0 678.878 496.441 0.896156 0.702868 0 ST
679.566 473.262 0.662693 0.519759 0 678.878 496.441 0.896156 0.702868 0 653.584 494.858 0.961373 0.754018 0 ST
547.501 569.257 1 0.902554 1.04309e-13 576.02 575.112 1 0.901345 4.76525e-15 531.875 577.714 0.953016 0.747463 1.32155e-12 ST
587.428 559.208 1 0.990855 4.52223e-20 615.341 563.439 1 0.978825 4.35612e-24 576.02 575.112 1 0.901345 4.76525e-15 ST
703.959 522.237 0.981856 0.770083 0 704.576 547.091 1 0.857323 0 676.7 546.488 1 0.911509 0 ST
628.532 469 0.77655 0.609059 0 653.653 471.64 0.727956 0.570946 0 629.063 492.281 1 0.793884 0 ST
677.891 521.673 1 0.830708 0 676.7 546.488 1 0.911509 0 648.991 544.753 1 0.954333 0 ST
622.128 541.93 1 0.986694 0 648.991 544.753 1 0.954333 0 615.341 563.439 1 0.978825 4.35612e-24 ST
731.214 473.318 0.49645 0.389372 0 729.292 496.496 0.721207 0.565653 0 704.323 496.992 0.817709 0.641341 0 ST
678.878 496.441 0.896156 0.702868 0 704.323 496.992 0.817709 0.641341 0 677.891 521.673 1 0.830708 0 ST
677.891 521.673 1 0.830708 0 703.959 522.237 0.981856 0.770083 0 676.7 546.488 1 0.911509 0 ST
653.653 471.64 0.727956 0.570946 0 653.584 494.858 0.961373 0.754018 0 629.063 492.281 1 0.793884 0 ST
791.805 563.631 0.929873 0.729312 0 804.016 580.045 0.963692 0.755837 1.89474e-27 774.146 583.444 1 0.788841 7.76968e-26 ST
503.784 570.082 0.953016 0.747463 1.32155e-12 531.875 577.714 0.953016 0.747463 1.32155e-12 485.53 570.085 0.710726 0.557432 1.06645e-14 ST
765.029 566.677 1 0.786009 0 791.805 563.631 0.929873 0.729312 0 774.146 583.444 1 0.788841 7.76968e-26 ST
731.214 473.318 0.49645 0.389372 0 755.677 471.751 0.395826 0.310452 0 729.292 496.496 0.721207 0.565653 0 ST
704.323 496.992 0.817709 0.641341 0 703.959 522.237 0.981856 0.770083 0 677.891 521.673 1 0.830708 0 ST
653.584 494.858 0.961373 0.754018 0 678.878 496.441 0.896156 0.702868 0 651.978 520.051 1 0.882258 0 ST
678.878 496.441 0.896156 0.702868 0 677.891 521.673 1 0.830708 0 651.978 520.051 1 0.882258 0 ST
651.978 520.051 1 0.882258 0 677.891 521.673 1 0.830708 0 648.991 544.753 1 0.954333 0 ST
758.088 544.872 0.928121 0.727938 0 765.029 566.677 1 0.786009 0 736.229 568.523 1 0.834482 0 ST
587.428 559.208 1 0.990855 4.52223e-20 576.02 575.112 1 0.901345 4.76525e-15 547.501 569.257 1 0.902554 1.04309e-13 ST
804.016 580.045 0.963692 0.755837 1.89474e-27 830.892 575.389 0.92526 0.725694 4.87096e-28 817.846 589.741 0.937284 0.735125 3.12694e-13 ST
731.929 546.548 1 0.797581 0 758.088 544.872 0.928121 0.727938 0 736.229 568.523 1 0.834482 0 ST
622.128 541.93 1 0.986694 0 615.341 563.439 1 0.978825 4.35612e-24 587.428 559.208 1 0.990855 4.52223e-20 ST
704.323 496.992 0.817709 0.641341 0 729.292 496.496 0.721207 0.565653 0 703.959 522.237 0.981856 0.770083 0 ST
703.959 522.237 0.981856 0.770083 0 729.539 521.729 0.892568 0.700054 0 704.576 547.091 1 0.857323 0 ST
729.539 521.729 0.892568 0.700054 0 731.929 546.548 1 0.797581 0 704.576 547.091 1 0.857323 0 ST
651.978 520.051 1 0.882258 0 648.991 544.753 1 0.954333 0 622.128 541.93 1 0.986694 0 ST
830.892 575.389 0.92526 0.725694 4.87096e-28 847.808 584.55 0.931259 0.730399 3.39465e-13 817.846 589.741 0.937284 0.735125 3.12694e-13 ST
547.501 569.257 1 0.902554 1.04309e-13 531.875 577.714 0.953016 0.747463 1.32155e-12 503.784 570.082 0.953016 0.747463 1.32155e-12 ST
729.292 496.496 0.721207 0.565653 0 729.539 521.729 0.892568 0.700054 0 703.959 522.237 0.981856 0.770083 0 ST
653.584 494.858 0.961373 0.754018 0 651.978 520.051 1 0.882258 0 626.857 517.411 1 0.918538 0 ST
629.063 492.281 1 0.793884 0 653.584 494.858 0.961373 0.754018 0 626.857 517.411 1 0.918538 0 ST
626.857 517.411 1 0.918538 0 651.978 520.051 1 0.882258 0 622.128 541.93 1 0.986694 0 ST
755.677 471.751 0.395826 0.310452 0 753.171 494.966 0.609629 0.47814 0 729.292 496.496 0.721207 0.565653 0 ST
628.532 469 0.77655 0.609059 0 629.063 492.281 1 0.793884 0 605.92 488.774 1 0.81542 0 ST
604.822 465.407 0.799695 0.627212 0 628.532 469 0.77655 0.609059 0 605.92 488.774 1 0.81542 0 ST
847.808 584.55 0.931259 0.730399 3.39465e-13 873.695 578.086 0.931259 0.730399 3.39465e-13 864.99 586.044 0.883154 0.69267 9.1619e-07 ST
729.292 496.496 0.721207 0.565653 0 753.171 494.966 0.609629 0.47814 0 729.539 521.729 0.892568 0.700054 0 ST
729.539 521.729 0.892568 0.700054 0 754.002 520.162 0.784498 0.615293 0 731.929 546.548 1 0.797581 0 ST
596.775 538.088 1 1 1.19033e-29 622.128 541.93 1 0.986694 0 587.428 559.208 1 0.990855 4.52223e-20 ST
754.002 520.162 0.784498 0.615293 0 758.088 544.872 0.928121 0.727938 0 731.929 546.548 1 0.797581 0 ST
626.857 517.411 1 0.918538 0 622.128 541.93 1 0.986694 0 596.775 538.088 1 1 1.19033e-29 ST
755.677 471.751 0.395826 0.310452 0 778.42 469.163 0.298039 0.233756 0 753.171 494.966 0.609629 0.47814 0 ST
873.695 578.086 0.931259 0.730399 3.39465e-13 893.544 578.914 0.9151 0.717726 1.38498e-06 864.99 586.044 0.883154 0.69267 9.1619e-07 ST
561.863 553.96 1 0.998752 2.36843e-16 587.428 559.208 1 0.990855 4.52223e-20 547.501 569.257 1 0.902554 1.04309e-13 ST
753.171 494.966 0.609629 0.47814 0 754.002 520.162 0.784498 0.615293 0 729.539 521.729 0.892568 0.700054 0 ST
629.063 492.281 1 0.793884 0 626.857 517.411 1 0.918538 0 603.147 513.818 1 0.939537 0 ST
758.088 544.872 0.928121 0.727938 0 782.408 542.105 0.834917 0.654837 0 765.029 566.677 1 0.786009 0 ST
503.784 570.082 0.953016 0.747463 1.32155e-12 485.53 570.085 0.710726 0.557432 1.06645e-14 459.394 560.656 0.716612 0.562048 3.95617e-16 ST
782.408 542.105 0.834917 0.654837 0 791.805 563.631 0.929873 0.729312 0 765.029 566.677 1 0.786009 0 ST
596.775 538.088 1 1 1.19033e-29 587.428 559.208 1 0.990855 4.52223e-20 561.863 553.96 1 0.998752 2.36843e-16 ST
605.92 488.774 1 0.81542 0 629.063 492.281 1 0.793884 0 603.147 513.818 1 0.939537 0 ST
603.147 513.818 1 0.939537 0 626.857 517.411 1 0.918538 0 596.775 538.088 1 1 1.19033e-29 ST
791.805 563.631 0.929873 0.729312 0 815.896 559.457 0.853717 0.669582 0 804.016 580.045 0.963692 0.755837 1.89474e-27 ST
522.304 562.411 1 0.903581 4.60326e-12 547.501 569.257 1 0.902554 1.04309e-13 503.784 570.082 0.953016 0.747463 1.32155e-12 ST
778.42 469.163 0.298039 0.233756 0 775.371 492.44 0.499068 0.391426 0 753.171 494.966 0.609629 0.47814 0 ST
753.171 494.966 0.609629 0.47814 0 775.371 492.44 0.499068 0.391426 0 754.002 520.162 0.784498 0.615293 0 ST
604.822 465.407 0.799695 0.627212 0 605.92 488.774 1 0.81542 0 584.723 484.423 1 0.82561 0 ST
815.896 559.457 0.853717 0.669582 0 830.892 575.389 0.92526 0.725694 4.87096e-28 804.016 580.045 0.963692 0.755837 1.89474e-27 ST
754.002 520.162 0.784498 0.615293 0 776.745 517.574 0.678068 0.531818 0 758.088 544.872 0.928121 0.727938 0 ST
583.107 460.949 0.811174 0.636215 0 604.822 465.407 0.799695 0.627212 0 584.723 484.423 1 0.82561 0 ST
561.863 553.96 1 0.998752 2.36843e-16 547.501 569.257 1 0.902554 1.04309e-13 522.304 562.411 1 0.903581 4.60326e-12 ST
776.745 517.574 0.678068 0.531818 0 782.408 542.105 0.834917 0.654837 0 758.088 544.872 0.928121 0.727938 0 ST
603.147 513.818 1 0.939537 0 596.775 538.088 1 1 1.19033e-29 573.555 533.321 1 1 3.26162e-22 ST
573.555 533.321 1 1 3.26162e-22 596.775 538.088 1 1 1.19033e-29 561.863 553.96 1 0.998752 2.36843e-16 ST
775.371 492.44 0.499068 0.391426 0 776.745 517.574 0.678068 0.531818 0 754.002 520.162 0.784498 0.615293 0 ST
605.92 488.774 1 0.81542 0 603.147 513.818 1 0.939537 0 581.432 509.36 1 0.949815 4.41247e-34 ST
830.892 575.389 0.92526 0.725694 4.87096e-28 854.112 569.59 0.882099 0.691843 5.43029e-28 847.808 584.55 0.931259 0.730399 3.39465e-13 ST
778.42 469.163 0.298039 0.233756 0 798.884 465.618 0.298039 0.233756 0 775.371 492.44 0.499068 0.391426 0 ST
584.723 484.423 1 0.82561 0 605.92 488.774 1 0.81542 0 581.432 509.36 1 0.949815 4.41247e-34 ST
854.112 569.59 0.882099 0.691843 5.43029e-28 873.695 578.086 0.931259 0.730399 3.39465e-13 847.808 584.55 0.931259 0.730399 3.39465e-13 ST
782.408 542.105 0.834917 0.654837 0 804.29 538.314 0.726922 0.570135 0 791.805 563.631 0.929873 0.729312 0 ST
581.432 509.36 1 0.949815 4.41247e-34 603.147 513.818 1 0.939537 0 573.555 533.321 1 1 3.26162e-22 ST
480.089 561.533 0.954201 0.748393 2.22037e-12 503.784 570.082 0.953016 0.747463 1.32155e-12 459.394 560.656 0.716612 0.562048 3.95617e-16 ST
522.304 562.411 1 0.903581 4.60326e-12 503.784 570.082 0.953016 0.747463 1.32155e-12 480.089 561.533 0.954201 0.748393 2.22037e-12 ST
804.29 538.314 0.726922 0.570135 0 815.896 559.457 0.853717 0.669582 0 791.805 563.631 0.929873 0.729312 0 ST
459.394 560.656 0.716612 0.562048 3.95617e-16 440.99 552.197 0.414996 0.325487 5.5831e-24 418.606 541.127 0.442291 0.346895 2.31018e-28 ST
539.276 547.824 1 0.995234 1.96435e-13 561.863 553.96 1 0.998752 2.36843e-16 522.304 562.411 1 0.903581 4.60326e-12 ST
775.371 492.44 0.499068 0.391426 0 795.346 488.98 0.384362 0.30146 0 776.745 517.574 0.678068 0.531818 0 ST
573.555 533.321 1 1 3.26162e-22 561.863 553.96 1 0.998752 2.36843e-16 539.276 547.824 1 0.995234 1.96435e-13 ST
798.884 465.618 0.298039 0.233756 0 795.346 488.98 0.384362 0.30146 0 775.371 492.44 0.499068 0.391426 0 ST
776.745 517.574 0.678068 0.531818 0 797.209 514.029 0.560085 0.439283 0 782.408 542.105 0.834917 0.654837 0 ST
583.107 460.949 0.811174 0.636215 0 584.723 484.423 1 0.82561 0 565.997 479.334 1 0.82075 4.25112e-35 ST
418.606 541.127 0.442291 0.346895 2.31018e-28 440.99 552.197 0.414996 0.325487 5.5831e-24 402.915 525.232 0.298039 0.233756 0 ST
563.922 455.737 0.806768 0.632759 0 583.107 460.949 0.811174 0.636215 0 565.997 479.334 1 0.82075 4.25112e-35 ST
873.695 578.086 0.931259 0.730399 3.39465e-13 894.869 570.507 0.931259 0.730399 3.39465e-13 893.544 578.914 0.9151 0.717726 1.38498e-06 ST
815.896 559.457 0.853717 0.669582 0 836.711 554.259 0.783454 0.614474 0 830.892 575.389 0.92526 0.725694 4.87096e-28 ST
797.209 514.029 0.560085 0.439283 0 804.29 538.314 0.726922 0.570135 0 782.408 542.105 0.834917 0.654837 0 ST
795.346 488.98 0.384362 0.30146 0 797.209 514.029 0.560085 0.439283 0 776.745 517.574 0.678068 0.531818 0 ST
581.432 509.36 1 0.949815 4.41247e-34 573.555 533.321 1 1 3.26162e-22 553.039 527.747 1 1 7.96598e-17 ST
584.723 484.423 1 0.82561 0 581.432 509.36 1 0.949815 4.41247e-34 562.247 504.148 1 0.946261 3.08458e-23 ST
798.884 465.618 0.298039 0.233756 0 816.564 461.203 0.298039 0.233756 0 795.346 488.98 0.384362 0.30146 0 ST
553.039 527.747 1 1 7.96598e-17 573.555 533.321 1 1 3.26162e-22 539.276 547.824 1 0.995234 1.96435e-13 ST
836.711 554.259 0.783454 0.614474 0 854.112 569.59 0.882099 0.691843 5.43029e-28 830.892 575.389 0.92526 0.725694 4.87096e-28 ST
539.276 547.824 1 0.995234 1.96435e-13 522.304 562.411 1 0.903581 4.60326e-12 501.049 554.742 1 0.899134 9.86942e-11 ST
565.997 479.334 1 0.82075 4.25112e-35 584.723 484.423 1 0.82561 0 562.247 504.148 1 0.946261 3.08458e-23 ST
501.049 554.742 1 0.899134 9.86942e-11 522.304 562.411 1 0.903581 4.60326e-12 480.089 561.533 0.954201 0.748393 2.22037e-12 ST
894.869 570.507 0.931259 0.730399 3.39465e-13 916.898 570.555 0.946166 0.742091 1.09726e-06 893.544 578.914 0.9151 0.717726 1.38498e-06 ST
562.247 504.148 1 0.946261 3.08458e-23 581.432 509.36 1 0.949815 4.41247e-34 553.039 527.747 1 1 7.96598e-17 ST
480.089 561.533 0.954201 0.748393 2.22037e-12 459.394 560.656 0.716612 0.562048 3.95617e-16 438.75 550.446 0.730275 0.572765 2.08049e-17 ST
804.29 538.314 0.726922 0.570135 0 823.196 533.593 0.628885 0.493243 0 815.896 559.457 0.853717 0.669582 0 ST
438.75 550.446 0.730275 0.572765 2.08049e-17 459.394 560.656 0.716612 0.562048 3.95617e-16 418.606 541.127 0.442291 0.346895 2.31018e-28 ST
795.346 488.98 0.384362 0.30146 0 812.604 484.67 0.298039 0.233756 0 797.209 514.029 0.560085 0.439283 0 ST
816.564 461.203 0.298039 0.233756 0 812.604 484.67 0.298039 0.233756 0 795.346 488.98 0.384362 0.30146 0 ST
797.209 514.029 0.560085 0.439283 0 814.889 509.614 0.442178 0.346806 0 804.29 538.314 0.726922 0.570135 0 ST
563.922 455.737 0.806768 0.632759 0 565.997 479.334 1 0.82075 4.25112e-35 550.2 473.635 1 0.801622 4.71377e-24 ST
854.112 569.59 0.882099 0.691843 5.43029e-28 873.104 562.793 0.84933 0.666141 3.63841e-28 873.695 578.086 0.931259 0.730399 3.39465e-13 ST
823.196 533.593 0.628885 0.493243 0 836.711 554.259 0.783454 0.614474 0 815.896 559.457 0.853717 0.669582 0 ST
553.039 527.747 1 1 7.96598e-17 539.276 547.824 1 0.995234 1.96435e-13 520.224 540.949 1 0.984524 1.09053e-10 ST
520.224 540.949 1 0.984524 1.09053e-10 539.276 547.824 1 0.995234 1.96435e-13 501.049 554.742 1 0.899134 9.86942e-11 ST
812.604 484.67 0.298039 0.233756 0 814.889 509.614 0.442178 0.346806 0 797.209 514.029 0.560085 0.439283 0 ST
814.889 509.614 0.442178 0.346806 0 823.196 533.593 0.628885 0.493243 0 804.29 538.314 0.726922 0.570135 0 ST
565.997 479.334 1 0.82075 4.25112e-35 562.247 504.148 1 0.946261 3.08458e-23 546.063 498.309 1 0.926608 1.24192e-16 ST
873.104 562.793 0.84933 0.666141 3.63841e-28 894.869 570.507 0.931259 0.730399 3.39465e-13 873.695 578.086 0.931259 0.730399 3.39465e-13 ST
562.247 504.148 1 0.946261 3.08458e-23 553.039 527.747 1 1 7.96598e-17 535.734 521.504 1 0.994554 2.2279e-12 ST
501.049 554.742 1 0.899134 9.86942e-11 480.089 561.533 0.954201 0.748393 2.22037e-12 461.372 552.277 0.954201 0.748393 2.22037e-12 ST
916.898 570.555 0.946166 0.742091 1.09726e-06 934.479 561.172 0.970287 0.76101 8.68214e-07 937.037 562.93 0.911873 0.71665 0.00674915 ST
461.372 552.277 0.954201 0.748393 2.22037e-12 480.089 561.533 0.954201 0.748393 2.22037e-12 438.75 550.446 0.730275 0.572765 2.08049e-17 ST
836.711 554.259 0.783454 0.614474 0 853.736 548.166 0.712236 0.558617 0 854.112 569.59 0.882099 0.691843 5.43029e-28 ST
550.2 473.635 1 0.801622 4.71377e-24 565.997 479.334 1 0.82075 4.25112e-35 546.063 498.309 1 0.926608 1.24192e-16 ST
535.734 521.504 1 0.994554 2.2279e-12 553.039 527.747 1 1 7.96598e-17 520.224 540.949 1 0.984524 1.09053e-10 ST
546.063 498.309 1 0.926608 1.24192e-16 562.247 504.148 1 0.946261 3.08458e-23 535.734 521.504 1 0.994554 2.2279e-12 ST
853.736 548.166 0.712236 0.558617 0 873.104 562.793 0.84933 0.666141 3.63841e-28 854.112 569.59 0.882099 0.691843 5.43029e-28 ST
812.604 484.67 0.298039 0.233756 0 826.719 479.618 0.298039 0.233756 0 814.889 509.614 0.442178 0.346806 0 ST
934.479 561.172 0.970287 0.76101 8.68214e-07 956.098 552.757 0.962785 0.756018 0.00413808 937.037 562.93 0.911873 0.71665 0.00674915 ST
823.196 533.593 0.628885 0.493243 0 838.659 528.058 0.536151 0.420511 0 836.711 554.259 0.783454 0.614474 0 ST
520.224 540.949 1 0.984524 1.09053e-10 501.049 554.742 1 0.899134 9.86942e-11 484.261 546.44 1 0.88633 2.07599e-09 ST
438.75 550.446 0.730275 0.572765 2.08049e-17 418.606 541.127 0.442291 0.346895 2.31018e-28 402.728 529.485 0.48017 0.376604 2.01184e-35 ST
814.889 509.614 0.442178 0.346806 0 829.35 504.438 0.329023 0.258057 0 823.196 533.593 0.628885 0.493243 0 ST
894.869 570.507 0.931259 0.730399 3.39465e-13 910.808 562.001 0.925193 0.725642 3.67525e-13 916.898 570.555 0.946166 0.742091 1.09726e-06 ST
484.261 546.44 1 0.88633 2.07599e-09 501.049 554.742 1 0.899134 9.86942e-11 461.372 552.277 0.954201 0.748393 2.22037e-12 ST
838.659 528.058 0.536151 0.420511 0 853.736 548.166 0.712236 0.558617 0 836.711 554.259 0.783454 0.614474 0 ST
535.734 521.504 1 0.994554 2.2279e-12 520.224 540.949 1 0.984524 1.09053e-10 505.174 533.507 1 0.963108 1.7362e-08 ST
826.719 479.618 0.298039 0.233756 0 829.35 504.438 0.329023 0.258057 0 814.889 509.614 0.442178 0.346806 0 ST
402.728 529.485 0.48017 0.376604 2.01184e-35 418.606 541.127 0.442291 0.346895 2.31018e-28 386.058 512.872 0.298039 0.233756 0 ST
550.2 473.635 1 0.801622 4.71377e-24 546.063 498.309 1 0.926608 1.24192e-16 533.28 491.987 1 0.895583 2.55828e-12 ST
829.35 504.438 0.329023 0.258057 0 838.659 528.058 0.536151 0.420511 0 823.196 533.593 0.628885 0.493243 0 ST
546.063 498.309 1 0.926608 1.24192e-16 535.734 521.504 1 0.994554 2.2279e-12 522.065 514.743 1 0.966112 2.72831e-09 ST
910.808 562.001 0.925193 0.725642 3.67525e-13 934.479 561.172 0.970287 0.76101 8.68214e-07 916.898 570.555 0.946166 0.742091 1.09726e-06 ST
505.174 533.507 1 0.963108 1.7362e-08 520.224 540.949 1 0.984524 1.09053e-10 484.261 546.44 1 0.88633 2.07599e-09 ST
461.372 552.277 0.954201 0.748393 2.22037e-12 438.75 550.446 0.730275 0.572765 2.08049e-17 424.105 539.708 0.749964 0.588207 7.6528e-19 ST
873.104 562.793 0.84933 0.666141 3.63841e-28 887.401 555.163 0.812143 0.636975 1.08653e-27 894.869 570.507 0.931259 0.730399 3.39465e-13 ST
537.722 467.464 0.980247 0.768821 1.33095e-17 550.2 473.635 1 0.801622 4.71377e-24 533.28 491.987 1 0.895583 2.55828e-12 ST
522.065 514.743 1 0.966112 2.72831e-09 535.734 521.504 1 0.994554 2.2279e-12 505.174 533.507 1 0.963108 1.7362e-08 ST
533.28 491.987 1 0.895583 2.55828e-12 546.063 498.309 1 0.926608 1.24192e-16 522.065 514.743 1 0.966112 2.72831e-09 ST
424.105 539.708 0.749964 0.588207 7.6528e-19 438.75 550.446 0.730275 0.572765 2.08049e-17 402.728 529.485 0.48017 0.376604 2.01184e-35 ST
853.736 548.166 0.712236 0.558617 0 866.552 541.326 0.649827 0.509668 0 873.104 562.793 0.84933 0.666141 3.63841e-28 ST
887.401 555.163 0.812143 0.636975 1.08653e-27 910.808 562.001 0.925193 0.725642 3.67525e-13 894.869 570.507 0.931259 0.730399 3.39465e-13 ST
956.098 552.757 0.962785 0.756018 0.00413808 968.432 541.725 1 0.80065 0.00123977 973.55 537.578 0.993587 0.804161 0.115343 ST
826.719 479.618 0.298039 0.233756 0 837.346 473.947 0.298039 0.233756 0 829.35 504.438 0.329023 0.258057 0 ST
484.261 546.44 1 0.88633 2.07599e-09 461.372 552.277 0.954201 0.748393 2.22037e-12 448.096 542.542 0.955345 0.74929 3.6962e-12 ST
838.659 528.058 0.536151 0.420511 0 850.3 521.846 0.44534 0.349286 0 853.736 548.166 0.712236 0.558617 0 ST
829.35 504.438 0.329023 0.258057 0 840.236 498.628 0.298039 0.233756 0 838.659 528.058 0.536151 0.420511 0 ST
866.552 541.326 0.649827 0.509668 0 887.401 555.163 0.812143 0.636975 1.08653e-27 873.104 562.793 0.84933 0.666141 3.63841e-28 ST
448.096 542.542 0.955345 0.74929 3.6962e-12 461.372 552.277 0.954201 0.748393 2.22037e-12 424.105 539.708 0.749964 0.588207 7.6528e-19 ST
505.174 533.507 1 0.963108 1.7362e-08 484.261 546.44 1 0.88633 2.07599e-09 472.352 537.708 1 0.871842 1.56976e-08 ST
934.479 561.172 0.970287 0.76101 8.68214e-07 945.853 550.997 0.999663 0.784049 4.53576e-07 956.098 552.757 0.962785 0.756018 0.00413808 ST
837.346 473.947 0.298039 0.233756 0 840.236 498.628 0.298039 0.233756 0 829.35 504.438 0.329023 0.258057 0 ST
537.722 467.464 0.980247 0.768821 1.33095e-17 533.28 491.987 1 0.895583 2.55828e-12 524.213 485.338 1 0.846674 7.66433e-09 ST
968.432 541.725 1 0.80065 0.00123977 986.643 525.866 0.991413 0.782985 0.0250674 973.55 537.578 0.993587 0.804161 0.115343 ST
850.3 521.846 0.44534 0.349286 0 866.552 541.326 0.649827 0.509668 0 853.736 548.166 0.712236 0.558617 0 ST
840.236 498.628 0.298039 0.233756 0 850.3 521.846 0.44534 0.349286 0 838.659 528.058 0.536151 0.420511 0 ST
522.065 514.743 1 0.966112 2.72831e-09 505.174 533.507 1 0.963108 1.7362e-08 494.499 525.679 1 0.936134 8.57699e-07 ST
402.728 529.485 0.48017 0.376604 2.01184e-35 386.058 512.872 0.298039 0.233756 0 376.523 500.208 0.298039 0.233756 0 ST
533.28 491.987 1 0.895583 2.55828e-12 522.065 514.743 1 0.966112 2.72831e-09 512.369 507.634 1 0.926449 7.95158e-07 ST
472.352 537.708 1 0.871842 1.56976e-08 484.261 546.44 1 0.88633 2.07599e-09 448.096 542.542 0.955345 0.74929 3.6962e-12 ST
528.871 460.974 0.915918 0.718367 6.53542e-13 537.722 467.464 0.980247 0.768821 1.33095e-17 524.213 485.338 1 0.846674 7.66433e-09 ST
910.808 562.001 0.925193 0.725642 3.67525e-13 921.12 552.776 0.925193 0.725642 3.67525e-13 934.479 561.172 0.970287 0.76101 8.68214e-07 ST
945.853 550.997 0.999663 0.784049 4.53576e-07 968.432 541.725 1 0.80065 0.00123977 956.098 552.757 0.962785 0.756018 0.00413808 ST
494.499 525.679 1 0.936134 8.57699e-07 505.174 533.507 1 0.963108 1.7362e-08 472.352 537.708 1 0.871842 1.56976e-08 ST
524.213 485.338 1 0.846674 7.66433e-09 533.28 491.987 1 0.895583 2.55828e-12 512.369 507.634 1 0.926449 7.95158e-07 ST
424.105 539.708 0.749964 0.588207 7.6528e-19 402.728 529.485 0.48017 0.376604 2.01184e-35 393.747 517.556 0.526728 0.41312 0 ST
512.369 507.634 1 0.926449 7.95158e-07 522.065 514.743 1 0.966112 2.72831e-09 494.499 525.679 1 0.936134 8.57699e-07 ST
0.298039 0.233756 0 C
376.523 500.208 386.058 512.872 365.835 478.359 T
837.346 473.947 844.22 467.797 840.236 498.628 T
887.401 555.163 0.812143 0.636975 1.08653e-27 896.652 546.888 0.772357 0.605771 4.34564e-26 910.808 562.001 0.925193 0.725642 3.67525e-13 ST
921.12 552.776 0.925193 0.725642 3.67525e-13 945.853 550.997 0.999663 0.784049 4.53576e-07 934.479 561.172 0.970287 0.76101 8.68214e-07 ST
840.236 498.628 0.298039 0.233756 0 847.279 492.328 0.298039 0.233756 0 850.3 521.846 0.44534 0.349286 0 ST
866.552 541.326 0.649827 0.509668 0 874.844 533.909 0.58074 0.455483 0 887.401 555.163 0.812143 0.636975 1.08653e-27 ST
448.096 542.542 0.955345 0.74929 3.6962e-12 424.105 539.708 0.749964 0.588207 7.6528e-19 415.822 528.707 0.7687 0.602902 1.9173e-20 ST
850.3 521.846 0.44534 0.349286 0 857.831 515.109 0.350591 0.274973 0 866.552 541.326 0.649827 0.509668 0 ST
393.747 517.556 0.526728 0.41312 0 402.728 529.485 0.48017 0.376604 2.01184e-35 376.523 500.208 0.298039 0.233756 0 ST
0.298039 0.233756 0 C
844.22 467.797 847.279 492.328 840.236 498.628 T
896.652 546.888 0.772357 0.605771 4.34564e-26 921.12 552.776 0.925193 0.725642 3.67525e-13 910.808 562.001 0.925193 0.725642 3.67525e-13 ST
528.871 460.974 0.915918 0.718367 6.53542e-13 524.213 485.338 1 0.846674 7.66433e-09 519.083 478.526 1 0.789017 1.92749e-06 ST
472.352 537.708 1 0.871842 1.56976e-08 448.096 542.542 0.955345 0.74929 3.6962e-12 440.586 532.568 0.949404 0.744631 4.01374e-12 ST
986.643 525.866 0.991413 0.782985 0.0250674 992.27 513.531 1 0.829961 0.00204964 998.707 504.975 0.856819 0.673481 0.00679714 ST
847.279 492.328 0.298039 0.233756 0 857.831 515.109 0.350591 0.274973 0 850.3 521.846 0.44534 0.349286 0 ST
874.844 533.909 0.58074 0.455483 0 896.652 546.888 0.772357 0.605771 4.34564e-26 887.401 555.163 0.812143 0.636975 1.08653e-27 ST
415.822 528.707 0.7687 0.602902 1.9173e-20 424.105 539.708 0.749964 0.588207 7.6528e-19 393.747 517.556 0.526728 0.41312 0 ST
524.213 485.338 1 0.846674 7.66433e-09 512.369 507.634 1 0.926449 7.95158e-07 506.884 500.35 1 0.878283 5.64793e-05 ST
857.831 515.109 0.350591 0.274973 0 874.844 533.909 0.58074 0.455483 0 866.552 541.326 0.649827 0.509668 0 ST
494.499 525.679 1 0.936134 8.57699e-07 472.352 537.708 1 0.871842 1.56976e-08 465.615 528.761 1 0.851861 1.53819e-07 ST
512.369 507.634 1 0.926449 7.95158e-07 494.499 525.679 1 0.936134 8.57699e-07 488.46 517.659 1 0.896824 2.88004e-05 ST
968.432 541.725 1 0.80065 0.00123977 973.731 530.105 1 0.848426 0.000199062 986.643 525.866 0.991413 0.782985 0.0250674 ST
440.586 532.568 0.949404 0.744631 4.01374e-12 448.096 542.542 0.955345 0.74929 3.6962e-12 415.822 528.707 0.7687 0.602902 1.9173e-20 ST
519.083 478.526 1 0.789017 1.92749e-06 524.213 485.338 1 0.846674 7.66433e-09 506.884 500.35 1 0.878283 5.64793e-05 ST
465.615 528.761 1 0.851861 1.53819e-07 472.352 537.708 1 0.871842 1.56976e-08 440.586 532.568 0.949404 0.744631 4.01374e-12 ST
506.884 500.35 1 0.878283 5.64793e-05 512.369 507.634 1 0.926449 7.95158e-07 488.46 517.659 1 0.896824 2.88004e-05 ST
488.46 517.659 1 0.896824 2.88004e-05 494.499 525.679 1 0.936134 8.57699e-07 465.615 528.761 1 0.851861 1.53819e-07 ST
945.853 550.997 0.999663 0.784049 4.53576e-07 950.742 540.281 1 0.810583 1.46059e-07 968.432 541.725 1 0.80065 0.00123977 ST
992.27 513.531 1 0.829961 0.00204964 1004.54 492.179 0.952353 0.747011 0.00031411 998.707 504.975 0.856819 0.673481 0.00679714 ST
0.298039 0.233756 0 C
376.523 500.208 365.835 478.359 363.782 465.232 T
847.279 492.328 0.298039 0.233756 0 850.306 485.693 0.298039 0.233756 0 857.831 515.109 0.350591 0.274973 0 ST
921.12 552.776 0.925193 0.725642 3.67525e-13 925.551 543.061 0.920394 0.721878 6.82486e-13 945.853 550.997 0.999663 0.784049 4.53576e-07 ST
973.731 530.105 1 0.848426 0.000199062 992.27 513.531 1 0.829961 0.00204964 986.643 525.866 0.991413 0.782985 0.0250674 ST
857.831 515.109 0.350591 0.274973 0 861.068 508.013 0.298039 0.233756 0 874.844 533.909 0.58074 0.455483 0 ST
896.652 546.888 0.772357 0.605771 4.34564e-26 900.626 538.173 0.744268 0.58374 8.97499e-25 921.12 552.776 0.925193 0.725642 3.67525e-13 ST
874.844 533.909 0.58074 0.455483 0 878.407 526.097 0.513602 0.402825 0 896.652 546.888 0.772357 0.605771 4.34564e-26 ST
393.747 517.556 0.526728 0.41312 0 376.523 500.208 0.298039 0.233756 0 374.543 487.552 0.321776 0.252373 0 ST
950.742 540.281 1 0.810583 1.46059e-07 973.731 530.105 1 0.848426 0.000199062 968.432 541.725 1 0.80065 0.00123977 ST
850.306 485.693 0.298039 0.233756 0 861.068 508.013 0.298039 0.233756 0 857.831 515.109 0.350591 0.274973 0 ST
0.298039 0.233756 0 C
363.782 465.232 365.835 478.359 360.65 440.859 T
415.822 528.707 0.7687 0.602902 1.9173e-20 393.747 517.556 0.526728 0.41312 0 391.883 505.636 0.575702 0.451531 0 ST
519.083 478.526 1 0.789017 1.92749e-06 506.884 500.35 1 0.878283 5.64793e-05 505.746 493.07 1 0.818941 0.00182658 ST
925.551 543.061 0.920394 0.721878 6.82486e-13 950.742 540.281 1 0.810583 1.46059e-07 945.853 550.997 0.999663 0.784049 4.53576e-07 ST
861.068 508.013 0.298039 0.233756 0 878.407 526.097 0.513602 0.402825 0 874.844 533.909 0.58074 0.455483 0 ST
440.586 532.568 0.949404 0.744631 4.01374e-12 415.822 528.707 0.7687 0.602902 1.9173e-20 414.102 517.713 0.790749 0.620196 2.15154e-21 ST
506.884 500.35 1 0.878283 5.64793e-05 488.46 517.659 1 0.896824 2.88004e-05 487.207 509.645 1 0.858011 0.000311319 ST
900.626 538.173 0.744268 0.58374 8.97499e-25 925.551 543.061 0.920394 0.721878 6.82486e-13 921.12 552.776 0.925193 0.725642 3.67525e-13 ST
878.407 526.097 0.513602 0.402825 0 900.626 538.173 0.744268 0.58374 8.97499e-25 896.652 546.888 0.772357 0.605771 4.34564e-26 ST
374.543 487.552 0.321776 0.252373 0 376.523 500.208 0.298039 0.233756 0 363.782 465.232 0.298039 0.233756 0 ST
465.615 528.761 1 0.851861 1.53819e-07 440.586 532.568 0.949404 0.744631 4.01374e-12 439.027 522.6 0.949404 0.744631 4.01374e-12 ST
488.46 517.659 1 0.896824 2.88004e-05 465.615 528.761 1 0.851861 1.53819e-07 464.218 519.82 1 0.826432 9.78455e-07 ST
518.019 471.718 0.92072 0.72216 0.000123883 519.083 478.526 1 0.789017 1.92749e-06 505.746 493.07 1 0.818941 0.00182658 ST
1009.35 468.141 0.748774 0.587274 1.60424e-07 1007.27 454.85 0.836921 0.656409 1.02967e-09 1006.22 443.768 0.577643 0.453054 6.50729e-12 ST
391.883 505.636 0.575702 0.451531 0 393.747 517.556 0.526728 0.41312 0 374.543 487.552 0.321776 0.252373 0 ST
505.746 493.07 1 0.818941 0.00182658 506.884 500.35 1 0.878283 5.64793e-05 487.207 509.645 1 0.858011 0.000311319 ST
1004.54 492.179 0.952353 0.747011 0.00031411 1002.49 479.052 1 0.811105 6.81365e-06 1009.35 468.141 0.748774 0.587274 1.60424e-07 ST
0.298039 0.233756 0 C
850.306 485.693 849.241 478.885 861.068 508.013 T
414.102 517.713 0.790749 0.620196 2.15154e-21 415.822 528.707 0.7687 0.602902 1.9173e-20 391.883 505.636 0.575702 0.451531 0 ST
487.207 509.645 1 0.858011 0.000311319 488.46 517.659 1 0.896824 2.88004e-05 464.218 519.82 1 0.826432 9.78455e-07 ST
439.027 522.6 0.949404 0.744631 4.01374e-12 440.586 532.568 0.949404 0.744631 4.01374e-12 414.102 517.713 0.790749 0.620196 2.15154e-21 ST
464.218 519.82 1 0.826432 9.78455e-07 465.615 528.761 1 0.851861 1.53819e-07 439.027 522.6 0.949404 0.744631 4.01374e-12 ST
992.27 513.531 1 0.829961 0.00204964 990.291 500.875 1 0.882267 9.74853e-05 1004.54 492.179 0.952353 0.747011 0.00031411 ST
861.068 508.013 0.298039 0.233756 0 859.929 500.733 0.298039 0.233756 0 878.407 526.097 0.513602 0.402825 0 ST
1007.27 454.85 0.836921 0.656409 1.02967e-09 1004.17 430.641 0.664098 0.520861 1.0396e-14 1006.22 443.768 0.577643 0.453054 6.50729e-12 ST
0.298039 0.233756 0 C
360.65 440.859 365.457 416.821 371.293 404.025 T
973.731 530.105 1 0.848426 0.000199062 971.867 518.185 1 0.886444 2.28638e-05 992.27 513.531 1 0.829961 0.00204964 ST
878.407 526.097 0.513602 0.402825 0 877.154 518.082 0.466251 0.365687 0 900.626 538.173 0.744268 0.58374 8.97499e-25 ST
0.298039 0.233756 0 C
849.241 478.885 859.929 500.733 861.068 508.013 T
518.019 471.718 0.92072 0.72216 0.000123883 505.746 493.07 1 0.818941 0.00182658 508.982 485.974 0.978828 0.772416 0.0218234 ST
950.742 540.281 1 0.810583 1.46059e-07 949.022 529.287 1 0.827504 5.11042e-08 973.731 530.105 1 0.848426 0.000199062 ST
900.626 538.173 0.744268 0.58374 8.97499e-25 899.229 529.232 0.712941 0.559169 1.24146e-22 925.551 543.061 0.920394 0.721878 6.82486e-13 ST
1002.49 479.052 1 0.811105 6.81365e-06 1007.27 454.85 0.836921 0.656409 1.02967e-09 1009.35 468.141 0.748774 0.587274 1.60424e-07 ST
925.551 543.061 0.920394 0.721878 6.82486e-13 923.993 533.093 0.920394 0.721878 6.82486e-13 950.742 540.281 1 0.810583 1.46059e-07 ST
0.298039 0.233756 0 C
363.782 465.232 360.65 440.859 366.559 427.905 T
5 W
1 0.0941176 0.690196 C
1009.35 468.141 LS
1007.27 454.85 LE
859.929 500.733 0.298039 0.233756 0 877.154 518.082 0.466251 0.365687 0 878.407 526.097 0.513602 0.402825 0 ST
505.746 493.07 1 0.818941 0.00182658 487.207 509.645 1 0.858011 0.000311319 490.77 501.833 1 0.807073 0.00262805 ST
990.291 500.875 1 0.882267 9.74853e-05 1002.49 479.052 1 0.811105 6.81365e-06 1004.54 492.179 0.952353 0.747011 0.00031411 ST
0.298039 0.233756 0 C
371.293 404.025 365.457 416.821 383.357 383.134 T
374.543 487.552 0.321776 0.252373 0 363.782 465.232 0.298039 0.233756 0 369.618 452.436 0.298039 0.233756 0 ST
877.154 518.082 0.466251 0.365687 0 899.229 529.232 0.712941 0.559169 1.24146e-22 900.626 538.173 0.744268 0.58374 8.97499e-25 ST
971.867 518.185 1 0.886444 2.28638e-05 990.291 500.875 1 0.882267 9.74853e-05 992.27 513.531 1 0.829961 0.00204964 ST
487.207 509.645 1 0.858011 0.000311319 464.218 519.82 1 0.826432 9.78455e-07 468.192 511.105 1 0.804495 2.72564e-06 ST
899.229 529.232 0.712941 0.559169 1.24146e-22 923.993 533.093 0.920394 0.721878 6.82486e-13 925.551 543.061 0.920394 0.721878 6.82486e-13 ST
508.982 485.974 0.978828 0.772416 0.0218234 505.746 493.07 1 0.818941 0.00182658 490.77 501.833 1 0.807073 0.00262805 ST
391.883 505.636 0.575702 0.451531 0 374.543 487.552 0.321776 0.252373 0 380.17 475.217 0.405029 0.31767 0 ST
949.022 529.287 1 0.827504 5.11042e-08 971.867 518.185 1 0.886444 2.28638e-05 973.731 530.105 1 0.848426 0.000199062 ST
923.993 533.093 0.920394 0.721878 6.82486e-13 949.022 529.287 1 0.827504 5.11042e-08 950.742 540.281 1 0.810583 1.46059e-07 ST
0.298039 0.233756 0 C
366.559 427.905 360.65 440.859 371.293 404.025 T
464.218 519.82 1 0.826432 9.78455e-07 439.027 522.6 0.949404 0.744631 4.01374e-12 443.459 512.884 0.944523 0.740802 7.15698e-12 ST
414.102 517.713 0.790749 0.620196 2.15154e-21 391.883 505.636 0.575702 0.451531 0 397.182 494.017 0.638117 0.500484 0 ST
439.027 522.6 0.949404 0.744631 4.01374e-12 414.102 517.713 0.790749 0.620196 2.15154e-21 418.991 506.996 0.824898 0.646979 1.60183e-22 ST
490.77 501.833 1 0.807073 0.00262805 487.207 509.645 1 0.858011 0.000311319 468.192 511.105 1 0.804495 2.72564e-06 ST
859.929 500.733 0.298039 0.233756 0 854.445 493.449 0.298039 0.233756 0 877.154 518.082 0.466251 0.365687 0 ST
0.298039 0.233756 0 C
369.618 452.436 363.782 465.232 366.559 427.905 T
1 0.0941176 0.690196 C
366.559 427.905 LS
360.65 440.859 LE
1004.17 430.641 0.664098 0.520861 1.0396e-14 994.275 417.505 0.736659 0.577772 8.59896e-19 993.477 408.792 0.405078 0.317708 1.46626e-27 ST
468.192 511.105 1 0.804495 2.72564e-06 464.218 519.82 1 0.826432 9.78455e-07 443.459 512.884 0.944523 0.740802 7.15698e-12 ST
380.17 475.217 0.405029 0.31767 0 374.543 487.552 0.321776 0.252373 0 369.618 452.436 0.298039 0.233756 0 ST
877.154 518.082 0.466251 0.365687 0 871.115 510.062 0.414497 0.325095 0 899.229 529.232 0.712941 0.559169 1.24146e-22 ST
443.459 512.884 0.944523 0.740802 7.15698e-12 439.027 522.6 0.949404 0.744631 4.01374e-12 418.991 506.996 0.824898 0.646979 1.60183e-22 ST
1007.27 454.85 0.836921 0.656409 1.02967e-09 997.258 441.552 0.915918 0.718367 6.53542e-13 1004.17 430.641 0.664098 0.520861 1.0396e-14 ST
397.182 494.017 0.638117 0.500484 0 391.883 505.636 0.575702 0.451531 0 380.17 475.217 0.405029 0.31767 0 ST
418.991 506.996 0.824898 0.646979 1.60183e-22 414.102 517.713 0.790749 0.620196 2.15154e-21 397.182 494.017 0.638117 0.500484 0 ST
854.445 493.449 0.298039 0.233756 0 871.115 510.062 0.414497 0.325095 0 877.154 518.082 0.466251 0.365687 0 ST
508.982 485.974 0.978828 0.772416 0.0218234 490.77 501.833 1 0.807073 0.00262805 499.062 494.415 0.965191 0.759275 0.0104895 ST
899.229 529.232 0.712941 0.559169 1.24146e-22 892.492 520.286 0.689034 0.540419 2.08368e-20 923.993 533.093 0.920394 0.721878 6.82486e-13 ST
994.275 417.505 0.736659 0.577772 8.59896e-19 983.942 396.128 0.46656 0.365929 1.29524e-35 993.477 408.792 0.405078 0.317708 1.46626e-27 ST
1002.49 479.052 1 0.811105 6.81365e-06 992.6 465.916 1 0.870538 2.47933e-08 1007.27 454.85 0.836921 0.656409 1.02967e-09 ST
0.298039 0.233756 0 C
371.293 404.025 383.357 383.134 396.45 371.421 T
923.993 533.093 0.920394 0.721878 6.82486e-13 916.483 523.119 0.91425 0.717058 7.34108e-13 949.022 529.287 1 0.827504 5.11042e-08 ST
990.291 500.875 1 0.882267 9.74853e-05 980.755 488.211 1 0.931357 1.51213e-06 1002.49 479.052 1 0.811105 6.81365e-06 ST
871.115 510.062 0.414497 0.325095 0 892.492 520.286 0.689034 0.540419 2.08368e-20 899.229 529.232 0.712941 0.559169 1.24146e-22 ST
949.022 529.287 1 0.827504 5.11042e-08 940.739 518.285 1 0.843692 8.13327e-09 971.867 518.185 1 0.886444 2.28638e-05 ST
971.867 518.185 1 0.886444 2.28638e-05 962.886 506.257 1 0.922503 1.09087e-06 990.291 500.875 1 0.882267 9.74853e-05 ST
490.77 501.833 1 0.807073 0.00262805 468.192 511.105 1 0.804495 2.72564e-06 477.443 502.831 0.984895 0.772469 7.92056e-06 ST
997.258 441.552 0.915918 0.718367 6.53542e-13 994.275 417.505 0.736659 0.577772 8.59896e-19 1004.17 430.641 0.664098 0.520861 1.0396e-14 ST
0.298039 0.233756 0 C
366.559 427.905 371.293 404.025 384.875 391.876 T
396.45 371.421 383.357 383.134 413.902 356.243 T
892.492 520.286 0.689034 0.540419 2.08368e-20 916.483 523.119 0.91425 0.717058 7.34108e-13 923.993 533.093 0.920394 0.721878 6.82486e-13 ST
992.6 465.916 1 0.870538 2.47933e-08 997.258 441.552 0.915918 0.718367 6.53542e-13 1007.27 454.85 0.836921 0.656409 1.02967e-09 ST
499.062 494.415 0.965191 0.759275 0.0104895 490.77 501.833 1 0.807073 0.00262805 477.443 502.831 0.984895 0.772469 7.92056e-06 ST
468.192 511.105 1 0.804495 2.72564e-06 443.459 512.884 0.944523 0.740802 7.15698e-12 453.771 503.66 0.944523 0.740802 7.15698e-12 ST
0.298039 0.233756 0 C
369.618 452.436 366.559 427.905 380.309 415.606 T
1 0.0941176 0.690196 C
1007.27 454.85 LS
997.258 441.552 LE
916.483 523.119 0.91425 0.717058 7.34108e-13 940.739 518.285 1 0.843692 8.13327e-09 949.022 529.287 1 0.827504 5.11042e-08 ST
980.755 488.211 1 0.931357 1.51213e-06 992.6 465.916 1 0.870538 2.47933e-08 1002.49 479.052 1 0.811105 6.81365e-06 ST
0.298039 0.233756 0 C
384.875 391.876 371.293 404.025 396.45 371.421 T
443.459 512.884 0.944523 0.740802 7.15698e-12 418.991 506.996 0.824898 0.646979 1.60183e-22 430.365 496.821 0.853877 0.669708 3.00956e-23 ST
380.17 475.217 0.405029 0.31767 0 369.618 452.436 0.298039 0.233756 0 383.2 440.287 0.298039 0.233756 0 ST
940.739 518.285 1 0.843692 8.13327e-09 962.886 506.257 1 0.922503 1.09087e-06 971.867 518.185 1 0.886444 2.28638e-05 ST
962.886 506.257 1 0.922503 1.09087e-06 980.755 488.211 1 0.931357 1.51213e-06 990.291 500.875 1 0.882267 9.74853e-05 ST
871.115 510.062 0.414497 0.325095 0 860.44 502.235 0.38284 0.300267 1.3532e-31 892.492 520.286 0.689034 0.540419 2.08368e-20 ST
418.991 506.996 0.824898 0.646979 1.60183e-22 397.182 494.017 0.638117 0.500484 0 409.516 482.985 0.693721 0.544095 0 ST
983.942 396.128 0.46656 0.365929 1.29524e-35 967.085 383.768 0.518897 0.406978 0 967.272 379.515 0.298039 0.233756 0 ST
397.182 494.017 0.638117 0.500484 0 380.17 475.217 0.405029 0.31767 0 393.263 463.504 0.493437 0.387009 0 ST
477.443 502.831 0.984895 0.772469 7.92056e-06 468.192 511.105 1 0.804495 2.72564e-06 453.771 503.66 0.944523 0.740802 7.15698e-12 ST
844.748 486.339 0.298039 0.233756 0 860.44 502.235 0.38284 0.300267 1.3532e-31 871.115 510.062 0.414497 0.325095 0 ST
0.298039 0.233756 0 C
380.309 415.606 366.559 427.905 384.875 391.876 T
453.771 503.66 0.944523 0.740802 7.15698e-12 443.459 512.884 0.944523 0.740802 7.15698e-12 430.365 496.821 0.853877 0.669708 3.00956e-23 ST
892.492 520.286 0.689034 0.540419 2.08368e-20 880.583 511.554 0.668992 0.524699 7.52892e-19 916.483 523.119 0.91425 0.717058 7.34108e-13 ST
994.275 417.505 0.736659 0.577772 8.59896e-19 976.789 404.684 0.798745 0.626466 1.50652e-25 983.942 396.128 0.46656 0.365929 1.29524e-35 ST
0.298039 0.233756 0 C
383.2 440.287 369.618 452.436 380.309 415.606 T
967.085 383.768 0.518897 0.406978 0 951.394 367.873 0.298039 0.233756 0 967.272 379.515 0.298039 0.233756 0 ST
1 0.0941176 0.690196 C
380.309 415.606 LS
366.559 427.905 LE
0.298039 0.233756 0 C
396.45 371.421 413.902 356.243 432.963 346.07 T
430.365 496.821 0.853877 0.669708 3.00956e-23 418.991 506.996 0.824898 0.646979 1.60183e-22 409.516 482.985 0.693721 0.544095 0 ST
860.44 502.235 0.38284 0.300267 1.3532e-31 880.583 511.554 0.668992 0.524699 7.52892e-19 892.492 520.286 0.689034 0.540419 2.08368e-20 ST
393.263 463.504 0.493437 0.387009 0 380.17 475.217 0.405029 0.31767 0 383.2 440.287 0.298039 0.233756 0 ST
499.062 494.415 0.965191 0.759275 0.0104895 477.443 502.831 0.984895 0.772469 7.92056e-06 491.74 495.201 0.949118 0.744409 1.14099e-05 ST
409.516 482.985 0.693721 0.544095 0 397.182 494.017 0.638117 0.500484 0 393.263 463.504 0.493437 0.387009 0 ST
0.298039 0.233756 0 C
432.963 346.07 413.902 356.243 453.102 338.445 T
916.483 523.119 0.91425 0.717058 7.34108e-13 903.206 513.384 0.915515 0.718051 1.24915e-12 940.739 518.285 1 0.843692 8.13327e-09 ST
997.258 441.552 0.915918 0.718367 6.53542e-13 979.556 428.572 0.980247 0.768821 1.33095e-17 994.275 417.505 0.736659 0.577772 8.59896e-19 ST
511.878 487.576 0.914228 0.72106 0.018631 499.062 494.415 0.965191 0.759275 0.0104895 491.74 495.201 0.949118 0.744409 1.14099e-05 ST
976.789 404.684 0.798745 0.626466 1.50652e-25 967.085 383.768 0.518897 0.406978 0 983.942 396.128 0.46656 0.365929 1.29524e-35 ST
0.298039 0.233756 0 C
384.875 391.876 396.45 371.421 416.687 360.621 T
880.583 511.554 0.668992 0.524699 7.52892e-19 903.206 513.384 0.915515 0.718051 1.24915e-12 916.483 523.119 0.91425 0.717058 7.34108e-13 ST
940.739 518.285 1 0.843692 8.13327e-09 926.094 507.547 1 0.858636 1.08394e-09 962.886 506.257 1 0.922503 1.09087e-06 ST
992.6 465.916 1 0.870538 2.47933e-08 975.114 453.094 1 0.915813 1.99589e-11 997.258 441.552 0.915918 0.718367 6.53542e-13 ST
477.443 502.831 0.984895 0.772469 7.92056e-06 453.771 503.66 0.944523 0.740802 7.15698e-12 469.71 495.154 0.938498 0.736077 7.72259e-12 ST
962.886 506.257 1 0.922503 1.09087e-06 947.008 494.614 1 0.952292 1.94341e-08 980.755 488.211 1 0.931357 1.51213e-06 ST
980.755 488.211 1 0.931357 1.51213e-06 963.898 475.851 1 0.970514 7.46684e-09 992.6 465.916 1 0.870538 2.47933e-08 ST
860.44 502.235 0.38284 0.300267 1.3532e-31 845.391 494.792 0.351901 0.276001 2.41308e-25 880.583 511.554 0.668992 0.524699 7.52892e-19 ST
0.298039 0.233756 0 C
416.687 360.621 396.45 371.421 432.963 346.07 T
979.556 428.572 0.980247 0.768821 1.33095e-17 976.789 404.684 0.798745 0.626466 1.50652e-25 994.275 417.505 0.736659 0.577772 8.59896e-19 ST
0.298039 0.233756 0 C
380.309 415.606 384.875 391.876 405.867 380.673 T
491.74 495.201 0.949118 0.744409 1.14099e-05 477.443 502.831 0.984895 0.772469 7.92056e-06 469.71 495.154 0.938498 0.736077 7.72259e-12 ST
903.206 513.384 0.915515 0.718051 1.24915e-12 926.094 507.547 1 0.858636 1.08394e-09 940.739 518.285 1 0.843692 8.13327e-09 ST
453.771 503.66 0.944523 0.740802 7.15698e-12 430.365 496.821 0.853877 0.669708 3.00956e-23 447.946 487.439 0.878316 0.688875 1.69725e-23 ST
0.298039 0.233756 0 C
432.963 346.07 453.102 338.445 476.456 330.086 T
975.114 453.094 1 0.915813 1.99589e-11 979.556 428.572 0.980247 0.768821 1.33095e-17 997.258 441.552 0.915918 0.718367 6.53542e-13 ST
926.094 507.547 1 0.858636 1.08394e-09 947.008 494.614 1 0.952292 1.94341e-08 962.886 506.257 1 0.922503 1.09087e-06 ST
0.298039 0.233756 0 C
476.456 330.086 453.102 338.445 496.305 330.914 T
383.2 440.287 380.309 415.606 401.561 404.264 T
405.867 380.673 384.875 391.876 416.687 360.621 T
430.365 496.821 0.853877 0.669708 3.00956e-23 409.516 482.985 0.693721 0.544095 0 428.577 472.812 0.749407 0.58777 0 ST
880.583 511.554 0.668992 0.524699 7.52892e-19 863.794 503.251 0.651571 0.511036 8.01765e-17 903.206 513.384 0.915515 0.718051 1.24915e-12 ST
1 0.0941176 0.690196 C
997.258 441.552 LS
979.556 428.572 LE
963.898 475.851 1 0.970514 7.46684e-09 975.114 453.094 1 0.915813 1.99589e-11 992.6 465.916 1 0.870538 2.47933e-08 ST
845.391 494.792 0.351901 0.276001 2.41308e-25 863.794 503.251 0.651571 0.511036 8.01765e-17 880.583 511.554 0.668992 0.524699 7.52892e-19 ST
947.008 494.614 1 0.952292 1.94341e-08 963.898 475.851 1 0.970514 7.46684e-09 980.755 488.211 1 0.931357 1.51213e-06 ST
967.085 383.768 0.518897 0.406978 0 943.322 372.016 0.55195 0.432902 0 951.394 367.873 0.298039 0.233756 0 ST
469.71 495.154 0.938498 0.736077 7.72259e-12 453.771 503.66 0.944523 0.740802 7.15698e-12 447.946 487.439 0.878316 0.688875 1.69725e-23 ST
393.263 463.504 0.493437 0.387009 0 383.2 440.287 0.298039 0.233756 0 404.191 429.084 0.374236 0.293519 0 ST
409.516 482.985 0.693721 0.544095 0 393.263 463.504 0.493437 0.387009 0 413.501 452.704 0.574509 0.450595 0 ST
0.298039 0.233756 0 C
401.561 404.264 380.309 415.606 405.867 380.673 T
943.322 372.016 0.55195 0.432902 0 929.01 356.803 0.298039 0.233756 0 951.394 367.873 0.298039 0.233756 0 ST
0.298039 0.233756 0 C
416.687 360.621 432.963 346.07 458.286 337.007 T
447.946 487.439 0.878316 0.688875 1.69725e-23 430.365 496.821 0.853877 0.669708 3.00956e-23 428.577 472.812 0.749407 0.58777 0 ST
903.206 513.384 0.915515 0.718051 1.24915e-12 884.49 504.128 0.915515 0.718051 1.24915e-12 926.094 507.547 1 0.858636 1.08394e-09 ST
976.789 404.684 0.798745 0.626466 1.50652e-25 952.139 392.493 0.839721 0.658605 1.87361e-36 967.085 383.768 0.518897 0.406978 0 ST
0.298039 0.233756 0 C
458.286 337.007 432.963 346.07 476.456 330.086 T
863.794 503.251 0.651571 0.511036 8.01765e-17 884.49 504.128 0.915515 0.718051 1.24915e-12 903.206 513.384 0.915515 0.718051 1.24915e-12 ST
404.191 429.084 0.374236 0.293519 0 383.2 440.287 0.298039 0.233756 0 401.561 404.264 0.298039 0.233756 0 ST
428.577 472.812 0.749407 0.58777 0 409.516 482.985 0.693721 0.544095 0 413.501 452.704 0.574509 0.450595 0 ST
491.74 495.201 0.949118 0.744409 1.14099e-05 469.71 495.154 0.938498 0.736077 7.72259e-12 490.883 487.575 0.938498 0.736077 7.72259e-12 ST
1 0.0941176 0.690196 C
401.561 404.264 LS
380.309 415.606 LE
413.501 452.704 0.574509 0.450595 0 393.263 463.504 0.493437 0.387009 0 404.191 429.084 0.374236 0.293519 0 ST
510.732 488.403 0.918545 0.72043 1.12158e-05 491.74 495.201 0.949118 0.744409 1.14099e-05 490.883 487.575 0.938498 0.736077 7.72259e-12 ST
926.094 507.547 1 0.858636 1.08394e-09 905.45 497.338 1 0.868699 1.3862e-10 947.008 494.614 1 0.952292 1.94341e-08 ST
979.556 428.572 0.980247 0.768821 1.33095e-17 954.601 416.23 1 0.801622 4.71377e-24 976.789 404.684 0.798745 0.626466 1.50652e-25 ST
952.139 392.493 0.839721 0.658605 1.87361e-36 943.322 372.016 0.55195 0.432902 0 967.085 383.768 0.518897 0.406978 0 ST
0.298039 0.233756 0 C
405.867 380.673 416.687 360.621 443.571 350.999 T
929.01 356.803 900.673 346.579 910.606 348.344 T
884.49 504.128 0.915515 0.718051 1.24915e-12 905.45 497.338 1 0.868699 1.3862e-10 926.094 507.547 1 0.858636 1.08394e-09 ST
947.008 494.614 1 0.952292 1.94341e-08 924.624 483.545 1 0.970891 3.49075e-10 963.898 475.851 1 0.970514 7.46684e-09 ST
975.114 453.094 1 0.915813 1.99589e-11 950.464 440.904 1 0.946933 2.51866e-15 979.556 428.572 0.980247 0.768821 1.33095e-17 ST
0.298039 0.233756 0 C
443.571 350.999 416.687 360.621 458.286 337.007 T
469.71 495.154 0.938498 0.736077 7.72259e-12 447.946 487.439 0.878316 0.688875 1.69725e-23 471.3 479.08 0.907996 0.712154 7.73219e-24 ST
863.794 503.251 0.651571 0.511036 8.01765e-17 842.54 495.582 0.646997 0.507448 4.66834e-15 884.49 504.128 0.915515 0.718051 1.24915e-12 ST
963.898 475.851 1 0.970514 7.46684e-09 940.135 464.099 1 0.996996 1.10809e-11 975.114 453.094 1 0.915813 1.99589e-11 ST
0.298039 0.233756 0 C
900.673 346.579 884.47 338.914 910.606 348.344 T
458.286 337.007 476.456 330.086 505.01 322.956 T
954.601 416.23 1 0.801622 4.71377e-24 952.139 392.493 0.839721 0.658605 1.87361e-36 976.789 404.684 0.798745 0.626466 1.50652e-25 ST
0.298039 0.233756 0 C
401.561 404.264 405.867 380.673 433.753 370.692 T
490.883 487.575 0.938498 0.736077 7.72259e-12 469.71 495.154 0.938498 0.736077 7.72259e-12 471.3 479.08 0.907996 0.712154 7.73219e-24 ST
905.45 497.338 1 0.868699 1.3862e-10 924.624 483.545 1 0.970891 3.49075e-10 947.008 494.614 1 0.952292 1.94341e-08 ST
447.946 487.439 0.878316 0.688875 1.69725e-23 428.577 472.812 0.749407 0.58777 0 453.9 463.749 0.811881 0.636769 0 ST
943.322 372.016 0.55195 0.432902 0 913.236 361.161 0.574834 0.450851 0 929.01 356.803 0.298039 0.233756 0 ST
950.464 440.904 1 0.946933 2.51866e-15 954.601 416.23 1 0.801622 4.71377e-24 979.556 428.572 0.980247 0.768821 1.33095e-17 ST
0.298039 0.233756 0 C
433.753 370.692 405.867 380.673 443.571 350.999 T
404.191 429.084 0.374236 0.293519 0 401.561 404.264 0.298039 0.233756 0 429.793 394.16 0.298039 0.233756 0 ST
924.624 483.545 1 0.970891 3.49075e-10 940.135 464.099 1 0.996996 1.10809e-11 963.898 475.851 1 0.970514 7.46684e-09 ST
842.54 495.582 0.646997 0.507448 4.66834e-15 860.795 495.579 0.916741 0.719013 2.1056e-12 884.49 504.128 0.915515 0.718051 1.24915e-12 ST
940.135 464.099 1 0.996996 1.10809e-11 950.464 440.904 1 0.946933 2.51866e-15 975.114 453.094 1 0.915813 1.99589e-11 ST
428.577 472.812 0.749407 0.58777 0 413.501 452.704 0.574509 0.450595 0 440.384 443.082 0.667454 0.523493 0 ST
884.49 504.128 0.915515 0.718051 1.24915e-12 860.795 495.579 0.916741 0.719013 2.1056e-12 905.45 497.338 1 0.868699 1.3862e-10 ST
1 0.0941176 0.690196 C
979.556 428.572 LS
954.601 416.23 LE
510.732 488.403 0.918545 0.72043 1.12158e-05 490.883 487.575 0.938498 0.736077 7.72259e-12 516.77 481.111 0.938498 0.736077 7.72259e-12 ST
413.501 452.704 0.574509 0.450595 0 404.191 429.084 0.374236 0.293519 0 432.078 419.103 0.487909 0.382674 0 ST
913.236 361.161 0.574834 0.450851 0 900.673 346.579 0.298039 0.233756 0 929.01 356.803 0.298039 0.233756 0 ST
0.298039 0.233756 0 C
489.244 329.276 458.286 337.007 505.01 322.956 T
471.3 479.08 0.907996 0.712154 7.73219e-24 447.946 487.439 0.878316 0.688875 1.69725e-23 453.9 463.749 0.811881 0.636769 0 ST
0.298039 0.233756 0 C
443.571 350.999 458.286 337.007 489.244 329.276 T
533.952 482.605 0.873814 0.685346 1.08134e-05 510.732 488.403 0.918545 0.72043 1.12158e-05 516.77 481.111 0.938498 0.736077 7.72259e-12 ST
0.298039 0.233756 0 C
429.793 394.16 401.561 404.264 433.753 370.692 T
952.139 392.493 0.839721 0.658605 1.87361e-36 920.932 381.233 0.863222 0.677037 0 943.322 372.016 0.55195 0.432902 0 ST
842.54 495.582 0.646997 0.507448 4.66834e-15 817.343 488.736 0.649877 0.509707 3.05437e-13 860.795 495.579 0.916741 0.719013 2.1056e-12 ST
453.9 463.749 0.811881 0.636769 0 428.577 472.812 0.749407 0.58777 0 440.384 443.082 0.667454 0.523493 0 ST
0.298039 0.233756 0 C
900.673 346.579 867.078 337.452 884.47 338.914 T
905.45 497.338 1 0.868699 1.3862e-10 879.314 487.908 1 0.873782 1.09214e-11 924.624 483.545 1 0.970891 3.49075e-10 ST
432.078 419.103 0.487909 0.382674 0 404.191 429.084 0.374236 0.293519 0 429.793 394.16 0.298039 0.233756 0 ST
440.384 443.082 0.667454 0.523493 0 413.501 452.704 0.574509 0.450595 0 432.078 419.103 0.487909 0.382674 0 ST
860.795 495.579 0.916741 0.719013 2.1056e-12 879.314 487.908 1 0.873782 1.09214e-11 905.45 497.338 1 0.868699 1.3862e-10 ST
0.298039 0.233756 0 C
867.078 337.452 853.486 330.496 884.47 338.914 T
489.244 329.276 505.01 322.956 538.058 317.231 T
1 0.0941176 0.690196 C
429.793 394.16 LS
401.561 404.264 LE
490.883 487.575 0.938498 0.736077 7.72259e-12 471.3 479.08 0.907996 0.712154 7.73219e-24 499.854 471.95 0.941644 0.738545 2.82043e-23 ST
920.932 381.233 0.863222 0.677037 0 913.236 361.161 0.574834 0.450851 0 943.322 372.016 0.55195 0.432902 0 ST
0.298039 0.233756 0 C
433.753 370.692 443.571 350.999 476.438 342.792 T
954.601 416.23 1 0.801622 4.71377e-24 923.007 404.831 1 0.82075 4.25112e-35 952.139 392.493 0.839721 0.658605 1.87361e-36 ST
0.298039 0.233756 0 C
476.438 342.792 443.571 350.999 489.244 329.276 T
516.77 481.111 0.938498 0.736077 7.72259e-12 490.883 487.575 0.938498 0.736077 7.72259e-12 499.854 471.95 0.941644 0.738545 2.82043e-23 ST
924.624 483.545 1 0.970891 3.49075e-10 896.287 473.32 1 0.981963 1.32376e-12 940.135 464.099 1 0.996996 1.10809e-11 ST
817.343 488.736 0.649877 0.509707 3.05437e-13 832.704 487.947 0.916741 0.719013 2.1056e-12 860.795 495.579 0.916741 0.719013 2.1056e-12 ST
950.464 440.904 1 0.946933 2.51866e-15 919.257 429.644 1 0.965612 3.19626e-21 954.601 416.23 1 0.801622 4.71377e-24 ST
940.135 464.099 1 0.996996 1.10809e-11 910.05 453.244 1 1 1.6135e-15 950.464 440.904 1 0.946933 2.51866e-15 ST
533.952 482.605 0.873814 0.685346 1.08134e-05 516.77 481.111 0.938498 0.736077 7.72259e-12 546.732 475.92 0.932432 0.731319 8.31047e-12 ST
560.828 477.949 0.834282 0.654341 7.03052e-06 533.952 482.605 0.873814 0.685346 1.08134e-05 546.732 475.92 0.932432 0.731319 8.31047e-12 ST
879.314 487.908 1 0.873782 1.09214e-11 896.287 473.32 1 0.981963 1.32376e-12 924.624 483.545 1 0.970891 3.49075e-10 ST
860.795 495.579 0.916741 0.719013 2.1056e-12 832.704 487.947 0.916741 0.719013 2.1056e-12 879.314 487.908 1 0.873782 1.09214e-11 ST
471.3 479.08 0.907996 0.712154 7.73219e-24 453.9 463.749 0.811881 0.636769 0 484.858 456.018 0.883327 0.692805 0 ST
923.007 404.831 1 0.82075 4.25112e-35 920.932 381.233 0.863222 0.677037 0 952.139 392.493 0.839721 0.658605 1.87361e-36 ST
913.236 361.161 0.574834 0.450851 0 877.571 351.471 0.580211 0.455067 0 900.673 346.579 0.298039 0.233756 0 ST
0.298039 0.233756 0 C
429.793 394.16 433.753 370.692 467.846 362.179 T
525.077 323.069 489.244 329.276 538.058 317.231 T
817.343 488.736 0.649877 0.509707 3.05437e-13 788.824 482.882 0.649222 0.509193 4.35385e-12 832.704 487.947 0.916741 0.719013 2.1056e-12 ST
877.571 351.471 0.580211 0.455067 0 867.078 337.452 0.298039 0.233756 0 900.673 346.579 0.298039 0.233756 0 ST
0.298039 0.233756 0 C
467.846 362.179 433.753 370.692 476.438 342.792 T
476.438 342.792 489.244 329.276 525.077 323.069 T
896.287 473.32 1 0.981963 1.32376e-12 910.05 453.244 1 1 1.6135e-15 940.135 464.099 1 0.996996 1.10809e-11 ST
499.854 471.95 0.941644 0.738545 2.82043e-23 471.3 479.08 0.907996 0.712154 7.73219e-24 484.858 456.018 0.883327 0.692805 0 ST
919.257 429.644 1 0.965612 3.19626e-21 923.007 404.831 1 0.82075 4.25112e-35 954.601 416.23 1 0.801622 4.71377e-24 ST
453.9 463.749 0.811881 0.636769 0 440.384 443.082 0.667454 0.523493 0 473.252 434.875 0.765379 0.600297 0 ST
432.078 419.103 0.487909 0.382674 0 429.793 394.16 0.298039 0.233756 0 464.308 385.541 0.384362 0.30146 0 ST
910.05 453.244 1 1 1.6135e-15 919.257 429.644 1 0.965612 3.19626e-21 950.464 440.904 1 0.946933 2.51866e-15 ST
0.298039 0.233756 0 C
867.078 337.452 829.055 329.646 853.486 330.496 T
440.384 443.082 0.667454 0.523493 0 432.078 419.103 0.487909 0.382674 0 466.17 410.59 0.602657 0.472672 0 ST
0.298039 0.233756 0 C
829.055 329.646 818.417 323.297 853.486 330.496 T
525.077 323.069 538.058 317.231 574.788 313.051 T
1 0.0941176 0.690196 C
954.601 416.23 LS
923.007 404.831 LE
832.704 487.947 0.916741 0.719013 2.1056e-12 848.33 479.49 1 0.877664 6.70122e-13 879.314 487.908 1 0.873782 1.09214e-11 ST
879.314 487.908 1 0.873782 1.09214e-11 848.33 479.49 1 0.877664 6.70122e-13 896.287 473.32 1 0.981963 1.32376e-12 ST
516.77 481.111 0.938498 0.736077 7.72259e-12 499.854 471.95 0.941644 0.738545 2.82043e-23 532.901 466.224 0.974119 0.764015 9.19738e-23 ST
920.932 381.233 0.863222 0.677037 0 883.937 371.182 0.86931 0.681811 0 913.236 361.161 0.574834 0.450851 0 ST
464.308 385.541 0.384362 0.30146 0 429.793 394.16 0.298039 0.233756 0 467.846 362.179 0.298039 0.233756 0 ST
590.698 474.55 0.793293 0.622191 2.3588e-06 560.828 477.949 0.834282 0.654341 7.03052e-06 580.033 472.131 0.932432 0.731319 8.31047e-12 ST
484.858 456.018 0.883327 0.692805 0 453.9 463.749 0.811881 0.636769 0 473.252 434.875 0.765379 0.600297 0 ST
788.824 482.882 0.649222 0.509193 4.35385e-12 800.91 481.42 0.916741 0.719013 2.1056e-12 832.704 487.947 0.916741 0.719013 2.1056e-12 ST
546.732 475.92 0.932432 0.731319 8.31047e-12 516.77 481.111 0.938498 0.736077 7.72259e-12 532.901 466.224 0.974119 0.764015 9.19738e-23 ST
560.828 477.949 0.834282 0.654341 7.03052e-06 546.732 475.92 0.932432 0.731319 8.31047e-12 580.033 472.131 0.932432 0.731319 8.31047e-12 ST
788.824 482.882 0.649222 0.509193 4.35385e-12 757.684 478.163 0.656103 0.514591 8.03885e-11 800.91 481.42 0.916741 0.719013 2.1056e-12 ST
0.298039 0.233756 0 C
514.48 336.201 476.438 342.792 525.077 323.069 T
883.937 371.182 0.86931 0.681811 0 877.571 351.471 0.580211 0.455067 0 913.236 361.161 0.574834 0.450851 0 ST
466.17 410.59 0.602657 0.472672 0 432.078 419.103 0.487909 0.382674 0 464.308 385.541 0.384362 0.30146 0 ST
473.252 434.875 0.765379 0.600297 0 440.384 443.082 0.667454 0.523493 0 466.17 410.59 0.602657 0.472672 0 ST
0.298039 0.233756 0 C
467.846 362.179 476.438 342.792 514.48 336.201 T
832.704 487.947 0.916741 0.719013 2.1056e-12 800.91 481.42 0.916741 0.719013 2.1056e-12 848.33 479.49 1 0.877664 6.70122e-13 ST
0.298039 0.233756 0 C
564.901 318.537 525.077 323.069 574.788 313.051 T
1 0.0941176 0.690196 C
464.308 385.541 LS
429.793 394.16 LE
896.287 473.32 1 0.981963 1.32376e-12 862.692 464.193 1 0.984937 1.77965e-15 910.05 453.244 1 1 1.6135e-15 ST
923.007 404.831 1 0.82075 4.25112e-35 885.553 394.655 1 0.82561 0 920.932 381.233 0.863222 0.677037 0 ST
848.33 479.49 1 0.877664 6.70122e-13 862.692 464.193 1 0.984937 1.77965e-15 896.287 473.32 1 0.981963 1.32376e-12 ST
877.571 351.471 0.580211 0.455067 0 837.202 343.184 0.566008 0.443928 0 867.078 337.452 0.298039 0.233756 0 ST
499.854 471.95 0.941644 0.738545 2.82043e-23 484.858 456.018 0.883327 0.692805 0 520.691 449.81 0.953232 0.747633 0 ST
0.298039 0.233756 0 C
787.538 323.354 780.126 317.494 818.417 323.297 T
622.827 472.491 0.764627 0.599708 6.94647e-07 590.698 474.55 0.793293 0.622191 2.3588e-06 615.85 469.836 0.926326 0.72653 8.919e-12 ST
0.298039 0.233756 0 C
564.901 318.537 574.788 313.051 614.295 310.52 T
837.202 343.184 0.566008 0.443928 0 829.055 329.646 0.298039 0.233756 0 867.078 337.452 0.298039 0.233756 0 ST
0.298039 0.233756 0 C
829.055 329.646 787.538 323.354 818.417 323.297 T
910.05 453.244 1 1 1.6135e-15 874.384 443.554 1 1 1.88123e-20 919.257 429.644 1 0.965612 3.19626e-21 ST
919.257 429.644 1 0.965612 3.19626e-21 882.261 419.593 1 0.970305 3.30772e-30 923.007 404.831 1 0.82075 4.25112e-35 ST
0.298039 0.233756 0 C
514.48 336.201 525.077 323.069 564.901 318.537 T
0.513726 0.423529 1 C
788.824 482.882 LS
800.91 481.42 LE
757.684 478.163 0.656103 0.514591 8.03885e-11 724.692 474.695 0.677124 0.531077 1.79125e-09 766.195 476.159 0.917928 0.719943 3.51654e-12 ST
757.684 478.163 0.656103 0.514591 8.03885e-11 766.195 476.159 0.917928 0.719943 3.51654e-12 800.91 481.42 0.916741 0.719013 2.1056e-12 ST
590.698 474.55 0.793293 0.622191 2.3588e-06 580.033 472.131 0.932432 0.731319 8.31047e-12 615.85 469.836 0.926326 0.72653 8.919e-12 ST
532.901 466.224 0.974119 0.764015 9.19738e-23 499.854 471.95 0.941644 0.738545 2.82043e-23 520.691 449.81 0.953232 0.747633 0 ST
885.553 394.655 1 0.82561 0 883.937 371.182 0.86931 0.681811 0 920.932 381.233 0.863222 0.677037 0 ST
0.513726 0.423529 1 C
829.055 329.646 LS
818.417 323.297 LE
464.308 385.541 0.384362 0.30146 0 467.846 362.179 0.298039 0.233756 0 507.306 355.343 0.336364 0.263815 0 ST
800.91 481.42 0.916741 0.719013 2.1056e-12 813.261 472.29 1 0.872708 2.48254e-14 848.33 479.49 1 0.877664 6.70122e-13 ST
507.306 355.343 0.336364 0.263815 0 467.846 362.179 0.298039 0.233756 0 514.48 336.201 0.298039 0.233756 0 ST
580.033 472.131 0.932432 0.731319 8.31047e-12 546.732 475.92 0.932432 0.731319 8.31047e-12 569.632 462.045 1 0.786291 8.57962e-22 ST
546.732 475.92 0.932432 0.731319 8.31047e-12 532.901 466.224 0.974119 0.764015 9.19738e-23 569.632 462.045 1 0.786291 8.57962e-22 ST
862.692 464.193 1 0.984937 1.77965e-15 874.384 443.554 1 1 1.88123e-20 910.05 453.244 1 1 1.6135e-15 ST
656.423 471.824 0.727428 0.570532 1.26287e-07 622.827 472.491 0.764627 0.599708 6.94647e-07 653.304 469.092 0.92522 0.725663 5.43232e-12 ST
484.858 456.018 0.883327 0.692805 0 473.252 434.875 0.765379 0.600297 0 511.294 428.284 0.863554 0.677297 0 ST
724.692 474.695 0.677124 0.531077 1.79125e-09 690.659 472.565 0.695359 0.545379 1.34572e-08 729.413 472.293 0.917928 0.719943 3.51654e-12 ST
848.33 479.49 1 0.877664 6.70122e-13 813.261 472.29 1 0.872708 2.48254e-14 862.692 464.193 1 0.984937 1.77965e-15 ST
882.261 419.593 1 0.970305 3.30772e-30 885.553 394.655 1 0.82561 0 923.007 404.831 1 0.82075 4.25112e-35 ST
690.659 472.565 0.695359 0.545379 1.34572e-08 656.423 471.824 0.727428 0.570532 1.26287e-07 691.472 469.918 0.92522 0.725663 5.43232e-12 ST
800.91 481.42 0.916741 0.719013 2.1056e-12 766.195 476.159 0.917928 0.719943 3.51654e-12 813.261 472.29 1 0.872708 2.48254e-14 ST
0.298039 0.233756 0 C
743.55 318.731 739.556 313.23 780.126 317.494 T
466.17 410.59 0.602657 0.472672 0 464.308 385.541 0.384362 0.30146 0 504.257 378.62 0.499068 0.391426 0 ST
0.298039 0.233756 0 C
607.737 315.793 564.901 318.537 614.295 310.52 T
607.737 315.793 614.295 310.52 655.607 309.7 T
874.384 443.554 1 1 1.88123e-20 882.261 419.593 1 0.970305 3.30772e-30 919.257 429.644 1 0.965612 3.19626e-21 ST
724.692 474.695 0.677124 0.531077 1.79125e-09 729.413 472.293 0.917928 0.719943 3.51654e-12 766.195 476.159 0.917928 0.719943 3.51654e-12 ST
473.252 434.875 0.765379 0.600297 0 466.17 410.59 0.602657 0.472672 0 505.631 403.754 0.718944 0.563878 0 ST
622.827 472.491 0.764627 0.599708 6.94647e-07 615.85 469.836 0.926326 0.72653 8.919e-12 653.304 469.092 0.92522 0.725663 5.43232e-12 ST
883.937 371.182 0.86931 0.681811 0 842.063 362.586 0.85502 0.670604 0 877.571 351.471 0.580211 0.455067 0 ST
0.298039 0.233756 0 C
556.76 331.39 514.48 336.201 564.901 318.537 T
520.691 449.81 0.953232 0.747633 0 484.858 456.018 0.883327 0.692805 0 511.294 428.284 0.863554 0.677297 0 ST
0.298039 0.233756 0 C
787.538 323.354 743.55 318.731 780.126 317.494 T
1 0.0941176 0.690196 C
923.007 404.831 LS
885.553 394.655 LE
504.257 378.62 0.499068 0.391426 0 464.308 385.541 0.384362 0.30146 0 507.306 355.343 0.336364 0.263815 0 ST
0.298039 0.233756 0 C
698.175 315.891 697.707 310.611 739.556 313.23 T
652.529 314.903 655.607 309.7 697.707 310.611 T
842.063 362.586 0.85502 0.670604 0 837.202 343.184 0.566008 0.443928 0 877.571 351.471 0.580211 0.455067 0 ST
690.659 472.565 0.695359 0.545379 1.34572e-08 691.472 469.918 0.92522 0.725663 5.43232e-12 729.413 472.293 0.917928 0.719943 3.51654e-12 ST
656.423 471.824 0.727428 0.570532 1.26287e-07 653.304 469.092 0.92522 0.725663 5.43232e-12 691.472 469.918 0.92522 0.725663 5.43232e-12 ST
507.306 355.343 0.336364 0.263815 0 514.48 336.201 0.298039 0.233756 0 556.76 331.39 0.298039 0.233756 0 ST
793.125 336.504 0.544011 0.426675 0 787.538 323.354 0.298039 0.233756 0 829.055 329.646 0.298039 0.233756 0 ST
0.298039 0.233756 0 C
556.76 331.39 564.901 318.537 607.737 315.793 T
837.202 343.184 0.566008 0.443928 0 793.125 336.504 0.544011 0.426675 0 829.055 329.646 0.298039 0.233756 0 ST
615.85 469.836 0.926326 0.72653 8.919e-12 580.033 472.131 0.932432 0.731319 8.31047e-12 609.139 459.514 1 0.809457 1.63916e-20 ST
511.294 428.284 0.863554 0.677297 0 473.252 434.875 0.765379 0.600297 0 505.631 403.754 0.718944 0.563878 0 ST
0.513726 0.423529 1 C
800.91 481.42 LS
813.261 472.29 LE
813.261 472.29 1 0.872708 2.48254e-14 824.669 456.387 1 0.97883 8.44483e-19 862.692 464.193 1 0.984937 1.77965e-15 ST
0.298039 0.233756 0 C
652.529 314.903 607.737 315.793 655.607 309.7 T
862.692 464.193 1 0.984937 1.77965e-15 824.669 456.387 1 0.97883 8.44483e-19 874.384 443.554 1 1 1.88123e-20 ST
505.631 403.754 0.718944 0.563878 0 466.17 410.59 0.602657 0.472672 0 504.257 378.62 0.499068 0.391426 0 ST
766.195 476.159 0.917928 0.719943 3.51654e-12 774.97 466.488 1 0.869671 4.13023e-15 813.261 472.29 1 0.872708 2.48254e-14 ST
532.901 466.224 0.974119 0.764015 9.19738e-23 520.691 449.81 0.953232 0.747633 0 560.515 445.278 1 0.793438 0 ST
580.033 472.131 0.932432 0.731319 8.31047e-12 569.632 462.045 1 0.786291 8.57962e-22 609.139 459.514 1 0.809457 1.63916e-20 ST
0.513726 0.423529 1 C
837.202 343.184 LS
829.055 329.646 LE
0.298039 0.233756 0 C
743.55 318.731 698.175 315.891 739.556 313.23 T
766.195 476.159 0.917928 0.719943 3.51654e-12 729.413 472.293 0.917928 0.719943 3.51654e-12 774.97 466.488 1 0.869671 4.13023e-15 ST
569.632 462.045 1 0.786291 8.57962e-22 532.901 466.224 0.974119 0.764015 9.19738e-23 560.515 445.278 1 0.793438 0 ST
885.553 394.655 1 0.82561 0 843.16 385.952 1 0.813528 0 883.937 371.182 0.86931 0.681811 0 ST
0.298039 0.233756 0 C
698.175 315.891 652.529 314.903 697.707 310.611 T
1 0.0941176 0.690196 C
504.257 378.62 LS
464.308 385.541 LE
874.384 443.554 1 1 1.88123e-20 834.016 435.267 1 1 3.88261e-28 882.261 419.593 1 0.970305 3.30772e-30 ST
813.261 472.29 1 0.872708 2.48254e-14 774.97 466.488 1 0.869671 4.13023e-15 824.669 456.387 1 0.97883 8.44483e-19 ST
882.261 419.593 1 0.970305 3.30772e-30 840.388 410.997 1 0.958273 0 885.553 394.655 1 0.82561 0 ST
653.304 469.092 0.92522 0.725663 5.43232e-12 615.85 469.836 0.926326 0.72653 8.919e-12 650.451 458.693 1 0.83141 2.3606e-19 ST
843.16 385.952 1 0.813528 0 842.063 362.586 0.85502 0.670604 0 883.937 371.182 0.86931 0.681811 0 ST
551.163 350.352 0.441375 0.346176 0 507.306 355.343 0.336364 0.263815 0 556.76 331.39 0.298039 0.233756 0 ST
504.257 378.62 0.499068 0.391426 0 507.306 355.343 0.336364 0.263815 0 551.163 350.352 0.441375 0.346176 0 ST
729.413 472.293 0.917928 0.719943 3.51654e-12 691.472 469.918 0.92522 0.725663 5.43232e-12 734.4 462.224 1 0.860359 1.96062e-16 ST
602.238 328.476 0.302255 0.237063 0 556.76 331.39 0.298039 0.233756 0 607.737 315.793 0.298039 0.233756 0 ST
824.669 456.387 1 0.97883 8.44483e-19 834.016 435.267 1 1 3.88261e-28 874.384 443.554 1 1 1.88123e-20 ST
746.426 331.596 0.505256 0.39628 0 743.55 318.731 0.298039 0.233756 0 787.538 323.354 0.298039 0.233756 0 ST
602.238 328.476 0.302255 0.237063 0 607.737 315.793 0.298039 0.233756 0 652.529 314.903 0.298039 0.233756 0 ST
691.472 469.918 0.92522 0.725663 5.43232e-12 653.304 469.092 0.92522 0.725663 5.43232e-12 692.551 459.604 1 0.844969 3.83084e-18 ST
520.691 449.81 0.953232 0.747633 0 511.294 428.284 0.863554 0.677297 0 553.574 423.473 0.953075 0.74751 0 ST
729.413 472.293 0.917928 0.719943 3.51654e-12 734.4 462.224 1 0.860359 1.96062e-16 774.97 466.488 1 0.869671 4.13023e-15 ST
615.85 469.836 0.926326 0.72653 8.919e-12 609.139 459.514 1 0.809457 1.63916e-20 650.451 458.693 1 0.83141 2.3606e-19 ST
793.125 336.504 0.544011 0.426675 0 746.426 331.596 0.505256 0.39628 0 787.538 323.354 0.298039 0.233756 0 ST
842.063 362.586 0.85502 0.670604 0 796.342 355.657 0.82824 0.6496 0 837.202 343.184 0.566008 0.443928 0 ST
840.388 410.997 1 0.958273 0 843.16 385.952 1 0.813528 0 885.553 394.655 1 0.82561 0 ST
560.515 445.278 1 0.793438 0 520.691 449.81 0.953232 0.747633 0 553.574 423.473 0.953075 0.74751 0 ST
796.342 355.657 0.82824 0.6496 0 793.125 336.504 0.544011 0.426675 0 837.202 343.184 0.566008 0.443928 0 ST
505.631 403.754 0.718944 0.563878 0 504.257 378.62 0.499068 0.391426 0 548.657 373.567 0.609629 0.47814 0 ST
834.016 435.267 1 1 3.88261e-28 840.388 410.997 1 0.958273 0 882.261 419.593 1 0.970305 3.30772e-30 ST
551.163 350.352 0.441375 0.346176 0 556.76 331.39 0.298039 0.233756 0 602.238 328.476 0.302255 0.237063 0 ST
0.513726 0.423529 1 C
813.261 472.29 LS
824.669 456.387 LE
511.294 428.284 0.863554 0.677297 0 505.631 403.754 0.718944 0.563878 0 549.488 398.763 0.821043 0.643955 0 ST
698.252 328.581 0.450306 0.353181 0 698.175 315.891 0.298039 0.233756 0 743.55 318.731 0.298039 0.233756 0 ST
649.792 327.532 0.378426 0.296805 0 652.529 314.903 0.298039 0.233756 0 698.175 315.891 0.298039 0.233756 0 ST
774.97 466.488 1 0.869671 4.13023e-15 783.152 450.096 1 0.969665 1.12179e-21 824.669 456.387 1 0.97883 8.44483e-19 ST
609.139 459.514 1 0.809457 1.63916e-20 569.632 462.045 1 0.786291 8.57962e-22 603.351 442.534 1 0.844145 0 ST
0.513726 0.423529 1 C
842.063 362.586 LS
837.202 343.184 LE
691.472 469.918 0.92522 0.725663 5.43232e-12 692.551 459.604 1 0.844969 3.83084e-18 734.4 462.224 1 0.860359 1.96062e-16 ST
653.304 469.092 0.92522 0.725663 5.43232e-12 650.451 458.693 1 0.83141 2.3606e-19 692.551 459.604 1 0.844969 3.83084e-18 ST
569.632 462.045 1 0.786291 8.57962e-22 560.515 445.278 1 0.793438 0 603.351 442.534 1 0.844145 0 ST
548.657 373.567 0.609629 0.47814 0 504.257 378.62 0.499068 0.391426 0 551.163 350.352 0.441375 0.346176 0 ST
649.792 327.532 0.378426 0.296805 0 602.238 328.476 0.302255 0.237063 0 652.529 314.903 0.298039 0.233756 0 ST
824.669 456.387 1 0.97883 8.44483e-19 783.152 450.096 1 0.969665 1.12179e-21 834.016 435.267 1 1 3.88261e-28 ST
774.97 466.488 1 0.869671 4.13023e-15 734.4 462.224 1 0.860359 1.96062e-16 783.152 450.096 1 0.969665 1.12179e-21 ST
1 0.0941176 0.690196 C
885.553 394.655 LS
843.16 385.952 LE
746.426 331.596 0.505256 0.39628 0 698.252 328.581 0.450306 0.353181 0 743.55 318.731 0.298039 0.233756 0 ST
553.574 423.473 0.953075 0.74751 0 511.294 428.284 0.863554 0.677297 0 549.488 398.763 0.821043 0.643955 0 ST
549.488 398.763 0.821043 0.643955 0 505.631 403.754 0.718944 0.563878 0 548.657 373.567 0.609629 0.47814 0 ST
698.252 328.581 0.450306 0.353181 0 649.792 327.532 0.378426 0.296805 0 698.175 315.891 0.298039 0.233756 0 ST
843.16 385.952 1 0.813528 0 796.874 378.938 1 0.793884 0 842.063 362.586 0.85502 0.670604 0 ST
598.336 347.33 0.549718 0.431152 0 551.163 350.352 0.441375 0.346176 0 602.238 328.476 0.302255 0.237063 0 ST
650.451 458.693 1 0.83141 2.3606e-19 609.139 459.514 1 0.809457 1.63916e-20 648.143 441.645 1 0.886623 0 ST
0.513726 0.423529 1 C
824.669 456.387 LS
834.016 435.267 LE
796.874 378.938 1 0.793884 0 796.342 355.657 0.82824 0.6496 0 842.063 362.586 0.85502 0.670604 0 ST
834.016 435.267 1 1 3.88261e-28 789.939 428.587 1 0.993201 6.05192e-36 840.388 410.997 1 0.958273 0 ST
548.657 373.567 0.609629 0.47814 0 551.163 350.352 0.441375 0.346176 0 598.336 347.33 0.549718 0.431152 0 ST
747.901 350.566 0.781755 0.613142 0 746.426 331.596 0.505256 0.39628 0 793.125 336.504 0.544011 0.426675 0 ST
734.4 462.224 1 0.860359 1.96062e-16 692.551 459.604 1 0.844969 3.83084e-18 739.164 445.472 1 0.949193 9.77839e-26 ST
598.336 347.33 0.549718 0.431152 0 602.238 328.476 0.302255 0.237063 0 649.792 327.532 0.378426 0.296805 0 ST
0.513726 0.423529 1 C
843.16 385.952 LS
842.063 362.586 LE
783.152 450.096 1 0.969665 1.12179e-21 789.939 428.587 1 0.993201 6.05192e-36 834.016 435.267 1 1 3.88261e-28 ST
734.4 462.224 1 0.860359 1.96062e-16 739.164 445.472 1 0.949193 9.77839e-26 783.152 450.096 1 0.969665 1.12179e-21 ST
1 0.0941176 0.690196 C
548.657 373.567 LS
504.257 378.62 LE
840.388 410.997 1 0.958273 0 794.667 404.068 1 0.939607 0 843.16 385.952 1 0.813528 0 ST
609.139 459.514 1 0.809457 1.63916e-20 603.351 442.534 1 0.844145 0 648.143 441.645 1 0.886623 0 ST
796.342 355.657 0.82824 0.6496 0 747.901 350.566 0.781755 0.613142 0 793.125 336.504 0.544011 0.426675 0 ST
560.515 445.278 1 0.793438 0 553.574 423.473 0.953075 0.74751 0 599.051 420.559 1 0.813585 0 ST
692.551 459.604 1 0.844969 3.83084e-18 650.451 458.693 1 0.83141 2.3606e-19 693.789 442.632 1 0.919375 9.09931e-32 ST
603.351 442.534 1 0.844145 0 560.515 445.278 1 0.793438 0 599.051 420.559 1 0.813585 0 ST
0.513726 0.423529 1 C
834.016 435.267 LS
840.388 410.997 L
843.16 385.952 LE
794.667 404.068 1 0.939607 0 796.874 378.938 1 0.793884 0 843.16 385.952 1 0.813528 0 ST
783.152 450.096 1 0.969665 1.12179e-21 739.164 445.472 1 0.949193 9.77839e-26 789.939 428.587 1 0.993201 6.05192e-36 ST
789.939 428.587 1 0.993201 6.05192e-36 794.667 404.068 1 0.939607 0 840.388 410.997 1 0.958273 0 ST
697.932 347.438 0.716201 0.561726 0 698.252 328.581 0.450306 0.353181 0 746.426 331.596 0.505256 0.39628 0 ST
647.664 346.351 0.63996 0.501929 0 649.792 327.532 0.378426 0.296805 0 698.252 328.581 0.450306 0.353181 0 ST
549.488 398.763 0.821043 0.643955 0 548.657 373.567 0.609629 0.47814 0 596.415 370.507 0.721207 0.565653 0 ST
692.551 459.604 1 0.844969 3.83084e-18 693.789 442.632 1 0.919375 9.09931e-32 739.164 445.472 1 0.949193 9.77839e-26 ST
650.451 458.693 1 0.83141 2.3606e-19 648.143 441.645 1 0.886623 0 693.789 442.632 1 0.919375 9.09931e-32 ST
553.574 423.473 0.953075 0.74751 0 549.488 398.763 0.821043 0.643955 0 596.661 395.741 0.921103 0.722434 0 ST
596.415 370.507 0.721207 0.565653 0 548.657 373.567 0.609629 0.47814 0 598.336 347.33 0.549718 0.431152 0 ST
647.664 346.351 0.63996 0.501929 0 598.336 347.33 0.549718 0.431152 0 649.792 327.532 0.378426 0.296805 0 ST
747.901 350.566 0.781755 0.613142 0 697.932 347.438 0.716201 0.561726 0 746.426 331.596 0.505256 0.39628 0 ST
599.051 420.559 1 0.813585 0 553.574 423.473 0.953075 0.74751 0 596.661 395.741 0.921103 0.722434 0 ST
796.874 378.938 1 0.793884 0 747.832 373.784 0.961373 0.754018 0 796.342 355.657 0.82824 0.6496 0 ST
697.932 347.438 0.716201 0.561726 0 647.664 346.351 0.63996 0.501929 0 698.252 328.581 0.450306 0.353181 0 ST
596.661 395.741 0.921103 0.722434 0 549.488 398.763 0.821043 0.643955 0 596.415 370.507 0.721207 0.565653 0 ST
747.832 373.784 0.961373 0.754018 0 747.901 350.566 0.781755 0.613142 0 796.342 355.657 0.82824 0.6496 0 ST
648.143 441.645 1 0.886623 0 603.351 442.534 1 0.844145 0 646.606 419.615 1 0.872794 0 ST
596.415 370.507 0.721207 0.565653 0 598.336 347.33 0.549718 0.431152 0 647.664 346.351 0.63996 0.501929 0 ST
739.164 445.472 1 0.949193 9.77839e-26 743.239 423.679 1 0.96407 0 789.939 428.587 1 0.993201 6.05192e-36 ST
1 0.0941176 0.690196 C
843.16 385.952 LS
796.874 378.938 LE
603.351 442.534 1 0.844145 0 599.051 420.559 1 0.813585 0 646.606 419.615 1 0.872794 0 ST
739.164 445.472 1 0.949193 9.77839e-26 693.789 442.632 1 0.919375 9.09931e-32 743.239 423.679 1 0.96407 0 ST
789.939 428.587 1 0.993201 6.05192e-36 743.239 423.679 1 0.96407 0 794.667 404.068 1 0.939607 0 ST
794.667 404.068 1 0.939607 0 746.226 398.977 1 0.904449 0 796.874 378.938 1 0.793884 0 ST
693.789 442.632 1 0.919375 9.09931e-32 648.143 441.645 1 0.886623 0 695.065 420.664 1 0.921266 0 ST
646.353 369.516 0.817709 0.641341 0 596.415 370.507 0.721207 0.565653 0 647.664 346.351 0.63996 0.501929 0 ST
1 0.0941176 0.690196 C
596.415 370.507 LS
548.657 373.567 LE
746.226 398.977 1 0.904449 0 747.832 373.784 0.961373 0.754018 0 796.874 378.938 1 0.793884 0 ST
697.244 370.617 0.896156 0.702868 0 697.932 347.438 0.716201 0.561726 0 747.901 350.566 0.781755 0.613142 0 ST
646.353 369.516 0.817709 0.641341 0 647.664 346.351 0.63996 0.501929 0 697.932 347.438 0.716201 0.561726 0 ST
693.789 442.632 1 0.919375 9.09931e-32 695.065 420.664 1 0.921266 0 743.239 423.679 1 0.96407 0 ST
743.239 423.679 1 0.96407 0 746.226 398.977 1 0.904449 0 794.667 404.068 1 0.939607 0 ST
648.143 441.645 1 0.886623 0 646.606 419.615 1 0.872794 0 695.065 420.664 1 0.921266 0 ST
596.661 395.741 0.921103 0.722434 0 596.415 370.507 0.721207 0.565653 0 646.353 369.516 0.817709 0.641341 0 ST
599.051 420.559 1 0.813585 0 596.661 395.741 0.921103 0.722434 0 645.989 394.761 1 0.795985 0 ST
747.832 373.784 0.961373 0.754018 0 697.244 370.617 0.896156 0.702868 0 747.901 350.566 0.781755 0.613142 0 ST
646.606 419.615 1 0.872794 0 599.051 420.559 1 0.813585 0 645.989 394.761 1 0.795985 0 ST
697.244 370.617 0.896156 0.702868 0 646.353 369.516 0.817709 0.641341 0 697.932 347.438 0.716201 0.561726 0 ST
743.239 423.679 1 0.96407 0 695.065 420.664 1 0.921266 0 746.226 398.977 1 0.904449 0 ST
645.989 394.761 1 0.795985 0 596.661 395.741 0.921103 0.722434 0 646.353 369.516 0.817709 0.641341 0 ST
746.226 398.977 1 0.904449 0 696.256 395.849 1 0.853185 0 747.832 373.784 0.961373 0.754018 0 ST
695.065 420.664 1 0.921266 0 646.606 419.615 1 0.872794 0 696.256 395.849 1 0.853185 0 ST
696.256 395.849 1 0.853185 0 697.244 370.617 0.896156 0.702868 0 747.832 373.784 0.961373 0.754018 0 ST
695.065 420.664 1 0.921266 0 696.256 395.849 1 0.853185 0 746.226 398.977 1 0.904449 0 ST
645.989 394.761 1 0.795985 0 646.353 369.516 0.817709 0.641341 0 697.244 370.617 0.896156 0.702868 0 ST
646.606 419.615 1 0.872794 0 645.989 394.761 1 0.795985 0 696.256 395.849 1 0.853185 0 ST
1 0.0941176 0.690196 C
796.874 378.938 LS
747.832 373.784 LE
696.256 395.849 1 0.853185 0 645.989 394.761 1 0.795985 0 697.244 370.617 0.896156 0.702868 0 ST
1 0.0941176 0.690196 C
646.353 369.516 LS
596.415 370.507 LE
747.832 373.784 LS
697.244 370.617 L
646.353 369.516 LE
grestore
showpage
cleartomark
%%PageTrailer
%%Trailer
end
%%EOF
