%!PS-Adobe-3.0 EPSF-3.0
%%Title: temp.fig
%%Creator: fig2dev Version 3.2.7a
%%CreationDate: 2019-09-29 14:42:46
%%BoundingBox: 10 31 937 221
%%Magnification: 1.0000
%%EndComments
%%BeginProlog
/$F2psDict 200 dict def
$F2psDict begin
$F2psDict /mtrx matrix put
/col-1 {0 setgray} bind def

end

/cp {closepath} bind def
/ef {eofill} bind def
/gr {grestore} bind def
/gs {gsave} bind def
/sa {save} bind def
/rs {restore} bind def
/l {lineto} bind def
/rl {rlineto} bind def
/m {moveto} bind def
/rm {rmoveto} bind def
/n {newpath} bind def
/s {stroke} bind def
/sh {show} bind def
/slc {setlinecap} bind def
/slj {setlinejoin} bind def
/slw {setlinewidth} bind def
/srgb {setrgbcolor} bind def
/rot {rotate} bind def
/sc {scale} bind def
/sd {setdash} bind def
/ff {findfont} bind def
/sf {setfont} bind def
/scf {scalefont} bind def
/sw {stringwidth} bind def
/tr {translate} bind def
/tnt {dup dup currentrgbcolor
  4 -2 roll dup 1 exch sub 3 -1 roll mul add
  4 -2 roll dup 1 exch sub 3 -1 roll mul add
  4 -2 roll dup 1 exch sub 3 -1 roll mul add srgb}
  bind def
/shd {dup dup currentrgbcolor 4 -2 roll mul 4 -2 roll mul
  4 -2 roll mul srgb} bind def
/$F2psBegin {$F2psDict begin /$F2psEnteredState save def} def
/$F2psEnd {$F2psEnteredState restore end} def

/pageheader {
sa
n 0 236 m 0 0 l 937 0 l 937 236 l cp clip
-61.6 277.9 tr
1 -1 sc
$F2psBegin
10 setmiterlimit
0 slj 0 slc
 0.06000 0.06000 sc
} bind def
/pagefooter {
$F2psEnd
restore
} bind def
%%EndProlog
pageheader
%
% Fig objects follow

0 400 translate
1 0.8 scale
0. 0. 0.3 setrgbcolor
 
% here starts figure with depth 50
% Polyline
2 slj
0 slc
250 slw  % 180
n 10783 2797 m 10787 2753 l 10792 2708 l 10797 2664 l 10802 2618 l 10808 2572 l
 10814 2525 l 10820 2478 l 10826 2430 l 10833 2382 l 10841 2333 l
 10849 2283 l 10857 2233 l 10866 2183 l 10876 2132 l 10886 2081 l
 10896 2030 l 10907 1979 l 10919 1928 l 10932 1877 l 10945 1827 l
 10958 1777 l 10972 1727 l 10987 1679 l 11002 1631 l 11018 1584 l
 11035 1538 l 11052 1493 l 11069 1449 l 11087 1407 l 11106 1366 l
 11125 1326 l 11145 1287 l 11165 1251 l 11186 1215 l 11207 1181 l
 11229 1149 l 11252 1118 l 11275 1089 l 11298 1061 l 11323 1035 l
 11348 1010 l 11373 986 l 11403 962 l 11433 939 l 11465 917 l
 11498 897 l 11532 879 l 11567 861 l 11603 846 l 11640 831 l
 11679 818 l 11718 806 l 11758 796 l 11800 786 l 11842 779 l
 11884 772 l 11928 767 l 11972 763 l 12016 761 l 12060 759 l
 12104 759 l 12148 760 l 12192 763 l 12236 766 l 12279 771 l
 12321 776 l 12363 783 l 12404 790 l 12443 798 l 12482 807 l
 12519 817 l 12556 827 l 12591 838 l 12624 849 l 12657 861 l
 12688 874 l 12718 887 l 12746 900 l 12774 914 l 12800 928 l
 12827 944 l 12853 961 l 12878 978 l 12902 996 l 12924 1014 l
 12945 1033 l 12965 1053 l 12984 1073 l 13001 1093 l 13017 1114 l
 13032 1135 l 13045 1157 l 13057 1179 l 13068 1201 l 13077 1224 l
 13085 1246 l 13091 1268 l 13096 1291 l 13100 1313 l 13102 1334 l
 13103 1356 l 13103 1377 l 13101 1397 l 13098 1417 l 13094 1436 l
 13089 1454 l 13083 1472 l 13076 1489 l 13067 1505 l 13058 1521 l
 13048 1535 l 13037 1549 l 13025 1563 l 13013 1575 l 12995 1590 l
 12975 1605 l 12954 1618 l 12931 1630 l 12907 1642 l 12882 1653 l
 12855 1664 l 12826 1674 l 12797 1683 l 12766 1692 l 12734 1700 l
 12702 1709 l 12670 1716 l 12637 1724 l 12604 1731 l 12572 1738 l
 12540 1745 l 12509 1752 l 12479 1759 l 12450 1766 l 12422 1773 l
 12395 1780 l 12369 1787 l 12345 1795 l 12322 1804 l 12300 1813 l
 12281 1821 l 12263 1831 l 12245 1841 l 12229 1852 l 12213 1863 l
 12199 1875 l 12185 1888 l 12172 1902 l 12160 1915 l 12149 1930 l
 12139 1945 l 12130 1960 l 12123 1975 l 12117 1991 l 12111 2007 l
 12107 2022 l 12105 2038 l 12103 2054 l 12103 2069 l 12104 2084 l
 12106 2099 l 12109 2113 l 12113 2126 l 12119 2140 l 12125 2152 l
 12132 2165 l 12141 2176 l 12150 2188 l 12163 2201 l 12178 2215 l
 12195 2227 l 12213 2240 l 12233 2253 l 12254 2265 l 12276 2278 l
 12300 2291 l 12324 2304 l 12348 2317 l 12373 2330 l 12398 2344 l
 12422 2358 l 12446 2372 l 12469 2386 l 12491 2401 l 12511 2416 l
 12530 2432 l 12547 2448 l 12562 2464 l 12576 2482 l 12588 2500 l
 12596 2516 l 12604 2533 l 12610 2551 l 12615 2570 l 12618 2590 l
 12621 2610 l 12622 2631 l 12622 2653 l 12621 2675 l 12619 2698 l
 12615 2721 l 12611 2744 l 12605 2766 l 12598 2789 l 12589 2811 l
 12580 2832 l 12570 2853 l 12559 2872 l 12548 2891 l 12536 2909 l
 12523 2925 l 12509 2940 l 12495 2954 l 12481 2966 l 12466 2978 l
 12450 2988 l 12431 2998 l 12411 3006 l 12390 3014 l 12368 3020 l
 12345 3026 l 12321 3031 l 12296 3036 l 12271 3041 l 12246 3046 l
 12220 3052 l 12194 3058 l 12169 3066 l 12144 3074 l 12121 3085 l
 12098 3096 l 12076 3110 l 12056 3125 l 12037 3142 l 12019 3162 l
 12003 3184 l 11988 3209 l 11975 3238 l 11967 3259 l 11959 3282 l
 11952 3306 l 11945 3332 l 11939 3360 l 11932 3390 l 11926 3421 l
 11921 3454 l 11915 3488 l 11910 3523 l 11904 3559 l 11898 3597 l
 11893 3636 l 11887 3675 l 11881 3714 l 11875 3754 l 11868 3794 l
 11861 3834 l 11854 3874 l 11846 3913 l 11838 3952 l 11830 3989 l
 11820 4026 l 11811 4061 l 11800 4096 l 11789 4128 l 11778 4160 l
 11765 4190 l 11752 4218 l 11738 4245 l 11723 4270 l 11707 4294 l
 11691 4315 l 11674 4335 l 11656 4354 l 11637 4372 l 11616 4388 l
 11595 4403 l 11573 4417 l 11549 4430 l 11525 4441 l 11500 4451 l
 11474 4460 l 11448 4467 l 11421 4473 l 11393 4478 l 11365 4481 l
 11337 4482 l 11308 4483 l 11280 4481 l 11251 4478 l 11223 4474 l
 11195 4468 l 11168 4461 l 11141 4452 l 11115 4442 l 11090 4431 l
 11065 4419 l 11042 4405 l 11019 4390 l 10997 4374 l 10977 4357 l
 10957 4339 l 10938 4319 l 10921 4299 l 10904 4277 l 10890 4257 l
 10877 4235 l 10864 4213 l 10852 4189 l 10841 4164 l 10830 4138 l
 10820 4110 l 10810 4081 l 10802 4051 l 10793 4020 l 10786 3987 l
 10779 3952 l 10772 3917 l 10767 3880 l 10762 3842 l 10757 3802 l
 10753 3762 l 10750 3721 l 10747 3678 l 10745 3635 l 10743 3591 l
 10742 3546 l 10742 3501 l 10742 3455 l 10742 3409 l 10743 3363 l
 10745 3316 l 10747 3269 l 10749 3222 l 10752 3175 l 10755 3128 l
 10758 3081 l 10761 3034 l 10765 2987 l 10769 2940 l 10774 2892 l
 10778 2845 l
 cp s % Polyline
n 6090 2595 m 6087 2593 l 6081 2590 l 6071 2583 l 6055 2574 l 6034 2562 l
 6009 2547 l 5980 2530 l 5948 2512 l 5916 2494 l 5883 2476 l
 5852 2459 l 5821 2443 l 5792 2429 l 5765 2416 l 5739 2405 l
 5715 2395 l 5691 2386 l 5669 2379 l 5647 2372 l 5625 2367 l
 5603 2363 l 5580 2359 l 5557 2356 l 5534 2354 l 5510 2352 l
 5485 2352 l 5460 2352 l 5434 2353 l 5408 2355 l 5381 2358 l
 5353 2362 l 5326 2367 l 5299 2373 l 5272 2380 l 5245 2388 l
 5219 2396 l 5193 2405 l 5168 2415 l 5144 2426 l 5121 2437 l
 5098 2449 l 5076 2462 l 5055 2475 l 5037 2487 l 5019 2500 l
 5002 2513 l 4984 2527 l 4966 2542 l 4949 2559 l 4931 2576 l
 4913 2594 l 4896 2613 l 4878 2633 l 4861 2654 l 4844 2675 l
 4827 2698 l 4810 2721 l 4795 2745 l 4779 2769 l 4764 2794 l
 4750 2819 l 4737 2844 l 4724 2870 l 4712 2896 l 4700 2922 l
 4689 2948 l 4679 2974 l 4669 3001 l 4660 3028 l 4652 3053 l
 4644 3079 l 4637 3106 l 4629 3134 l 4623 3162 l 4616 3192 l
 4610 3222 l 4604 3253 l 4599 3285 l 4594 3318 l 4589 3351 l
 4585 3385 l 4582 3419 l 4579 3454 l 4576 3488 l 4574 3523 l
 4573 3557 l 4572 3591 l 4572 3625 l 4573 3658 l 4573 3691 l
 4575 3723 l 4577 3754 l 4580 3784 l 4583 3814 l 4586 3843 l
 4590 3872 l 4595 3900 l 4600 3928 l 4606 3956 l 4612 3983 l
 4620 4011 l 4627 4038 l 4636 4066 l 4646 4093 l 4656 4121 l
 4667 4148 l 4679 4176 l 4692 4202 l 4706 4229 l 4721 4255 l
 4737 4280 l 4753 4305 l 4770 4329 l 4788 4352 l 4806 4374 l
 4825 4395 l 4845 4415 l 4865 4433 l 4885 4451 l 4906 4467 l
 4927 4482 l 4949 4496 l 4971 4509 l 4994 4521 l 5018 4533 l
 5040 4542 l 5063 4551 l 5088 4559 l 5112 4566 l 5138 4572 l
 5165 4577 l 5192 4581 l 5221 4585 l 5250 4587 l 5280 4588 l
 5310 4588 l 5341 4587 l 5372 4585 l 5403 4581 l 5434 4576 l
 5466 4570 l 5497 4562 l 5527 4553 l 5558 4543 l 5587 4531 l
 5616 4518 l 5644 4504 l 5671 4489 l 5698 4473 l 5723 4455 l
 5747 4437 l 5771 4417 l 5793 4396 l 5814 4374 l 5835 4350 l
 5852 4328 l 5869 4305 l 5886 4280 l 5902 4255 l 5917 4228 l
 5933 4200 l 5947 4170 l 5962 4139 l 5976 4107 l 5989 4074 l
 6003 4040 l 6016 4004 l 6028 3968 l 6040 3930 l 6052 3892 l
 6063 3854 l 6073 3814 l 6083 3775 l 6093 3735 l 6102 3695 l
 6111 3656 l 6119 3616 l 6127 3577 l 6134 3538 l 6141 3499 l
 6147 3462 l 6153 3425 l 6159 3388 l 6164 3353 l 6169 3318 l
 6173 3284 l 6177 3250 l 6181 3217 l 6185 3185 l 6190 3140 l
 6195 3096 l 6199 3053 l 6203 3010 l 6206 2968 l 6210 2927 l
 6213 2886 l 6215 2847 l 6217 2809 l 6219 2772 l 6220 2737 l
 6221 2704 l 6221 2673 l 6221 2645 l 6221 2619 l 6220 2597 l
 6218 2577 l 6217 2559 l 6214 2545 l 6212 2534 l 6209 2526 l
 6205 2520 l 6202 2517 l 6198 2518 l 6193 2520 l 6189 2525 l
 6184 2532 l 6179 2542 l 6174 2554 l 6168 2568 l 6162 2586 l
 6156 2605 l 6150 2627 l 6144 2651 l 6137 2678 l 6131 2706 l
 6125 2737 l 6119 2769 l 6114 2803 l 6108 2838 l 6103 2875 l
 6099 2912 l 6094 2950 l 6091 2989 l 6087 3028 l 6085 3067 l
 6083 3107 l 6081 3147 l 6080 3187 l 6080 3228 l 6080 3261 l
 6081 3295 l 6082 3330 l 6083 3365 l 6085 3401 l 6088 3437 l
 6091 3475 l 6094 3512 l 6098 3551 l 6103 3590 l 6107 3629 l
 6113 3668 l 6119 3708 l 6125 3748 l 6132 3787 l 6139 3826 l
 6147 3865 l 6155 3903 l 6164 3940 l 6173 3976 l 6182 4011 l
 6192 4045 l 6201 4078 l 6211 4110 l 6222 4140 l 6232 4169 l
 6243 4196 l 6254 4222 l 6265 4247 l 6277 4270 l 6288 4292 l
 6300 4313 l 6313 4333 l 6326 4352 l 6340 4371 l 6355 4387 l
 6369 4403 l 6385 4418 l 6400 4431 l 6417 4443 l 6433 4453 l
 6450 4463 l 6467 4471 l 6485 4477 l 6502 4482 l 6520 4486 l
 6538 4488 l 6556 4489 l 6573 4488 l 6591 4486 l 6608 4483 l
 6625 4478 l 6641 4472 l 6657 4465 l 6672 4456 l 6687 4447 l
 6701 4436 l 6715 4424 l 6728 4412 l 6741 4398 l 6753 4383 l
 6765 4368 l 6776 4351 l 6787 4333 l 6798 4314 l 6808 4293 l
 6818 4272 l 6828 4249 l 6837 4224 l 6847 4199 l 6856 4172 l
 6865 4144 l 6873 4114 l 6882 4084 l 6890 4052 l 6898 4020 l
 6906 3987 l 6914 3953 l 6922 3919 l 6929 3884 l 6936 3849 l
 6943 3814 l 6949 3779 l 6956 3744 l 6962 3709 l 6968 3675 l
 6974 3640 l 6980 3606 l 6985 3573 l 6991 3539 l 6997 3506 l
 7003 3473 l 7008 3439 l 7014 3406 l 7020 3372 l 7026 3338 l
 7033 3304 l 7040 3269 l 7047 3234 l 7054 3198 l 7062 3163 l
 7070 3127 l 7078 3091 l 7086 3055 l 7095 3020 l 7105 2985 l
 7114 2950 l 7124 2916 l 7134 2883 l 7145 2850 l 7155 2819 l
 7166 2789 l 7177 2759 l 7189 2732 l 7200 2705 l 7212 2680 l
 7224 2656 l 7236 2634 l 7249 2613 l 7261 2593 l 7274 2575 l
 7288 2558 l 7301 2541 l 7315 2526 l 7330 2512 l 7345 2499 l
 7361 2487 l 7377 2476 l 7394 2467 l 7411 2458 l 7429 2451 l
 7447 2445 l 7465 2440 l 7484 2437 l 7503 2435 l 7521 2435 l
 7540 2436 l 7559 2439 l 7577 2443 l 7595 2448 l 7613 2455 l
 7630 2464 l 7647 2474 l 7663 2485 l 7679 2497 l 7693 2511 l
 7707 2526 l 7721 2542 l 7734 2560 l 7746 2579 l 7757 2599 l
 7768 2620 l 7777 2641 l 7786 2664 l 7794 2688 l 7802 2713 l
 7809 2740 l 7816 2768 l 7823 2797 l 7829 2828 l 7835 2861 l
 7840 2895 l 7844 2929 l 7849 2966 l 7852 3003 l 7855 3041 l
 7858 3080 l 7860 3119 l 7862 3159 l 7863 3200 l 7864 3240 l
 7864 3281 l 7864 3321 l 7863 3361 l 7862 3401 l 7861 3440 l
 7859 3479 l 7857 3517 l 7854 3555 l 7852 3592 l 7849 3628 l
 7845 3663 l 7841 3698 l 7838 3733 l 7832 3774 l 7827 3816 l
 7821 3857 l 7814 3897 l 7807 3938 l 7800 3978 l 7792 4017 l
 7784 4056 l 7776 4095 l 7767 4132 l 7758 4168 l 7750 4202 l
 7741 4235 l 7732 4266 l 7723 4295 l 7714 4322 l 7706 4347 l
 7698 4369 l 7690 4388 l 7683 4405 l 7676 4420 l 7669 4431 l
 7663 4440 l 7657 4447 l 7652 4451 l 7648 4453 l 7643 4452 l
 7639 4448 l 7636 4442 l 7633 4433 l 7631 4422 l 7629 4408 l
 7628 4392 l 7627 4373 l 7627 4351 l 7628 4327 l 7630 4301 l
 7632 4272 l 7635 4242 l 7638 4209 l 7643 4175 l 7648 4139 l
 7654 4102 l 7660 4064 l 7668 4025 l 7676 3986 l 7684 3946 l
 7694 3905 l 7704 3865 l 7714 3824 l 7725 3782 l 7738 3740 l
 7747 3707 l 7757 3674 l 7768 3641 l 7780 3607 l 7792 3572 l
 7804 3536 l 7817 3500 l 7831 3464 l 7845 3426 l 7860 3389 l
 7875 3351 l 7891 3312 l 7908 3274 l 7924 3235 l 7942 3197 l
 7959 3158 l 7977 3120 l 7995 3082 l 8014 3045 l 8032 3009 l
 8050 2973 l 8069 2939 l 8087 2905 l 8106 2873 l 8124 2841 l
 8142 2811 l 8160 2782 l 8178 2755 l 8195 2729 l 8213 2704 l
 8230 2681 l 8247 2658 l 8263 2637 l 8280 2618 l 8298 2598 l
 8315 2579 l 8333 2562 l 8350 2546 l 8368 2530 l 8386 2516 l
 8404 2504 l 8422 2492 l 8439 2482 l 8457 2472 l 8475 2464 l
 8493 2458 l 8510 2452 l 8528 2448 l 8545 2446 l 8561 2444 l
 8578 2444 l 8593 2445 l 8608 2448 l 8623 2452 l 8637 2457 l
 8650 2463 l 8663 2470 l 8675 2478 l 8686 2488 l 8697 2498 l
 8707 2510 l 8716 2522 l 8724 2535 l 8732 2549 l 8739 2564 l
 8745 2580 l 8751 2598 l 8756 2617 l 8761 2637 l 8765 2659 l
 8769 2682 l 8772 2706 l 8774 2731 l 8776 2758 l 8778 2786 l
 8778 2815 l 8779 2846 l 8779 2877 l 8778 2909 l 8777 2943 l
 8775 2976 l 8774 3011 l 8771 3046 l 8769 3081 l 8766 3116 l
 8763 3151 l 8760 3186 l 8757 3221 l 8754 3255 l 8750 3289 l
 8747 3323 l 8743 3356 l 8740 3389 l 8737 3421 l 8733 3453 l
 8730 3485 l 8727 3519 l 8723 3553 l 8720 3587 l 8717 3621 l
 8715 3655 l 8712 3689 l 8710 3724 l 8708 3759 l 8707 3794 l
 8706 3829 l 8705 3863 l 8705 3898 l 8706 3932 l 8707 3965 l
 8709 3998 l 8712 4029 l 8715 4060 l 8719 4090 l 8724 4118 l
 8729 4146 l 8735 4171 l 8742 4196 l 8750 4219 l 8758 4241 l
 8767 4261 l 8777 4280 l 8788 4298 l 8800 4315 l 8812 4330 l
 8825 4343 l 8838 4356 l 8853 4368 l 8869 4380 l 8885 4390 l
 8902 4399 l 8921 4407 l 8940 4414 l 8960 4420 l 8980 4425 l
 9002 4428 l 9024 4431 l 9046 4431 l 9068 4431 l 9091 4429 l
 9114 4426 l 9137 4421 l 9160 4415 l 9182 4408 l 9204 4399 l
 9226 4389 l 9247 4378 l 9268 4366 l 9288 4352 l 9308 4337 l
 9327 4321 l 9345 4304 l 9363 4285 l 9380 4265 l 9395 4246 l
 9409 4226 l 9423 4205 l 9437 4183 l 9451 4159 l 9465 4134 l
 9478 4108 l 9491 4081 l 9504 4052 l 9517 4022 l 9530 3991 l
 9542 3959 l 9554 3925 l 9566 3891 l 9578 3856 l 9590 3820 l
 9601 3783 l 9612 3746 l 9623 3708 l 9633 3670 l 9644 3632 l
 9654 3594 l 9663 3556 l 9672 3518 l 9681 3481 l 9690 3443 l
 9698 3406 l 9706 3370 l 9714 3334 l 9722 3298 l 9729 3263 l
 9736 3228 l 9743 3194 l 9750 3160 l 9758 3119 l 9767 3078 l
 9775 3037 l 9783 2996 l 9791 2955 l 9799 2914 l 9806 2873 l
 9814 2833 l 9821 2793 l 9828 2754 l 9835 2715 l 9842 2678 l
 9848 2641 l 9853 2606 l 9859 2573 l 9863 2542 l 9867 2512 l
 9871 2485 l 9874 2460 l 9876 2438 l 9877 2418 l 9878 2400 l
 9879 2385 l 9878 2372 l 9877 2362 l 9875 2355 l 9873 2350 l
 9870 2348 l 9866 2348 l 9862 2350 l 9857 2355 l 9851 2363 l
 9844 2373 l 9837 2385 l 9830 2401 l 9822 2419 l 9814 2439 l
 9805 2462 l 9796 2487 l 9787 2515 l 9778 2544 l 9769 2576 l
 9760 2610 l 9751 2645 l 9743 2682 l 9735 2720 l 9727 2759 l
 9720 2799 l 9714 2840 l 9708 2881 l 9703 2923 l 9699 2965 l
 9695 3008 l 9693 3051 l 9691 3094 l 9690 3138 l 9690 3174 l
 9690 3211 l 9692 3248 l 9693 3287 l 9696 3325 l 9699 3365 l
 9702 3405 l 9707 3446 l 9712 3487 l 9717 3529 l 9723 3571 l
 9730 3613 l 9737 3655 l 9745 3698 l 9754 3740 l 9763 3782 l
 9772 3823 l 9782 3864 l 9792 3904 l 9803 3943 l 9814 3981 l
 9825 4018 l 9837 4053 l 9848 4088 l 9860 4120 l 9872 4151 l
 9884 4181 l 9896 4209 l 9908 4235 l 9920 4260 l 9933 4283 l
 9945 4304 l 9958 4324 l 9970 4343 l 9985 4363 l 10001 4381 l
 10017 4397 l 10033 4412 l 10050 4424 l 10066 4435 l 10084 4444 l
 10101 4452 l 10119 4457 l 10137 4461 l 10156 4463 l 10174 4464 l
 10193 4464 l 10212 4461 l 10230 4458 l 10248 4453 l 10266 4447 l
 10284 4440 l 10301 4433 l 10318 4424 l 10335 4415 l 10350 4405 l
 10366 4395 l 10381 4384 l 10395 4373 l 10409 4362 l 10422 4351 l
 10435 4340 l 10453 4324 l 10470 4308 l 10486 4291 l 10503 4273 l
 10519 4255 l 10537 4234 l 10554 4212 l 10573 4189 l 10592 4163 l
 10612 4137 l 10632 4109 l 10652 4081 l 10670 4055 l 10687 4031 l
 10701 4010 l 10712 3995 l 10719 3984 l 10723 3978 l
 10725 3975 l s % Polyline
n 9794 1609 m 9786 1618 l 9778 1627 l 9769 1636 l 9760 1644 l 9751 1653 l
 9742 1662 l 9735 1670 l 9729 1678 l 9725 1685 l 9723 1693 l
 9723 1700 l 9724 1709 l 9727 1718 l 9731 1728 l 9736 1738 l
 9741 1749 l 9746 1760 l 9751 1772 l 9756 1783 l 9759 1795 l
 9761 1807 l 9763 1819 l 9764 1833 l 9765 1846 l 9767 1860 l
 9768 1873 l 9771 1884 l 9774 1894 l 9779 1901 l 9785 1907 l
 9793 1911 l 9803 1913 l 9815 1914 l 9829 1913 l 9844 1912 l
 9860 1911 l 9876 1910 l 9891 1909 l 9905 1908 l 9918 1909 l
 9933 1912 l 9948 1916 l 9962 1921 l 9976 1926 l 9988 1930 l
 9998 1933 l 10007 1933 l 10015 1930 l 10021 1926 l 10026 1919 l
 10031 1910 l 10036 1899 l 10041 1887 l 10046 1873 l 10051 1860 l
 10056 1848 l 10060 1836 l 10065 1825 l 10072 1812 l 10079 1801 l
 10087 1789 l 10094 1778 l 10100 1768 l 10104 1759 l 10107 1750 l
 10107 1742 l 10105 1734 l 10101 1724 l 10095 1714 l 10088 1703 l
 10081 1691 l 10074 1679 l 10068 1667 l 10064 1655 l 10062 1645 l
 10060 1634 l 10059 1623 l 10058 1611 l 10058 1599 l 10057 1588 l
 10056 1578 l 10055 1569 l 10052 1561 l 10049 1556 l 10043 1550 l
 10035 1546 l 10024 1544 l 10012 1543 l 9998 1542 l 9984 1541 l
 9970 1540 l 9957 1538 l 9946 1535 l 9935 1532 l 9924 1529 l
 9912 1525 l 9901 1522 l 9890 1519 l 9880 1517 l 9870 1517 l
 9862 1517 l 9855 1520 l 9848 1523 l 9842 1529 l 9836 1537 l
 9830 1546 l 9824 1556 l 9818 1567 l 9813 1578 l 9806 1589 l
 9800 1599 l
 cp s % Polyline
n 1071 1856 m 1072 1853 l 1076 1846 l 1082 1834 l 1091 1816 l 1103 1792 l
 1118 1763 l 1136 1729 l 1156 1692 l 1177 1653 l 1198 1614 l
 1220 1577 l 1241 1541 l 1261 1509 l 1281 1479 l 1300 1452 l
 1317 1429 l 1335 1410 l 1351 1393 l 1367 1379 l 1383 1369 l
 1398 1361 l 1414 1356 l 1429 1353 l 1444 1352 l 1459 1353 l
 1475 1355 l 1490 1360 l 1506 1366 l 1523 1374 l 1540 1384 l
 1557 1395 l 1575 1408 l 1592 1423 l 1610 1439 l 1628 1456 l
 1646 1475 l 1663 1495 l 1681 1516 l 1697 1538 l 1714 1561 l
 1730 1584 l 1745 1607 l 1760 1631 l 1774 1655 l 1787 1679 l
 1800 1703 l 1812 1728 l 1823 1752 l 1834 1776 l 1845 1800 l
 1855 1825 l 1864 1850 l 1873 1876 l 1882 1903 l 1890 1930 l
 1898 1958 l 1906 1986 l 1913 2016 l 1920 2045 l 1927 2076 l
 1933 2107 l 1939 2138 l 1945 2169 l 1950 2201 l 1954 2233 l
 1959 2264 l 1963 2295 l 1966 2326 l 1969 2357 l 1972 2388 l
 1975 2418 l 1977 2447 l 1979 2477 l 1981 2506 l 1983 2536 l
 1984 2562 l 1985 2588 l 1986 2614 l 1987 2642 l 1988 2669 l
 1989 2698 l 1990 2727 l 1990 2757 l 1990 2788 l 1991 2820 l
 1991 2853 l 1991 2886 l 1990 2920 l 1990 2954 l 1989 2989 l
 1989 3025 l 1988 3061 l 1986 3097 l 1985 3134 l 1984 3171 l
 1982 3207 l 1980 3244 l 1979 3281 l 1976 3317 l 1974 3354 l
 1972 3391 l 1969 3428 l 1967 3465 l 1964 3502 l 1961 3539 l
 1958 3578 l 1955 3616 l 1951 3656 l 1947 3696 l 1943 3737 l
 1939 3779 l 1935 3821 l 1930 3864 l 1926 3907 l 1921 3949 l
 1916 3992 l 1910 4034 l 1905 4076 l 1900 4117 l 1894 4156 l
 1889 4194 l 1883 4231 l 1877 4266 l 1872 4298 l 1866 4329 l
 1861 4357 l 1856 4382 l 1851 4405 l 1845 4426 l 1841 4443 l
 1836 4458 l 1831 4470 l 1826 4478 l 1822 4485 l 1818 4488 l
 1814 4488 l 1810 4486 l 1806 4481 l 1802 4473 l 1799 4463 l
 1795 4450 l 1792 4434 l 1789 4416 l 1787 4395 l 1784 4371 l
 1782 4345 l 1780 4316 l 1778 4285 l 1777 4251 l 1776 4215 l
 1776 4176 l 1776 4136 l 1777 4094 l 1778 4050 l 1779 4005 l
 1781 3958 l 1784 3911 l 1787 3862 l 1791 3813 l 1795 3762 l
 1800 3712 l 1805 3661 l 1810 3609 l 1817 3557 l 1824 3504 l
 1831 3451 l 1839 3398 l 1846 3356 l 1853 3314 l 1860 3272 l
 1868 3229 l 1877 3185 l 1885 3141 l 1895 3095 l 1904 3050 l
 1914 3003 l 1925 2956 l 1936 2908 l 1947 2860 l 1959 2812 l
 1971 2763 l 1984 2713 l 1997 2664 l 2010 2614 l 2024 2564 l
 2038 2515 l 2052 2466 l 2067 2417 l 2082 2368 l 2097 2320 l
 2112 2273 l 2127 2226 l 2142 2181 l 2157 2136 l 2172 2093 l
 2188 2051 l 2203 2009 l 2218 1969 l 2233 1931 l 2248 1894 l
 2263 1858 l 2278 1823 l 2292 1790 l 2307 1759 l 2321 1729 l
 2335 1700 l 2350 1672 l 2364 1646 l 2378 1621 l 2392 1596 l
 2407 1573 l 2422 1550 l 2436 1529 l 2451 1509 l 2466 1490 l
 2481 1473 l 2496 1457 l 2511 1442 l 2526 1428 l 2541 1415 l
 2556 1404 l 2572 1394 l 2587 1385 l 2602 1378 l 2617 1372 l
 2632 1368 l 2647 1365 l 2662 1363 l 2677 1363 l 2691 1364 l
 2706 1366 l 2720 1370 l 2733 1375 l 2747 1381 l 2760 1389 l
 2772 1398 l 2785 1408 l 2797 1419 l 2808 1431 l 2819 1444 l
 2830 1459 l 2841 1474 l 2851 1490 l 2860 1508 l 2869 1526 l
 2878 1545 l 2887 1565 l 2895 1586 l 2903 1608 l 2911 1633 l
 2919 1660 l 2927 1688 l 2934 1717 l 2941 1748 l 2948 1780 l
 2955 1813 l 2961 1848 l 2967 1884 l 2973 1921 l 2979 1960 l
 2984 1999 l 2989 2040 l 2994 2081 l 2999 2124 l 3003 2167 l
 3007 2210 l 3011 2254 l 3014 2298 l 3017 2342 l 3020 2387 l
 3023 2431 l 3026 2474 l 3028 2517 l 3030 2560 l 3032 2602 l
 3033 2643 l 3034 2683 l 3036 2722 l 3037 2760 l 3037 2798 l
 3038 2834 l 3038 2869 l 3039 2903 l 3039 2937 l 3039 2969 l
 3039 3007 l 3039 3044 l 3039 3081 l 3039 3116 l 3038 3151 l
 3038 3186 l 3037 3221 l 3036 3255 l 3035 3288 l 3034 3322 l
 3032 3355 l 3031 3388 l 3029 3421 l 3027 3453 l 3025 3485 l
 3023 3517 l 3020 3548 l 3018 3579 l 3015 3609 l 3013 3639 l
 3010 3668 l 3007 3697 l 3004 3726 l 3000 3754 l 2997 3782 l
 2994 3809 l 2990 3837 l 2987 3865 l 2983 3892 l 2980 3920 l
 2974 3959 l 2969 3999 l 2963 4040 l 2957 4081 l 2950 4123 l
 2944 4165 l 2937 4207 l 2930 4248 l 2923 4287 l 2916 4325 l
 2909 4360 l 2902 4392 l 2895 4421 l 2889 4446 l 2883 4466 l
 2877 4482 l 2872 4493 l 2867 4499 l 2862 4500 l 2858 4495 l
 2855 4485 l 2852 4469 l 2850 4457 l 2849 4444 l 2847 4428 l
 2846 4410 l 2845 4390 l 2844 4368 l 2844 4344 l 2843 4317 l
 2843 4289 l 2842 4259 l 2842 4227 l 2843 4193 l 2843 4157 l
 2844 4119 l 2845 4079 l 2846 4038 l 2847 3996 l 2848 3952 l
 2850 3907 l 2852 3861 l 2854 3814 l 2856 3767 l 2859 3719 l
 2861 3670 l 2864 3621 l 2867 3572 l 2871 3522 l 2874 3473 l
 2878 3424 l 2881 3376 l 2885 3327 l 2889 3279 l 2894 3232 l
 2898 3185 l 2903 3138 l 2908 3092 l 2913 3046 l 2918 3000 l
 2923 2955 l 2929 2910 l 2935 2865 l 2941 2819 l 2947 2774 l
 2954 2729 l 2961 2683 l 2969 2638 l 2977 2592 l 2985 2546 l
 2993 2500 l 3002 2455 l 3012 2409 l 3021 2364 l 3032 2319 l
 3042 2274 l 3053 2230 l 3064 2186 l 3075 2144 l 3087 2102 l
 3099 2061 l 3112 2021 l 3124 1982 l 3137 1944 l 3150 1908 l
 3163 1873 l 3177 1839 l 3190 1807 l 3204 1776 l 3218 1746 l
 3232 1718 l 3246 1692 l 3260 1667 l 3275 1643 l 3289 1620 l
 3304 1599 l 3319 1580 l 3334 1561 l 3348 1545 l 3363 1530 l
 3377 1516 l 3392 1504 l 3408 1492 l 3423 1481 l 3439 1471 l
 3455 1462 l 3471 1454 l 3488 1447 l 3505 1442 l 3522 1437 l
 3539 1434 l 3556 1433 l 3573 1432 l 3590 1433 l 3608 1435 l
 3625 1439 l 3642 1444 l 3659 1451 l 3675 1459 l 3692 1468 l
 3708 1479 l 3724 1492 l 3739 1505 l 3754 1521 l 3768 1537 l
 3782 1555 l 3795 1575 l 3808 1596 l 3820 1618 l 3832 1641 l
 3842 1666 l 3853 1692 l 3862 1719 l 3871 1747 l 3879 1777 l
 3886 1808 l 3893 1840 l 3899 1873 l 3904 1908 l 3909 1944 l
 3912 1979 l 3915 2014 l 3918 2051 l 3920 2090 l 3921 2130 l
 3922 2171 l 3923 2213 l 3923 2257 l 3922 2302 l 3922 2348 l
 3920 2396 l 3919 2444 l 3917 2494 l 3915 2545 l 3913 2597 l
 3910 2650 l 3907 2703 l 3904 2758 l 3900 2812 l 3897 2868 l
 3893 2923 l 3890 2979 l 3886 3035 l 3882 3090 l 3878 3146 l
 3874 3201 l 3871 3256 l 3867 3310 l 3863 3363 l 3860 3416 l
 3857 3468 l 3854 3519 l 3851 3568 l 3848 3617 l 3846 3664 l
 3844 3710 l 3843 3755 l 3841 3798 l 3841 3840 l 3840 3880 l
 3840 3919 l 3840 3956 l 3841 3992 l 3842 4027 l 3844 4060 l
 3846 4092 l 3850 4133 l 3855 4171 l 3860 4207 l 3867 4241 l
 3874 4274 l 3883 4304 l 3892 4332 l 3903 4359 l 3914 4384 l
 3926 4407 l 3939 4428 l 3952 4447 l 3966 4465 l 3981 4480 l
 3997 4495 l 4013 4507 l 4029 4518 l 4045 4527 l 4062 4535 l
 4079 4541 l 4097 4546 l 4114 4549 l 4131 4552 l 4148 4553 l
 4165 4553 l 4181 4552 l 4197 4551 l 4213 4548 l 4229 4545 l
 4244 4542 l 4258 4538 l 4272 4533 l 4286 4528 l 4300 4524 l
 4321 4515 l 4342 4505 l 4362 4495 l 4381 4483 l 4400 4471 l
 4419 4457 l 4439 4441 l 4458 4424 l 4478 4405 l 4499 4385 l
 4519 4364 l 4539 4343 l 4558 4323 l 4575 4304 l 4588 4289 l
 4599 4276 l 4606 4268 l 4610 4263 l
 4612 4261 l s % Polyline
n 12975 975 m 12978 974 l 12984 973 l 12994 971 l 13011 967 l 13033 962 l
 13060 956 l 13092 949 l 13128 942 l 13166 934 l 13204 926 l
 13243 918 l 13281 911 l 13317 904 l 13352 899 l 13386 893 l
 13417 889 l 13448 885 l 13476 882 l 13504 879 l 13532 877 l
 13559 876 l 13585 875 l 13613 875 l 13638 875 l 13663 876 l
 13690 877 l 13716 879 l 13744 881 l 13772 884 l 13800 887 l
 13829 891 l 13858 896 l 13888 902 l 13918 909 l 13947 916 l
 13977 924 l 14006 934 l 14034 943 l 14062 954 l 14089 966 l
 14115 978 l 14140 991 l 14164 1004 l 14187 1019 l 14209 1034 l
 14229 1050 l 14249 1066 l 14267 1083 l 14284 1102 l 14301 1121 l
 14316 1141 l 14331 1162 l 14345 1185 l 14358 1209 l 14370 1233 l
 14381 1259 l 14391 1286 l 14400 1313 l 14408 1341 l 14415 1370 l
 14420 1398 l 14424 1427 l 14427 1456 l 14428 1485 l 14428 1513 l
 14427 1540 l 14424 1567 l 14419 1592 l 14414 1617 l 14406 1640 l
 14398 1663 l 14388 1684 l 14378 1703 l 14365 1722 l 14352 1739 l
 14335 1756 l 14317 1772 l 14298 1788 l 14276 1802 l 14253 1815 l
 14228 1828 l 14202 1840 l 14175 1852 l 14146 1863 l 14116 1873 l
 14086 1883 l 14055 1892 l 14024 1901 l 13992 1910 l 13962 1919 l
 13931 1927 l 13902 1936 l 13874 1944 l 13846 1952 l 13820 1961 l
 13796 1969 l 13772 1978 l 13751 1988 l 13730 1998 l 13709 2010 l
 13690 2023 l 13671 2036 l 13654 2051 l 13638 2067 l 13624 2083 l
 13610 2100 l 13598 2118 l 13588 2137 l 13578 2156 l 13571 2175 l
 13564 2194 l 13559 2213 l 13556 2231 l 13553 2249 l 13553 2267 l
 13553 2283 l 13555 2299 l 13557 2314 l 13561 2328 l 13565 2341 l
 13571 2353 l 13580 2368 l 13591 2382 l 13603 2395 l 13617 2408 l
 13632 2420 l 13648 2432 l 13665 2443 l 13683 2455 l 13701 2467 l
 13718 2479 l 13735 2492 l 13750 2505 l 13765 2519 l 13777 2534 l
 13789 2550 l 13798 2568 l 13805 2583 l 13811 2600 l 13815 2618 l
 13819 2637 l 13821 2657 l 13823 2679 l 13823 2701 l 13822 2724 l
 13820 2748 l 13816 2771 l 13811 2795 l 13805 2817 l 13798 2839 l
 13790 2860 l 13781 2880 l 13771 2898 l 13760 2915 l 13748 2930 l
 13736 2944 l 13722 2956 l 13707 2966 l 13691 2975 l 13675 2983 l
 13656 2989 l 13637 2995 l 13617 3001 l 13596 3006 l 13574 3010 l
 13552 3015 l 13529 3019 l 13507 3023 l 13485 3028 l 13463 3033 l
 13442 3039 l 13423 3046 l 13404 3053 l 13386 3062 l 13370 3072 l
 13355 3083 l 13341 3095 l 13330 3107 l 13320 3120 l 13311 3135 l
 13302 3151 l 13294 3168 l 13287 3186 l 13281 3205 l 13276 3225 l
 13272 3246 l 13268 3267 l 13266 3289 l 13265 3311 l 13265 3333 l
 13266 3355 l 13268 3376 l 13271 3397 l 13275 3417 l 13281 3436 l
 13287 3453 l 13294 3470 l 13303 3485 l 13312 3500 l 13322 3512 l
 13333 3524 l 13348 3536 l 13365 3546 l 13383 3556 l 13403 3564 l
 13424 3571 l 13447 3578 l 13471 3584 l 13495 3590 l 13521 3597 l
 13547 3603 l 13573 3610 l 13599 3617 l 13624 3626 l 13648 3635 l
 13671 3646 l 13693 3658 l 13713 3671 l 13732 3686 l 13750 3704 l
 13765 3723 l 13774 3737 l 13783 3751 l 13791 3767 l 13798 3784 l
 13805 3802 l 13811 3820 l 13816 3840 l 13820 3861 l 13823 3883 l
 13825 3905 l 13827 3929 l 13827 3953 l 13826 3977 l 13823 4002 l
 13820 4028 l 13815 4053 l 13808 4079 l 13801 4104 l 13792 4130 l
 13781 4155 l 13770 4179 l 13757 4204 l 13742 4227 l 13726 4250 l
 13709 4272 l 13690 4293 l 13671 4313 l 13649 4332 l 13627 4351 l
 13603 4368 l 13577 4385 l 13550 4400 l 13524 4413 l 13498 4425 l
 13469 4437 l 13440 4448 l 13409 4458 l 13376 4468 l 13342 4477 l
 13307 4486 l 13270 4494 l 13233 4501 l 13194 4508 l 13154 4513 l
 13113 4519 l 13071 4523 l 13029 4527 l 12986 4530 l 12943 4532 l
 12900 4533 l 12857 4534 l 12814 4534 l 12771 4534 l 12729 4532 l
 12687 4530 l 12646 4527 l 12606 4524 l 12567 4520 l 12530 4516 l
 12493 4510 l 12458 4505 l 12424 4498 l 12391 4492 l 12360 4484 l
 12331 4476 l 12302 4468 l 12276 4459 l 12250 4450 l 12219 4437 l
 12191 4424 l 12164 4409 l 12140 4393 l 12118 4375 l 12097 4356 l
 12078 4335 l 12061 4312 l 12045 4287 l 12030 4259 l 12016 4230 l
 12003 4199 l 11992 4165 l 11981 4130 l 11971 4094 l 11962 4057 l
 11955 4020 l 11948 3985 l 11942 3951 l 11937 3920 l 11933 3893 l
 11930 3871 l 11928 3853 l 11926 3840 l 11926 3832 l 11925 3827 l

 11925 3825 l s % Polyline
n 15294 3102 m 15291 3105 l 15285 3113 l 15274 3125 l 15258 3143 l 15238 3167 l
 15213 3193 l 15187 3222 l 15159 3252 l 15131 3280 l 15104 3305 l
 15078 3328 l 15054 3347 l 15032 3363 l 15011 3375 l 14992 3383 l
 14974 3388 l 14957 3390 l 14940 3388 l 14924 3383 l 14907 3376 l
 14891 3365 l 14874 3353 l 14857 3338 l 14840 3321 l 14823 3302 l
 14805 3282 l 14788 3261 l 14770 3240 l 14753 3218 l 14735 3198 l
 14719 3177 l 14702 3159 l 14687 3142 l 14672 3127 l 14657 3115 l
 14644 3106 l 14630 3099 l 14618 3096 l 14606 3096 l 14595 3098 l
 14585 3104 l 14575 3113 l 14565 3125 l 14555 3139 l 14545 3157 l
 14535 3177 l 14525 3199 l 14515 3224 l 14505 3251 l 14496 3280 l
 14486 3310 l 14478 3342 l 14469 3374 l 14460 3408 l 14452 3441 l
 14445 3474 l 14437 3507 l 14430 3540 l 14423 3573 l 14417 3604 l
 14410 3636 l 14404 3664 l 14398 3693 l 14393 3721 l 14387 3750 l
 14380 3778 l 14374 3807 l 14368 3837 l 14362 3866 l 14355 3895 l
 14348 3924 l 14342 3953 l 14335 3982 l 14328 4010 l 14321 4037 l
 14314 4064 l 14307 4089 l 14300 4114 l 14293 4138 l 14286 4160 l
 14279 4182 l 14272 4202 l 14264 4222 l 14257 4240 l 14250 4258 l
 14241 4279 l 14232 4299 l 14222 4318 l 14211 4337 l 14201 4355 l
 14189 4373 l 14177 4389 l 14165 4405 l 14152 4420 l 14139 4434 l
 14125 4447 l 14111 4458 l 14097 4468 l 14084 4477 l 14070 4484 l
 14056 4490 l 14042 4494 l 14029 4498 l 14015 4500 l 14001 4501 l
 13986 4500 l 13970 4498 l 13953 4494 l 13935 4489 l 13916 4481 l
 13894 4472 l 13871 4460 l 13846 4447 l 13819 4431 l 13790 4414 l
 13762 4397 l 13736 4381 l 13713 4366 l 13694 4354 l 13681 4345 l
 13674 4340 l
 13670 4338 l s % Polyline
n 14343 1125 m 14345 1124 l 14351 1122 l 14360 1118 l 14374 1112 l 14393 1105 l
 14415 1096 l 14441 1087 l 14468 1078 l 14496 1069 l 14525 1062 l
 14552 1056 l 14578 1052 l 14603 1050 l 14626 1050 l 14648 1053 l
 14668 1057 l 14687 1064 l 14705 1074 l 14722 1086 l 14739 1101 l
 14755 1118 l 14769 1134 l 14783 1153 l 14798 1173 l 14812 1195 l
 14827 1218 l 14842 1243 l 14857 1269 l 14873 1296 l 14889 1324 l
 14905 1352 l 14922 1381 l 14939 1410 l 14956 1439 l 14973 1467 l
 14991 1495 l 15008 1521 l 15026 1546 l 15044 1570 l 15061 1591 l
 15079 1611 l 15097 1628 l 15114 1644 l 15132 1657 l 15150 1667 l
 15168 1675 l 15186 1680 l 15204 1683 l 15223 1683 l 15243 1681 l
 15263 1676 l 15285 1669 l 15307 1660 l 15330 1648 l 15353 1635 l
 15378 1619 l 15403 1602 l 15430 1584 l 15456 1564 l 15484 1543 l
 15512 1521 l 15540 1499 l 15568 1476 l 15597 1453 l 15626 1431 l
 15655 1408 l 15683 1387 l 15712 1366 l 15740 1346 l 15769 1326 l
 15797 1308 l 15826 1291 l 15854 1276 l 15878 1264 l 15902 1253 l
 15926 1243 l 15951 1233 l 15976 1225 l 16002 1217 l 16028 1210 l
 16054 1205 l 16080 1200 l 16107 1196 l 16134 1193 l 16161 1192 l
 16187 1191 l 16214 1192 l 16240 1194 l 16266 1197 l 16291 1201 l
 16316 1207 l 16340 1214 l 16363 1222 l 16385 1231 l 16406 1242 l
 16426 1253 l 16445 1266 l 16462 1280 l 16479 1295 l 16494 1311 l
 16508 1328 l 16521 1346 l 16533 1366 l 16543 1386 l 16552 1408 l
 16559 1428 l 16565 1449 l 16571 1472 l 16575 1495 l 16579 1520 l
 16582 1546 l 16584 1574 l 16585 1603 l 16586 1633 l 16585 1665 l
 16584 1697 l 16582 1732 l 16580 1767 l 16576 1804 l 16572 1841 l
 16568 1880 l 16562 1920 l 16556 1961 l 16550 2002 l 16543 2044 l
 16535 2087 l 16527 2130 l 16518 2174 l 16510 2218 l 16500 2262 l
 16491 2306 l 16481 2350 l 16472 2394 l 16462 2438 l 16452 2482 l
 16441 2526 l 16431 2569 l 16421 2613 l 16411 2657 l 16400 2701 l
 16390 2745 l 16380 2785 l 16371 2825 l 16361 2865 l 16352 2906 l
 16342 2948 l 16332 2990 l 16321 3033 l 16311 3076 l 16300 3119 l
 16289 3163 l 16278 3207 l 16267 3252 l 16255 3297 l 16243 3342 l
 16231 3388 l 16218 3433 l 16206 3478 l 16193 3523 l 16180 3568 l
 16166 3612 l 16153 3656 l 16139 3699 l 16125 3741 l 16111 3783 l
 16097 3824 l 16083 3863 l 16069 3902 l 16054 3939 l 16040 3975 l
 16025 4010 l 16011 4043 l 15996 4075 l 15981 4106 l 15966 4136 l
 15951 4164 l 15936 4191 l 15921 4216 l 15906 4241 l 15890 4264 l
 15875 4285 l 15856 4310 l 15836 4332 l 15817 4353 l 15796 4373 l
 15776 4392 l 15755 4409 l 15733 4424 l 15711 4438 l 15688 4451 l
 15666 4462 l 15642 4472 l 15619 4481 l 15596 4487 l 15572 4493 l
 15549 4496 l 15525 4499 l 15502 4499 l 15479 4498 l 15457 4496 l
 15435 4492 l 15414 4487 l 15393 4481 l 15373 4473 l 15354 4464 l
 15335 4454 l 15318 4442 l 15301 4430 l 15286 4416 l 15271 4402 l
 15257 4387 l 15244 4370 l 15232 4353 l 15221 4335 l 15212 4316 l
 15202 4295 l 15193 4272 l 15186 4248 l 15180 4223 l 15174 4195 l
 15170 4166 l 15167 4134 l 15165 4100 l 15164 4064 l 15164 4025 l
 15164 3983 l 15166 3938 l 15169 3890 l 15172 3839 l 15177 3786 l
 15182 3731 l 15188 3674 l 15194 3616 l 15201 3558 l 15208 3501 l
 15215 3447 l 15221 3395 l 15228 3348 l 15233 3306 l 15238 3270 l
 15243 3241 l 15246 3219 l 15248 3202 l 15250 3192 l 15251 3186 l
 15251 3184 l s
% here ends figure;
pagefooter
showpage
%%Trailer
%EOF
