%!PS-Adobe-3.0 EPSF-3.0
%%Title:                     fill-angle-120
%%BoundingBox:     35   20   158   80
%%EndComments


1 setlinecap

0 setlinewidth 0.9 setgray
40 60 moveto
66 60 lineto  % A
85 35 lineto  % point120
120 35 lineto  % B
150 40 lineto
144 30 133 28 127 25 curveto
123 24 117 24 112 25 curveto
106 27 98 27 93 25 curveto
88 23 79 22 77 25 curveto
73 27 69 31 65 35 curveto
61 38 61 38 57 40 curveto
51 43 42 50 40 60 curveto

closepath fill

1.2 setlinewidth
1 0.5 0 setrgbcolor
40 60 moveto
66 60 lineto  % A
85 35 lineto  % point120
120 35 lineto  % B
150 40 lineto
stroke

0.7 setlinewidth

120 35 moveto 127 25 lineto stroke
66 60 moveto 57 40 lineto stroke
65 35 moveto 85 35 lineto stroke
85 35 moveto 77 25 lineto stroke
85 35 moveto 93 25 lineto stroke
120 35 moveto 112 25 lineto stroke

gsave
[3 3] 0 setdash
0.8 setlinewidth
0.9 0.4 0.4 setrgbcolor
66 60 moveto 105 65 lineto  % P
85 35 lineto stroke
105 65 moveto 120 35 lineto stroke
grestore

/Helvetica findfont 10 scalefont setfont	
61 64 moveto (A) show
82 40 moveto (B) show
120 38 moveto (C) show
106 67 moveto (P) show

showpage
%%Trailer
%EOF
