$MeshFormat
4.1 0 4
$EndMeshFormat
$Nodes
1 254 1 254
2 0 0 254
1
2
3
4
5
6
7
8
9
10
11
12
13
14
15
16
17
18
19
20
21
22
23
24
25
26
27
28
29
30
31
32
33
34
35
36
37
38
39
40
41
42
43
44
45
46
47
48
49
50
51
52
53
54
55
56
57
58
59
60
61
62
63
64
65
66
67
68
69
70
71
72
73
74
75
76
77
78
79
80
81
82
83
84
85
86
87
88
89
90
91
92
93
94
95
96
97
98
99
100
101
102
103
104
105
106
107
108
109
110
111
112
113
114
115
116
117
118
119
120
121
122
123
124
125
126
127
128
129
130
131
132
133
134
135
136
137
138
139
140
141
142
143
144
145
146
147
148
149
150
151
152
153
154
155
156
157
158
159
160
161
162
163
164
165
166
167
168
169
170
171
172
173
174
175
176
177
178
179
180
181
182
183
184
185
186
187
188
189
190
191
192
193
194
195
196
197
198
199
200
201
202
203
204
205
206
207
208
209
210
211
212
213
214
215
216
217
218
219
220
221
222
223
224
225
226
227
228
229
230
231
232
233
234
235
236
237
238
239
240
241
242
243
244
245
246
247
248
249
250
251
252
253
254
-0.111602 0.0258594 0.559447
0.135423 -0.550582 0.321578
0.0698218 -0.0325617 0.652844
0.246348 0.0909027 0.604539
0.0129545 0.0906508 0.56802
0.102176 0.143022 0.675458
0.191546 -0.0215871 -0.225438
0.206658 0.262744 -0.109604
0.490298 -0.2186 -0.0689858
0.0545404 -0.0616994 -0.309418
0.585107 -0.142254 -0.167873
0.514893 -0.0353358 -0.2528
0.265772 0.112229 -0.229931
0.314127 0.00892463 -0.348429
0.449435 -0.172216 -0.244988
0.433361 -0.0840593 -0.379167
0.276315 -0.100648 -0.485334
0.168552 -0.015637 -0.392029
0.413579 0.0636898 -0.304688
0.0509793 0.197236 -0.154182
0.170707 0.226959 -0.288218
0.343928 0.253892 -0.319674
0.479654 0.195511 -0.204944
0.486633 0.27355 -0.070701
0.515631 0.192141 0.168188
0.401294 0.294484 0.146651
0.440631 0.378158 0.0368111
0.603611 0.31128 0.227733
0.551865 0.380155 0.106378
-0.0288599 -0.619653 0.293139
-0.0718035 -0.528974 0.333334
0.257576 -0.391998 0.592216
0.0471402 -0.663811 0.348347
0.16356 -0.750654 0.324213
0.277688 -0.746014 0.324327
0.539787 -0.419935 0.490356
0.411809 -0.45314 0.593289
0.374878 -0.589125 0.525947
0.23316 -0.678599 0.452999
0.138146 -0.539874 0.461291
0.0252797 -0.284254 0.589192
-0.0618454 0.126976 0.684675
-0.091433 -0.100456 0.481669
-0.210686 -0.140901 0.372527
-0.179318 -0.281545 0.335247
-0.245235 -0.437229 0.260315
-0.191778 -0.405592 0.357662
-0.222184 -0.256571 0.441286
-0.0973136 -0.205941 0.634199
-0.221482 -0.13234 0.589165
-0.212505 0.174355 0.804417
-0.23469 -0.00414124 0.674318
0.0673792 -0.777906 0.278936
-0.0384531 -0.766748 0.356534
-0.140115 -0.642412 0.308537
-0.0276466 -0.489438 0.47961
-0.028375 -0.342529 0.605349
-0.143771 -0.402433 0.553674
-0.140527 -0.0941421 0.662976
-0.135941 0.110962 0.836748
0.00724641 0.0340149 0.843591
0.23819 0.049644 0.714364
0.15404 -0.0240745 0.806212
0.0326286 -0.707498 0.481111
0.25344 -0.54057 0.58604
0.0774414 -0.531009 0.663993
-0.254647 0.0101731 0.814097
0.0237331 -0.222828 0.64475
-0.113805 -0.0746524 0.836951
-0.0692143 -0.245406 0.799943
-0.0062078 -0.396086 0.750249
0.171446 -0.44838 0.713948
0.0474033 -0.128872 0.82779
0.110949 -0.295564 0.788001
0.279161 -0.327886 0.731734
0.214117 -0.165806 0.801221
0.38032 -0.199315 0.737828
0.328728 -0.0413293 0.78097
0.564243 -0.157098 0.610586
0.47074 -0.0702992 0.718301
0.576584 0.0179829 0.611753
0.465449 0.0739202 0.762652
0.400379 0.167044 0.676346
0.396807 0.322627 -0.168401
0.639508 0.315219 0.0712317
0.716644 0.331974 0.339355
0.571805 0.408812 -0.0290685
0.679737 0.371642 -0.0970037
0.775826 0.233532 -0.127547
0.830785 0.166565 -0.0140326
0.797995 0.258078 0.127575
0.738523 0.404003 0.180564
0.775079 0.334368 -0.0358608
0.377444 0.26979 0.302222
0.503191 0.385043 0.327316
0.298706 0.232219 0.613562
0.384873 0.332274 0.491757
0.516122 0.167994 0.66688
0.628113 0.284258 0.506347
0.334125 0.133695 0.768784
0.497863 0.309937 0.616746
0.601398 0.440309 0.451829
0.218166 0.207377 0.432509
0.289011 0.400342 0.0846935
0.290584 0.404919 0.233599
0.0839097 0.265279 0.328926
-0.24476 -0.0435453 0.3438
-0.164019 0.0693905 0.355715
-0.0479559 0.224908 0.37348
0.0621376 0.214617 0.512898
0.208939 0.369746 0.372141
-0.0906642 0.21003 0.568153
-0.190796 0.136703 0.508462
0.146607 0.335322 0.238018
-0.0311047 0.248039 0.0670791
0.0792689 0.400487 0.0922157
0.0354658 0.357014 -0.0471174
-0.170445 0.164933 0.240764
-0.0137695 0.370059 0.23909
-0.153334 0.304405 0.182087
-0.302748 0.103086 0.620533
-0.213345 0.246348 0.697773
0.36909 0.463358 -0.0610926
0.213266 0.458415 -0.0398898
0.261457 0.414098 -0.18884
0.627826 0.333594 -0.157797
0.373411 -0.383513 -0.0486995
0.29241 -0.298869 -0.164262
0.652152 -0.223176 -0.148022
0.392971 -0.623883 0.407272
0.55963 -0.546575 0.359036
0.51017 -0.533143 0.185238
0.544766 -0.421878 0.087485
0.64675 -0.0886103 -0.279785
0.425014 -0.328682 -0.162414
0.765447 -0.355848 -0.0473794
0.796239 -0.303853 -0.187077
0.728861 -0.243986 -0.328491
0.613778 0.222281 -0.241472
0.606254 0.071609 -0.33015
0.798522 -0.0753547 -0.285073
0.748051 0.0179444 -0.406858
0.0975877 0.104585 -0.310678
-0.0585854 0.116695 -0.240773
0.782762 0.151669 -0.2848
-0.0925667 -0.807165 0.239279
-0.079634 -0.771581 0.0976568
-0.0375169 -0.590333 0.087689
0.0374817 -0.704623 0.0542936
0.130254 -0.536431 -0.0239019
0.287306 -0.478545 -0.0578284
0.187424 -0.26055 -0.346716
0.242803 -0.316142 -0.271808
0.304239 -0.413419 -0.18997
0.139538 -0.446508 -0.170047
0.317058 -0.284942 -0.329483
0.382396 -0.552694 0.0514439
0.578788 -0.370424 -0.0771161
0.4472 -0.495725 -0.119288
0.261599 -0.640658 0.0101559
-0.0406735 -0.533695 -0.050511
-0.0212229 -0.506156 -0.178774
0.0782235 -0.363519 -0.319354
0.158816 -0.0800114 -0.446693
-0.170455 -0.51361 0.0702911
-0.103446 -0.548332 -0.0483317
-0.28223 -0.454341 0.152023
-0.295782 -0.435297 -0.00502175
-0.162882 -0.234591 -0.153309
-0.210709 -0.274389 0.235869
-0.251016 -0.282367 0.0626882
-0.296397 -0.317332 -0.104979
-0.255805 -0.493249 -0.129291
-0.207399 -0.400102 -0.197101
-0.0683109 -0.259424 -0.299819
0.0903448 -0.262882 -0.424975
0.651084 -0.510513 0.212443
0.522113 -0.543084 -0.0351276
0.723075 -0.420622 0.0848219
0.483564 -0.646868 0.267478
0.395578 -0.739433 0.164278
0.138142 -0.690828 -0.0814256
0.397595 -0.754778 -0.00840152
0.252914 -0.826752 -0.00190491
0.0335444 -0.843825 0.143857
0.0869984 -0.87711 -0.0082245
-0.155708 -0.55318 -0.191698
-0.0897816 -0.464042 -0.303013
3.61457e-05 -0.142006 -0.419639
-0.0722147 0.00643625 -0.372728
-0.117694 -0.702997 0.130342
-0.254258 -0.611959 0.190564
-0.305514 -0.237556 -0.273278
-0.299012 -0.165529 -0.321841
-0.183976 0.0901144 -0.262928
-0.241013 0.00706683 -0.383462
-0.180623 -0.132848 0.117414
-0.2972 -0.117612 0.237254
-0.210668 -0.198925 -0.419918
-0.274291 -0.552731 0.326876
-0.0831166 0.28243 -0.0963369
-0.273222 -0.00311241 0.207411
-0.188349 0.325683 0.0219152
-0.268623 0.165152 0.100397
-0.278363 -0.148261 -0.0184123
-0.259732 0.01091 0.470733
-0.367164 -0.0344378 0.069072
-0.217353 0.160536 -0.109936
-0.343876 0.119399 -0.0441021
-0.329427 0.00538624 -0.102007
-0.16379 0.241172 -0.215427
-0.347293 0.0808959 -0.211356
-0.329322 -0.125739 -0.160819
-0.434457 -0.0749379 -0.3073
-0.202985 -0.253801 0.604271
-0.386081 0.136673 0.747997
0.437799 -0.403191 0.803598
0.52748 -0.24328 0.81399
0.618204 -0.377997 0.689161
0.695459 -0.20823 0.687733
0.733046 -0.0253493 0.679706
0.746396 0.14874 0.648668
0.227824 -0.934988 0.271834
0.557867 -0.631663 0.538317
0.682235 -0.478356 0.55293
0.773508 -0.305444 0.555329
0.825956 -0.101286 0.55456
0.849094 0.0814796 0.521921
0.836119 0.264639 0.48049
0.877361 0.364445 0.312118
0.205905 -0.977204 0.0517276
0.372509 -0.913918 0.161215
0.402958 -0.840748 0.361617
0.710268 -0.581087 0.397314
0.81813 -0.410675 0.402503
0.886448 -0.208424 0.413242
0.925153 -0.023182 0.378887
0.926771 0.162475 0.338671
0.954482 0.251466 0.160402
0.81991 -0.520704 0.237939
0.909286 -0.325046 0.259893
0.964094 -0.140847 0.225135
0.980763 0.0425377 0.190512
0.990129 0.138952 0.0183707
0.962476 0.218566 -0.160839
0.897444 -0.42887 0.103273
0.966381 -0.247172 0.0708043
0.997834 -0.0603814 0.0260867
0.987773 0.0204772 -0.154547
0.939168 0.103821 -0.327391
0.928483 -0.362124 -0.0823672
0.975556 -0.17872 -0.127866
0.948529 -0.0938969 -0.302451
0.917414 -0.282159 -0.280601
$EndNodes
$Elements
1 506 1 506
2 0 2 506
1 1 59 52
2 50 59 1
3 1 52 206
4 43 1 206
5 1 43 50
6 2 33 34
7 64 33 2
8 2 40 64
9 40 2 39
10 2 34 39
11 3 5 43
12 43 5 3
13 3 5 42
14 6 5 3
15 3 42 61
16 3 73 63
17 61 73 3
18 4 6 3
19 62 4 3
20 63 62 3
21 4 62 100
22 96 6 4
23 83 96 4
24 100 83 4
25 6 110 5
26 112 42 5
27 110 112 5
28 110 6 96
29 7 10 143
30 18 10 7
31 14 18 7
32 13 14 7
33 143 13 7
34 117 124 8
35 20 117 8
36 8 124 125
37 21 20 8
38 125 21 8
39 129 158 9
40 11 129 9
41 15 11 9
42 135 15 9
43 158 135 9
44 164 189 10
45 18 164 10
46 10 189 190
47 190 143 10
48 138 129 11
49 134 138 11
50 12 134 11
51 15 12 11
52 12 15 16
53 140 134 12
54 19 140 12
55 16 19 12
56 19 16 14
57 13 143 21
58 13 21 22
59 19 13 22
60 13 19 14
61 17 18 14
62 16 17 14
63 15 135 156
64 156 16 15
65 16 156 17
66 17 176 164
67 176 17 152
68 156 152 17
69 17 164 18
70 23 140 19
71 22 23 19
72 139 140 23
73 21 125 22
74 20 201 117
75 143 144 20
76 21 143 20
77 211 201 20
78 20 144 211
79 22 84 23
80 84 22 125
81 126 139 23
82 24 126 23
83 84 24 23
84 87 126 24
85 24 84 123
86 27 87 24
87 123 27 24
88 25 85 29
89 28 85 25
90 94 28 25
91 26 94 25
92 29 26 25
93 105 94 26
94 27 104 26
95 29 27 26
96 104 105 26
97 123 104 27
98 29 87 27
99 28 94 95
100 92 85 28
101 86 28 95
102 28 86 92
103 29 85 87
104 30 33 64
105 54 33 30
106 31 55 30
107 64 31 30
108 55 54 30
109 31 64 56
110 200 55 31
111 47 200 31
112 56 47 31
113 37 75 32
114 65 37 32
115 72 65 32
116 75 72 32
117 53 34 33
118 54 53 33
119 34 53 185
120 34 185 223
121 35 39 34
122 223 35 34
123 35 223 233
124 130 39 35
125 233 130 35
126 37 224 36
127 219 37 36
128 219 36 225
129 36 224 225
130 37 219 217
131 217 75 37
132 38 39 130
133 38 37 65
134 224 37 38
135 38 130 224
136 65 39 38
137 65 40 39
138 40 65 66
139 56 64 40
140 66 56 40
141 68 49 41
142 70 49 68
143 71 68 41
144 57 71 41
145 49 57 41
146 60 61 42
147 51 60 42
148 122 51 42
149 42 112 122
150 48 50 43
151 44 48 43
152 206 44 43
153 44 170 45
154 48 44 45
155 198 170 44
156 107 44 206
157 44 107 198
158 45 46 47
159 48 45 47
160 46 45 170
161 46 170 167
162 192 200 46
163 167 192 46
164 200 47 46
165 47 56 58
166 48 47 58
167 48 58 215
168 215 50 48
169 59 49 70
170 50 49 59
171 215 57 49
172 215 49 50
173 121 206 52
174 52 59 67
175 51 122 216
176 67 60 51
177 67 51 216
178 52 67 216
179 216 121 52
180 146 185 53
181 54 146 53
182 146 54 55
183 191 146 55
184 192 191 55
185 200 192 55
186 66 57 56
187 56 57 58
188 57 66 71
189 215 58 57
190 59 70 69
191 67 59 69
192 69 61 60
193 69 60 67
194 69 73 61
195 78 100 62
196 63 78 62
197 76 78 63
198 73 76 63
199 65 72 66
200 72 71 66
201 68 73 70
202 73 68 74
203 68 71 74
204 71 72 74
205 70 73 69
206 75 74 72
207 74 76 73
208 74 75 76
209 77 76 75
210 217 77 75
211 76 77 78
212 77 217 218
213 80 78 77
214 218 80 77
215 78 80 82
216 82 100 78
217 79 221 81
218 80 79 81
219 218 79 80
220 221 79 220
221 79 218 220
222 81 82 80
223 98 82 81
224 222 98 81
225 222 81 221
226 83 100 82
227 98 83 82
228 83 98 101
229 101 96 83
230 125 123 84
231 85 91 93
232 92 91 85
233 88 87 85
234 93 88 85
235 86 95 102
236 99 86 102
237 86 99 229
238 86 229 230
239 230 92 86
240 126 87 88
241 89 88 93
242 89 126 88
243 139 126 89
244 145 139 89
245 245 145 89
246 90 245 89
247 93 90 89
248 90 93 91
249 90 91 239
250 230 91 92
251 245 90 244
252 90 239 244
253 91 230 239
254 94 103 97
255 111 103 94
256 97 95 94
257 94 105 111
258 97 102 95
259 96 97 103
260 96 103 110
261 101 102 97
262 97 96 101
263 99 101 98
264 222 99 98
265 229 99 222
266 101 99 102
267 106 110 103
268 111 106 103
269 104 123 124
270 104 124 116
271 104 116 114
272 105 104 114
273 114 111 105
274 109 110 106
275 111 114 106
276 106 114 119
277 119 109 106
278 109 119 120
279 206 113 108
280 107 206 108
281 202 198 107
282 202 107 108
283 118 202 108
284 118 108 109
285 109 108 113
286 109 113 112
287 120 118 109
288 110 109 112
289 113 122 112
290 122 113 121
291 113 206 121
292 116 119 114
293 119 116 115
294 120 119 115
295 203 120 115
296 117 201 115
297 116 117 115
298 115 201 203
299 117 116 124
300 204 202 118
301 120 204 118
302 203 204 120
303 121 216 122
304 125 124 123
305 127 157 151
306 159 157 127
307 127 128 135
308 154 128 127
309 135 159 127
310 151 154 127
311 156 135 128
312 153 156 128
313 154 153 128
314 136 158 129
315 137 136 129
316 138 137 129
317 130 180 131
318 224 130 131
319 233 180 130
320 234 224 131
321 177 234 131
322 132 177 131
323 180 132 131
324 157 178 132
325 180 157 132
326 133 177 132
327 178 133 132
328 179 177 133
329 158 179 133
330 178 158 133
331 134 140 142
332 142 141 134
333 134 141 138
334 158 159 135
335 136 179 158
336 246 179 136
337 251 246 136
338 137 251 136
339 254 251 137
340 138 254 137
341 141 254 138
342 145 140 139
343 140 145 142
344 253 254 141
345 141 142 250
346 141 250 253
347 145 250 142
348 190 144 143
349 190 195 144
350 195 211 144
351 145 245 250
352 147 185 146
353 191 147 146
354 149 185 147
355 147 148 149
356 148 147 191
357 148 191 165
358 148 165 166
359 148 166 161
360 150 149 148
361 161 150 148
362 149 150 182
363 186 185 149
364 186 149 182
365 150 161 162
366 155 150 162
367 150 151 160
368 182 150 160
369 151 150 155
370 151 155 154
371 157 160 151
372 153 152 156
373 163 152 153
374 155 163 153
375 154 155 153
376 152 163 176
377 155 162 163
378 157 180 181
379 157 181 183
380 183 160 157
381 159 178 157
382 178 159 158
383 184 182 160
384 183 184 160
385 161 166 187
386 187 162 161
387 188 163 162
388 187 188 162
389 163 188 175
390 176 163 175
391 176 189 164
392 165 191 192
393 167 168 165
394 192 167 165
395 173 166 165
396 168 173 165
397 173 187 166
398 167 170 171
399 171 172 168
400 167 171 168
401 172 173 168
402 169 205 213
403 172 205 169
404 169 213 193
405 193 175 169
406 174 172 169
407 175 174 169
408 197 171 170
409 198 197 170
410 171 197 205
411 205 172 171
412 174 173 172
413 174 187 173
414 175 193 199
415 188 187 174
416 175 188 174
417 189 176 175
418 199 189 175
419 240 234 177
420 179 240 177
421 240 179 246
422 181 180 233
423 181 233 232
424 232 183 181
425 182 184 186
426 232 184 183
427 184 232 231
428 231 186 184
429 231 223 185
430 231 185 186
431 190 189 199
432 190 199 196
433 196 195 190
434 194 199 193
435 193 213 214
436 214 194 193
437 196 199 194
438 214 196 194
439 195 212 208
440 211 195 208
441 212 195 196
442 214 212 196
443 197 202 207
444 198 202 197
445 205 197 207
446 208 203 201
447 211 208 201
448 204 207 202
449 209 207 204
450 204 203 208
451 204 208 209
452 210 213 205
453 207 210 205
454 209 210 207
455 212 209 208
456 212 210 209
457 210 212 214
458 213 210 214
459 217 219 218
460 218 219 220
461 219 225 226
462 219 226 220
463 220 226 227
464 220 227 221
465 221 227 228
466 221 228 222
467 222 228 229
468 231 232 223
469 223 232 233
470 224 234 225
471 225 234 235
472 225 235 226
473 226 235 236
474 226 236 227
475 227 236 237
476 227 237 228
477 228 237 238
478 228 238 229
479 229 238 230
480 230 238 239
481 234 240 235
482 235 240 241
483 235 241 236
484 236 241 242
485 236 242 237
486 237 242 243
487 237 243 238
488 238 243 239
489 239 243 244
490 240 246 241
491 241 246 247
492 241 247 242
493 242 247 248
494 242 248 243
495 243 248 244
496 244 248 249
497 244 249 245
498 245 249 250
499 246 251 247
500 247 251 252
501 247 252 248
502 248 252 249
503 249 252 253
504 249 253 250
505 251 254 252
506 252 254 253
$EndElements
