%!PS-Adobe-3.0 EPSF-3.0
%%Title: triangle-square
%%Creator: GL2PS 1.4.3, (C) 1999-2020 C. Geuzaine
%%For: Gmsh
%%CreationDate: Sun Jul 14 22:51:50 2024
%%LanguageLevel: 3
%%DocumentData: Clean7Bit
%%Pages: 1
%%BoundingBox: 200 140 1430 830
%%EndComments
%%BeginProlog
/gl2psdict 64 dict def gl2psdict begin
/tryPS3shading false def % set to false to force subdivision
/rThreshold 0.0666667 def % red component subdivision threshold
/gThreshold 0.05 def % green component subdivision threshold
/bThreshold 0.1 def % blue component subdivision threshold
/BD { bind def } bind def
/C  { setrgbcolor } BD
/G  { 0.082 mul exch 0.6094 mul add exch 0.3086 mul add neg 1.0 add setgray } BD
/W  { setlinewidth } BD
/LC  { setlinecap } BD
/LJ  { setlinejoin } BD
/FC { findfont exch /SH exch def SH scalefont setfont } BD
/SW { dup stringwidth pop } BD
/S  { FC moveto show } BD
/SBC{ FC moveto SW -2 div 0 rmoveto show } BD
/SBR{ FC moveto SW neg 0 rmoveto show } BD
/SCL{ FC moveto 0 SH -2 div rmoveto show } BD
/SCC{ FC moveto SW -2 div SH -2 div rmoveto show } BD
/SCR{ FC moveto SW neg SH -2 div rmoveto show } BD
/STL{ FC moveto 0 SH neg rmoveto show } BD
/STC{ FC moveto SW -2 div SH neg rmoveto show } BD
/STR{ FC moveto SW neg SH neg rmoveto show } BD
/FCT { FC translate 0 0 } BD
/SR  { gsave FCT moveto rotate show grestore } BD
/SBCR{ gsave FCT moveto rotate SW -2 div 0 rmoveto show grestore } BD
/SBRR{ gsave FCT moveto rotate SW neg 0 rmoveto show grestore } BD
/SCLR{ gsave FCT moveto rotate 0 SH -2 div rmoveto show grestore} BD
/SCCR{ gsave FCT moveto rotate SW -2 div SH -2 div rmoveto show grestore} BD
/SCRR{ gsave FCT moveto rotate SW neg SH -2 div rmoveto show grestore} BD
/STLR{ gsave FCT moveto rotate 0 SH neg rmoveto show grestore } BD
/STCR{ gsave FCT moveto rotate SW -2 div SH neg rmoveto show grestore } BD
/STRR{ gsave FCT moveto rotate SW neg SH neg rmoveto show grestore } BD
/P  { newpath 0.0 360.0 arc closepath fill } BD
/R  { newpath moveto lineto lineto lineto closepath fill } BD
/LS { newpath moveto } BD
/L  { lineto } BD
/LE { lineto stroke } BD
/T  { newpath moveto lineto lineto closepath fill } BD
/STshfill {
      /b1 exch def /g1 exch def /r1 exch def /y1 exch def /x1 exch def
      /b2 exch def /g2 exch def /r2 exch def /y2 exch def /x2 exch def
      /b3 exch def /g3 exch def /r3 exch def /y3 exch def /x3 exch def
      gsave << /ShadingType 4 /ColorSpace [/DeviceRGB]
      /DataSource [ 0 x1 y1 r1 g1 b1 0 x2 y2 r2 g2 b2 0 x3 y3 r3 g3 b3 ] >>
      shfill grestore } BD
/Tm { 3 -1 roll 8 -1 roll 13 -1 roll add add 3 div
      3 -1 roll 7 -1 roll 11 -1 roll add add 3 div
      3 -1 roll 6 -1 roll 9 -1 roll add add 3 div C T } BD
/STsplit {
      4 index 15 index add 0.5 mul
      4 index 15 index add 0.5 mul
      4 index 15 index add 0.5 mul
      4 index 15 index add 0.5 mul
      4 index 15 index add 0.5 mul
      5 copy 5 copy 25 15 roll
      9 index 30 index add 0.5 mul
      9 index 30 index add 0.5 mul
      9 index 30 index add 0.5 mul
      9 index 30 index add 0.5 mul
      9 index 30 index add 0.5 mul
      5 copy 5 copy 35 5 roll 25 5 roll 15 5 roll
      4 index 10 index add 0.5 mul
      4 index 10 index add 0.5 mul
      4 index 10 index add 0.5 mul
      4 index 10 index add 0.5 mul
      4 index 10 index add 0.5 mul
      5 copy 5 copy 40 5 roll 25 5 roll 15 5 roll 25 5 roll
      STnoshfill STnoshfill STnoshfill STnoshfill } BD
/STnoshfill {
      2 index 8 index sub abs rThreshold gt
      { STsplit }
      { 1 index 7 index sub abs gThreshold gt
        { STsplit }
        { dup 6 index sub abs bThreshold gt
          { STsplit }
          { 2 index 13 index sub abs rThreshold gt
            { STsplit }
            { 1 index 12 index sub abs gThreshold gt
              { STsplit }
              { dup 11 index sub abs bThreshold gt
                { STsplit }
                { 7 index 13 index sub abs rThreshold gt
                  { STsplit }
                  { 6 index 12 index sub abs gThreshold gt
                    { STsplit }
                    { 5 index 11 index sub abs bThreshold gt
                      { STsplit }
                      { Tm }
                      ifelse }
                    ifelse }
                  ifelse }
                ifelse }
              ifelse }
            ifelse }
          ifelse }
        ifelse }
      ifelse } BD
tryPS3shading
{ /shfill where
  { /ST { STshfill } BD }
  { /ST { STnoshfill } BD }
  ifelse }
{ /ST { STnoshfill } BD }
ifelse
end
%%EndProlog
%%BeginSetup
/DeviceRGB setcolorspace
gl2psdict begin
%%EndSetup
%%Page: 1 1
%%BeginPageSetup
%%EndPageSetup
mark
gsave
1.0 1.0 scale
868.929 781.554 0.603623 1 0.506282 868.929 723.643 0.36027 1 0.749635 811 723.643 0.603623 1 0.506282 ST
0.603623 1 0.506282 C
811 781.554 868.929 781.554 811 723.643 T
868.929 723.643 0.36027 1 0.749635 868.929 665.732 0.230482 1 0.879423 811 665.732 0.603623 1 0.506282 ST
811 723.643 0.603623 1 0.506282 868.929 723.643 0.36027 1 0.749635 811 665.732 0.603623 1 0.506282 ST
868.929 665.732 0.230482 1 0.879423 868.929 607.821 0.165588 1 0.944317 811 607.821 0.603623 1 0.506282 ST
811 665.732 0.603623 1 0.506282 868.929 665.732 0.230482 1 0.879423 811 607.821 0.603623 1 0.506282 ST
868.929 607.821 0.165588 1 0.944317 868.929 549.911 0.112862 1 0.997044 811 549.911 0.603623 1 0.506282 ST
811 607.821 0.603623 1 0.506282 868.929 607.821 0.165588 1 0.944317 811 549.911 0.603623 1 0.506282 ST
868.929 549.911 0.112862 1 0.997044 868.929 492 0.0966382 1 1 811 492 0.603623 1 0.506282 ST
811 549.911 0.603623 1 0.506282 868.929 549.911 0.112862 1 0.997044 811 492 0.603623 1 0.506282 ST
868.929 492 0.0966382 1 1 868.929 434.089 0.112862 1 0.997044 811 434.089 0.603623 1 0.506282 ST
811 492 0.603623 1 0.506282 868.929 492 0.0966382 1 1 811 434.089 0.603623 1 0.506282 ST
868.929 434.089 0.112862 1 0.997044 868.929 376.179 0.145309 1 0.960541 811 376.179 0.603623 1 0.506282 ST
811 434.089 0.603623 1 0.506282 868.929 434.089 0.112862 1 0.997044 811 376.179 0.603623 1 0.506282 ST
868.929 376.179 0.145309 1 0.960541 868.929 318.268 0.230482 1 0.879423 811 318.268 0.603623 1 0.506282 ST
811 376.179 0.603623 1 0.506282 868.929 376.179 0.145309 1 0.960541 811 318.268 0.603623 1 0.506282 ST
868.929 318.268 0.230482 1 0.879423 868.929 260.357 0.36027 1 0.749635 811 260.357 0.603623 1 0.506282 ST
811 318.268 0.603623 1 0.506282 868.929 318.268 0.230482 1 0.879423 811 260.357 0.603623 1 0.506282 ST
868.929 260.357 0.36027 1 0.749635 868.929 202.446 0.603623 1 0.506282 811 202.446 0.603623 1 0.506282 ST
811 260.357 0.603623 1 0.506282 868.929 260.357 0.36027 1 0.749635 811 202.446 0.603623 1 0.506282 ST
926.857 781.554 0.603623 1 0.506282 926.857 723.643 0.246706 1 0.863199 868.929 723.643 0.36027 1 0.749635 ST
868.929 781.554 0.603623 1 0.506282 926.857 781.554 0.603623 1 0.506282 868.929 723.643 0.36027 1 0.749635 ST
926.857 723.643 0.246706 1 0.863199 926.857 665.732 0.0236323 1 1 868.929 665.732 0.230482 1 0.879423 ST
868.929 723.643 0.36027 1 0.749635 926.857 723.643 0.246706 1 0.863199 868.929 665.732 0.230482 1 0.879423 ST
926.857 665.732 0.0236323 1 1 926.857 607.821 0.0236323 0.903758 1 868.929 607.821 0.165588 1 0.944317 ST
868.929 665.732 0.230482 1 0.879423 926.857 665.732 0.0236323 1 1 868.929 607.821 0.165588 1 0.944317 ST
926.857 607.821 0.0236323 0.903758 1 926.857 549.911 0.0236323 0.822641 1 868.929 549.911 0.112862 1 0.997044 ST
868.929 607.821 0.165588 1 0.944317 926.857 607.821 0.0236323 0.903758 1 868.929 549.911 0.112862 1 0.997044 ST
926.857 549.911 0.0236323 0.822641 1 926.857 492 0.0236323 0.806417 1 868.929 492 0.0966382 1 1 ST
868.929 549.911 0.112862 1 0.997044 926.857 549.911 0.0236323 0.822641 1 868.929 492 0.0966382 1 1 ST
926.857 492 0.0236323 0.806417 1 926.857 434.089 0.0236323 0.822641 1 868.929 434.089 0.112862 1 0.997044 ST
868.929 492 0.0966382 1 1 926.857 492 0.0236323 0.806417 1 868.929 434.089 0.112862 1 0.997044 ST
926.857 434.089 0.0236323 0.822641 1 926.857 376.179 0.0236323 0.887535 1 868.929 376.179 0.145309 1 0.960541 ST
868.929 434.089 0.112862 1 0.997044 926.857 434.089 0.0236323 0.822641 1 868.929 376.179 0.145309 1 0.960541 ST
926.857 376.179 0.0236323 0.887535 1 926.857 318.268 0.0236323 1 1 868.929 318.268 0.230482 1 0.879423 ST
868.929 376.179 0.145309 1 0.960541 926.857 376.179 0.0236323 0.887535 1 868.929 318.268 0.230482 1 0.879423 ST
926.857 318.268 0.0236323 1 1 926.857 260.357 0.230482 1 0.879423 868.929 260.357 0.36027 1 0.749635 ST
868.929 318.268 0.230482 1 0.879423 926.857 318.268 0.0236323 1 1 868.929 260.357 0.36027 1 0.749635 ST
926.857 260.357 0.230482 1 0.879423 926.857 202.446 0.603623 1 0.506282 868.929 202.446 0.603623 1 0.506282 ST
868.929 260.357 0.36027 1 0.749635 926.857 260.357 0.230482 1 0.879423 868.929 202.446 0.603623 1 0.506282 ST
984.786 781.554 0.603623 1 0.506282 984.786 723.643 0.181812 1 0.928094 926.857 723.643 0.246706 1 0.863199 ST
926.857 781.554 0.603623 1 0.506282 984.786 781.554 0.603623 1 0.506282 926.857 723.643 0.246706 1 0.863199 ST
984.786 723.643 0.181812 1 0.928094 984.786 665.732 0.0236323 0.919982 1 926.857 665.732 0.0236323 1 1 ST
926.857 723.643 0.246706 1 0.863199 984.786 723.643 0.181812 1 0.928094 926.857 665.732 0.0236323 1 1 ST
984.786 665.732 0.0236323 0.919982 1 984.786 607.821 0.0236323 0.741523 1 926.857 607.821 0.0236323 0.903758 1 ST
926.857 665.732 0.0236323 1 1 984.786 665.732 0.0236323 0.919982 1 926.857 607.821 0.0236323 0.903758 1 ST
984.786 607.821 0.0236323 0.741523 1 984.786 549.911 0.0236323 0.644182 1 926.857 549.911 0.0236323 0.822641 1 ST
926.857 607.821 0.0236323 0.903758 1 984.786 607.821 0.0236323 0.741523 1 926.857 549.911 0.0236323 0.822641 1 ST
984.786 549.911 0.0236323 0.644182 1 984.786 492 0.0236323 0.595511 1 926.857 492 0.0236323 0.806417 1 ST
926.857 549.911 0.0236323 0.822641 1 984.786 549.911 0.0236323 0.644182 1 926.857 492 0.0236323 0.806417 1 ST
984.786 492 0.0236323 0.595511 1 984.786 434.089 0.0236323 0.627958 1 926.857 434.089 0.0236323 0.822641 1 ST
926.857 492 0.0236323 0.806417 1 984.786 492 0.0236323 0.595511 1 926.857 434.089 0.0236323 0.822641 1 ST
984.786 434.089 0.0236323 0.627958 1 984.786 376.179 0.0236323 0.7253 1 926.857 376.179 0.0236323 0.887535 1 ST
926.857 434.089 0.0236323 0.822641 1 984.786 434.089 0.0236323 0.627958 1 926.857 376.179 0.0236323 0.887535 1 ST
984.786 376.179 0.0236323 0.7253 1 984.786 318.268 0.0236323 0.903758 1 926.857 318.268 0.0236323 1 1 ST
926.857 376.179 0.0236323 0.887535 1 984.786 376.179 0.0236323 0.7253 1 926.857 318.268 0.0236323 1 1 ST
984.786 318.268 0.0236323 0.903758 1 984.786 260.357 0.165588 1 0.944317 926.857 260.357 0.230482 1 0.879423 ST
926.857 318.268 0.0236323 1 1 984.786 318.268 0.0236323 0.903758 1 926.857 260.357 0.230482 1 0.879423 ST
984.786 260.357 0.165588 1 0.944317 984.786 202.446 0.603623 1 0.506282 926.857 202.446 0.603623 1 0.506282 ST
926.857 260.357 0.230482 1 0.879423 984.786 260.357 0.165588 1 0.944317 926.857 202.446 0.603623 1 0.506282 ST
1042.71 781.554 0.603623 1 0.506282 1042.71 723.643 0.145309 1 0.960541 984.786 723.643 0.181812 1 0.928094 ST
984.786 781.554 0.603623 1 0.506282 1042.71 781.554 0.603623 1 0.506282 984.786 723.643 0.181812 1 0.928094 ST
1042.71 723.643 0.145309 1 0.960541 1042.71 665.732 0.0236323 0.887535 1 984.786 665.732 0.0236323 0.919982 1 ST
984.786 723.643 0.181812 1 0.928094 1042.71 723.643 0.145309 1 0.960541 984.786 665.732 0.0236323 0.919982 1 ST
1042.71 665.732 0.0236323 0.887535 1 1042.71 607.821 0.0236323 0.692853 1 984.786 607.821 0.0236323 0.741523 1 ST
984.786 665.732 0.0236323 0.919982 1 1042.71 665.732 0.0236323 0.887535 1 984.786 607.821 0.0236323 0.741523 1 ST
1042.71 607.821 0.0236323 0.692853 1 1042.71 549.911 0.0236323 0.579288 1 984.786 549.911 0.0236323 0.644182 1 ST
984.786 607.821 0.0236323 0.741523 1 1042.71 607.821 0.0236323 0.692853 1 984.786 549.911 0.0236323 0.644182 1 ST
1042.71 549.911 0.0236323 0.579288 1 1042.71 492 0.0236323 0.530617 1 984.786 492 0.0236323 0.595511 1 ST
984.786 549.911 0.0236323 0.644182 1 1042.71 549.911 0.0236323 0.579288 1 984.786 492 0.0236323 0.595511 1 ST
1042.71 492 0.0236323 0.530617 1 1042.71 434.089 0.0236323 0.546841 1 984.786 434.089 0.0236323 0.627958 1 ST
984.786 492 0.0236323 0.595511 1 1042.71 492 0.0236323 0.530617 1 984.786 434.089 0.0236323 0.627958 1 ST
1042.71 434.089 0.0236323 0.546841 1 1042.71 376.179 0.0236323 0.660406 1 984.786 376.179 0.0236323 0.7253 1 ST
984.786 434.089 0.0236323 0.627958 1 1042.71 434.089 0.0236323 0.546841 1 984.786 376.179 0.0236323 0.7253 1 ST
1042.71 376.179 0.0236323 0.660406 1 1042.71 318.268 0.0236323 0.855088 1 984.786 318.268 0.0236323 0.903758 1 ST
984.786 376.179 0.0236323 0.7253 1 1042.71 376.179 0.0236323 0.660406 1 984.786 318.268 0.0236323 0.903758 1 ST
1042.71 318.268 0.0236323 0.855088 1 1042.71 260.357 0.129085 1 0.976764 984.786 260.357 0.165588 1 0.944317 ST
984.786 318.268 0.0236323 0.903758 1 1042.71 318.268 0.0236323 0.855088 1 984.786 260.357 0.165588 1 0.944317 ST
1042.71 260.357 0.129085 1 0.976764 1042.71 202.446 0.603623 1 0.506282 984.786 202.446 0.603623 1 0.506282 ST
984.786 260.357 0.165588 1 0.944317 1042.71 260.357 0.129085 1 0.976764 984.786 202.446 0.603623 1 0.506282 ST
1100.64 781.554 0.603623 1 0.506282 1100.64 723.643 0.181812 1 0.928094 1042.71 723.643 0.145309 1 0.960541 ST
1042.71 781.554 0.603623 1 0.506282 1100.64 781.554 0.603623 1 0.506282 1042.71 723.643 0.145309 1 0.960541 ST
1100.64 723.643 0.181812 1 0.928094 1100.64 665.732 0.0236323 0.919982 1 1042.71 665.732 0.0236323 0.887535 1 ST
1042.71 723.643 0.145309 1 0.960541 1100.64 723.643 0.181812 1 0.928094 1042.71 665.732 0.0236323 0.887535 1 ST
1100.64 665.732 0.0236323 0.919982 1 1100.64 607.821 0.0236323 0.741523 1 1042.71 607.821 0.0236323 0.692853 1 ST
1042.71 665.732 0.0236323 0.887535 1 1100.64 665.732 0.0236323 0.919982 1 1042.71 607.821 0.0236323 0.692853 1 ST
1100.64 607.821 0.0236323 0.741523 1 1100.64 549.911 0.0236323 0.627958 1 1042.71 549.911 0.0236323 0.579288 1 ST
1042.71 607.821 0.0236323 0.692853 1 1100.64 607.821 0.0236323 0.741523 1 1042.71 549.911 0.0236323 0.579288 1 ST
1100.64 549.911 0.0236323 0.627958 1 1100.64 492 0.0236323 0.579288 1 1042.71 492 0.0236323 0.530617 1 ST
1042.71 549.911 0.0236323 0.579288 1 1100.64 549.911 0.0236323 0.627958 1 1042.71 492 0.0236323 0.530617 1 ST
1100.64 492 0.0236323 0.579288 1 1100.64 434.089 0.0236323 0.579288 1 1042.71 434.089 0.0236323 0.546841 1 ST
1042.71 492 0.0236323 0.530617 1 1100.64 492 0.0236323 0.579288 1 1042.71 434.089 0.0236323 0.546841 1 ST
1100.64 434.089 0.0236323 0.579288 1 1100.64 376.179 0.0236323 0.676629 1 1042.71 376.179 0.0236323 0.660406 1 ST
1042.71 434.089 0.0236323 0.546841 1 1100.64 434.089 0.0236323 0.579288 1 1042.71 376.179 0.0236323 0.660406 1 ST
1100.64 376.179 0.0236323 0.676629 1 1100.64 318.268 0.0236323 0.855088 1 1042.71 318.268 0.0236323 0.855088 1 ST
1042.71 376.179 0.0236323 0.660406 1 1100.64 376.179 0.0236323 0.676629 1 1042.71 318.268 0.0236323 0.855088 1 ST
1100.64 318.268 0.0236323 0.855088 1 1100.64 260.357 0.129085 1 0.976764 1042.71 260.357 0.129085 1 0.976764 ST
1042.71 318.268 0.0236323 0.855088 1 1100.64 318.268 0.0236323 0.855088 1 1042.71 260.357 0.129085 1 0.976764 ST
1100.64 260.357 0.129085 1 0.976764 1100.64 202.446 0.603623 1 0.506282 1042.71 202.446 0.603623 1 0.506282 ST
1042.71 260.357 0.129085 1 0.976764 1100.64 260.357 0.129085 1 0.976764 1042.71 202.446 0.603623 1 0.506282 ST
1158.57 781.554 0.603623 1 0.506282 1158.57 723.643 0.246706 1 0.863199 1100.64 723.643 0.181812 1 0.928094 ST
1100.64 781.554 0.603623 1 0.506282 1158.57 781.554 0.603623 1 0.506282 1100.64 723.643 0.181812 1 0.928094 ST
1158.57 723.643 0.246706 1 0.863199 1158.57 665.732 0.0317441 1 1 1100.64 665.732 0.0236323 0.919982 1 ST
1100.64 723.643 0.181812 1 0.928094 1158.57 723.643 0.246706 1 0.863199 1100.64 665.732 0.0236323 0.919982 1 ST
1158.57 665.732 0.0317441 1 1 1158.57 607.821 0.0236323 0.903758 1 1100.64 607.821 0.0236323 0.741523 1 ST
1100.64 665.732 0.0236323 0.919982 1 1158.57 665.732 0.0317441 1 1 1100.64 607.821 0.0236323 0.741523 1 ST
1158.57 607.821 0.0236323 0.903758 1 1158.57 549.911 0.0236323 0.806417 1 1100.64 549.911 0.0236323 0.627958 1 ST
1100.64 607.821 0.0236323 0.741523 1 1158.57 607.821 0.0236323 0.903758 1 1100.64 549.911 0.0236323 0.627958 1 ST
1158.57 549.911 0.0236323 0.806417 1 1158.57 492 0.0236323 0.741523 1 1100.64 492 0.0236323 0.579288 1 ST
1100.64 549.911 0.0236323 0.627958 1 1158.57 549.911 0.0236323 0.806417 1 1100.64 492 0.0236323 0.579288 1 ST
1158.57 492 0.0236323 0.741523 1 1158.57 434.089 0.0236323 0.7253 1 1100.64 434.089 0.0236323 0.579288 1 ST
1100.64 492 0.0236323 0.579288 1 1158.57 492 0.0236323 0.741523 1 1100.64 434.089 0.0236323 0.579288 1 ST
1158.57 434.089 0.0236323 0.7253 1 1158.57 376.179 0.0236323 0.77397 1 1100.64 376.179 0.0236323 0.676629 1 ST
1100.64 434.089 0.0236323 0.579288 1 1158.57 434.089 0.0236323 0.7253 1 1100.64 376.179 0.0236323 0.676629 1 ST
1158.57 376.179 0.0236323 0.77397 1 1158.57 318.268 0.0236323 0.936205 1 1100.64 318.268 0.0236323 0.855088 1 ST
1100.64 376.179 0.0236323 0.676629 1 1158.57 376.179 0.0236323 0.77397 1 1100.64 318.268 0.0236323 0.855088 1 ST
1158.57 318.268 0.0236323 0.936205 1 1158.57 260.357 0.165588 1 0.944317 1100.64 260.357 0.129085 1 0.976764 ST
1100.64 318.268 0.0236323 0.855088 1 1158.57 318.268 0.0236323 0.936205 1 1100.64 260.357 0.129085 1 0.976764 ST
1158.57 260.357 0.165588 1 0.944317 1158.57 202.446 0.603623 1 0.506282 1100.64 202.446 0.603623 1 0.506282 ST
1100.64 260.357 0.129085 1 0.976764 1158.57 260.357 0.165588 1 0.944317 1100.64 202.446 0.603623 1 0.506282 ST
1216.5 781.554 0.603623 1 0.506282 1216.5 723.643 0.392717 1 0.717188 1158.57 723.643 0.246706 1 0.863199 ST
1158.57 781.554 0.603623 1 0.506282 1216.5 781.554 0.603623 1 0.506282 1158.57 723.643 0.246706 1 0.863199 ST
1216.5 723.643 0.392717 1 0.717188 1216.5 665.732 0.279153 1 0.830752 1158.57 665.732 0.0317441 1 1 ST
1158.57 723.643 0.246706 1 0.863199 1216.5 723.643 0.392717 1 0.717188 1158.57 665.732 0.0317441 1 1 ST
1216.5 665.732 0.279153 1 0.830752 1216.5 607.821 0.181812 1 0.928094 1158.57 607.821 0.0236323 0.903758 1 ST
1158.57 665.732 0.0317441 1 1 1216.5 665.732 0.279153 1 0.830752 1158.57 607.821 0.0236323 0.903758 1 ST
1216.5 607.821 0.181812 1 0.928094 1216.5 549.911 0.0804146 1 1 1158.57 549.911 0.0236323 0.806417 1 ST
1158.57 607.821 0.0236323 0.903758 1 1216.5 607.821 0.181812 1 0.928094 1158.57 549.911 0.0236323 0.806417 1 ST
1216.5 549.911 0.0804146 1 1 1216.5 492 0.0236323 1 1 1158.57 492 0.0236323 0.741523 1 ST
1158.57 549.911 0.0236323 0.806417 1 1216.5 549.911 0.0804146 1 1 1158.57 492 0.0236323 0.741523 1 ST
1216.5 492 0.0236323 1 1 1216.5 434.089 0.0236323 0.968652 1 1158.57 434.089 0.0236323 0.7253 1 ST
1158.57 492 0.0236323 0.741523 1 1216.5 492 0.0236323 1 1 1158.57 434.089 0.0236323 0.7253 1 ST
1216.5 434.089 0.0236323 0.968652 1 1216.5 376.179 0.0236323 0.968652 1 1158.57 376.179 0.0236323 0.77397 1 ST
1158.57 434.089 0.0236323 0.7253 1 1216.5 434.089 0.0236323 0.968652 1 1158.57 376.179 0.0236323 0.77397 1 ST
1216.5 376.179 0.0236323 0.968652 1 1216.5 318.268 0.0317441 1 1 1158.57 318.268 0.0236323 0.936205 1 ST
1158.57 376.179 0.0236323 0.77397 1 1216.5 376.179 0.0236323 0.968652 1 1158.57 318.268 0.0236323 0.936205 1 ST
1216.5 318.268 0.0317441 1 1 1216.5 260.357 0.230482 1 0.879423 1158.57 260.357 0.165588 1 0.944317 ST
1158.57 318.268 0.0236323 0.936205 1 1216.5 318.268 0.0317441 1 1 1158.57 260.357 0.165588 1 0.944317 ST
1216.5 260.357 0.230482 1 0.879423 1216.5 202.446 0.603623 1 0.506282 1158.57 202.446 0.603623 1 0.506282 ST
1158.57 260.357 0.165588 1 0.944317 1216.5 260.357 0.230482 1 0.879423 1158.57 202.446 0.603623 1 0.506282 ST
1274.43 781.554 0.603623 1 0.506282 1274.43 723.643 0.652294 1 0.457612 1216.5 723.643 0.392717 1 0.717188 ST
1216.5 781.554 0.603623 1 0.506282 1274.43 781.554 0.603623 1 0.506282 1216.5 723.643 0.392717 1 0.717188 ST
1274.43 723.643 0.652294 1 0.457612 1274.43 665.732 0.717188 1 0.392717 1216.5 665.732 0.279153 1 0.830752 ST
1216.5 723.643 0.392717 1 0.717188 1274.43 723.643 0.652294 1 0.457612 1216.5 665.732 0.279153 1 0.830752 ST
1274.43 665.732 0.717188 1 0.392717 1274.43 607.821 0.700964 1 0.408941 1216.5 607.821 0.181812 1 0.928094 ST
1216.5 665.732 0.279153 1 0.830752 1274.43 665.732 0.717188 1 0.392717 1216.5 607.821 0.181812 1 0.928094 ST
1274.43 607.821 0.700964 1 0.408941 1274.43 549.911 0.5874 1 0.522506 1216.5 549.911 0.0804146 1 1 ST
1216.5 607.821 0.181812 1 0.928094 1274.43 607.821 0.700964 1 0.408941 1216.5 549.911 0.0804146 1 1 ST
1274.43 549.911 0.5874 1 0.522506 1274.43 492 0.457612 1 0.652294 1216.5 492 0.0236323 1 1 ST
1216.5 549.911 0.0804146 1 1 1274.43 549.911 0.5874 1 0.522506 1216.5 492 0.0236323 1 1 ST
1274.43 492 0.457612 1 0.652294 1274.43 434.089 0.3116 1 0.798305 1216.5 434.089 0.0236323 0.968652 1 ST
1216.5 492 0.0236323 1 1 1274.43 492 0.457612 1 0.652294 1216.5 434.089 0.0236323 0.968652 1 ST
1274.43 434.089 0.3116 1 0.798305 1274.43 376.179 0.230482 1 0.879423 1216.5 376.179 0.0236323 0.968652 1 ST
1216.5 434.089 0.0236323 0.968652 1 1274.43 434.089 0.3116 1 0.798305 1216.5 376.179 0.0236323 0.968652 1 ST
1274.43 376.179 0.230482 1 0.879423 1274.43 318.268 0.230482 1 0.879423 1216.5 318.268 0.0317441 1 1 ST
1216.5 376.179 0.0236323 0.968652 1 1274.43 376.179 0.230482 1 0.879423 1216.5 318.268 0.0317441 1 1 ST
1274.43 318.268 0.230482 1 0.879423 1274.43 260.357 0.327823 1 0.782082 1216.5 260.357 0.230482 1 0.879423 ST
1216.5 318.268 0.0317441 1 1 1274.43 318.268 0.230482 1 0.879423 1216.5 260.357 0.230482 1 0.879423 ST
1274.43 260.357 0.327823 1 0.782082 1274.43 202.446 0.603623 1 0.506282 1216.5 202.446 0.603623 1 0.506282 ST
1216.5 260.357 0.230482 1 0.879423 1274.43 260.357 0.327823 1 0.782082 1216.5 202.446 0.603623 1 0.506282 ST
1332.36 781.554 0.603623 1 0.506282 1332.36 723.643 1 1 0.0236323 1274.43 723.643 0.652294 1 0.457612 ST
1274.43 781.554 0.603623 1 0.506282 1332.36 781.554 0.603623 1 0.506282 1274.43 723.643 0.652294 1 0.457612 ST
1332.36 723.643 1 1 0.0236323 1332.36 665.732 1 0.676629 0.0236323 1274.43 665.732 0.717188 1 0.392717 ST
1274.43 723.643 0.652294 1 0.457612 1332.36 723.643 1 1 0.0236323 1274.43 665.732 0.717188 1 0.392717 ST
1332.36 665.732 1 0.676629 0.0236323 1332.36 607.821 1 0.676629 0.0236323 1274.43 607.821 0.700964 1 0.408941 ST
1274.43 665.732 0.717188 1 0.392717 1332.36 665.732 1 0.676629 0.0236323 1274.43 607.821 0.700964 1 0.408941 ST
1332.36 607.821 1 0.676629 0.0236323 1332.36 549.911 1 0.838864 0.0236323 1274.43 549.911 0.5874 1 0.522506 ST
1274.43 607.821 0.700964 1 0.408941 1332.36 607.821 1 0.676629 0.0236323 1274.43 549.911 0.5874 1 0.522506 ST
1332.36 549.911 1 0.838864 0.0236323 1332.36 492 1 1 0.0357999 1274.43 492 0.457612 1 0.652294 ST
1274.43 549.911 0.5874 1 0.522506 1332.36 549.911 1 0.838864 0.0236323 1274.43 492 0.457612 1 0.652294 ST
1332.36 492 1 1 0.0357999 1332.36 434.089 0.830752 1 0.279153 1274.43 434.089 0.3116 1 0.798305 ST
1274.43 492 0.457612 1 0.652294 1332.36 492 1 1 0.0357999 1274.43 434.089 0.3116 1 0.798305 ST
1332.36 434.089 0.830752 1 0.279153 1332.36 376.179 0.619847 1 0.490059 1274.43 376.179 0.230482 1 0.879423 ST
1274.43 434.089 0.3116 1 0.798305 1332.36 434.089 0.830752 1 0.279153 1274.43 376.179 0.230482 1 0.879423 ST
1332.36 376.179 0.619847 1 0.490059 1332.36 318.268 0.490059 1 0.619847 1274.43 318.268 0.230482 1 0.879423 ST
1274.43 376.179 0.230482 1 0.879423 1332.36 376.179 0.619847 1 0.490059 1274.43 318.268 0.230482 1 0.879423 ST
1332.36 318.268 0.490059 1 0.619847 1332.36 260.357 0.473835 1 0.63607 1274.43 260.357 0.327823 1 0.782082 ST
1274.43 318.268 0.230482 1 0.879423 1332.36 318.268 0.490059 1 0.619847 1274.43 260.357 0.327823 1 0.782082 ST
1332.36 260.357 0.473835 1 0.63607 1332.36 202.446 0.603623 1 0.506282 1274.43 202.446 0.603623 1 0.506282 ST
1274.43 260.357 0.327823 1 0.782082 1332.36 260.357 0.473835 1 0.63607 1274.43 202.446 0.603623 1 0.506282 ST
1390.29 781.554 0.603623 1 0.506282 1390.29 723.643 0.798305 0.0236323 0.0236323 1332.36 723.643 1 1 0.0236323 ST
1332.36 781.554 0.603623 1 0.506282 1390.29 781.554 0.603623 1 0.506282 1332.36 723.643 1 1 0.0236323 ST
1390.29 723.643 0.798305 0.0236323 0.0236323 1390.29 665.732 0.506282 0.0236323 0.0236323 1332.36 665.732 1 0.676629 0.0236323 ST
1332.36 723.643 1 1 0.0236323 1390.29 723.643 0.798305 0.0236323 0.0236323 1332.36 665.732 1 0.676629 0.0236323 ST
1390.29 665.732 0.506282 0.0236323 0.0236323 1390.29 607.821 0.603623 0.0236323 0.0236323 1332.36 607.821 1 0.676629 0.0236323 ST
1332.36 665.732 1 0.676629 0.0236323 1390.29 665.732 0.506282 0.0236323 0.0236323 1332.36 607.821 1 0.676629 0.0236323 ST
1390.29 607.821 0.603623 0.0236323 0.0236323 1390.29 549.911 0.91187 0.0236323 0.0236323 1332.36 549.911 1 0.838864 0.0236323 ST
1332.36 607.821 1 0.676629 0.0236323 1390.29 607.821 0.603623 0.0236323 0.0236323 1332.36 549.911 1 0.838864 0.0236323 ST
1390.29 549.911 0.91187 0.0236323 0.0236323 1390.29 492 1 0.254817 0.0236323 1332.36 492 1 1 0.0357999 ST
1332.36 549.911 1 0.838864 0.0236323 1390.29 549.911 0.91187 0.0236323 0.0236323 1332.36 492 1 1 0.0357999 ST
1390.29 492 1 0.254817 0.0236323 1390.29 434.089 1 0.660406 0.0236323 1332.36 434.089 0.830752 1 0.279153 ST
1332.36 492 1 1 0.0357999 1390.29 492 1 0.254817 0.0236323 1332.36 434.089 0.830752 1 0.279153 ST
1390.29 434.089 1 0.660406 0.0236323 1390.29 376.179 1 1 0.0236323 1332.36 376.179 0.619847 1 0.490059 ST
1332.36 434.089 0.830752 1 0.279153 1390.29 434.089 1 0.660406 0.0236323 1332.36 376.179 0.619847 1 0.490059 ST
1390.29 376.179 1 1 0.0236323 1390.29 318.268 0.814529 1 0.295376 1332.36 318.268 0.490059 1 0.619847 ST
1332.36 376.179 0.619847 1 0.490059 1390.29 376.179 1 1 0.0236323 1332.36 318.268 0.490059 1 0.619847 ST
1390.29 318.268 0.814529 1 0.295376 1390.29 260.357 0.63607 1 0.473835 1332.36 260.357 0.473835 1 0.63607 ST
1332.36 318.268 0.490059 1 0.619847 1390.29 318.268 0.814529 1 0.295376 1332.36 260.357 0.473835 1 0.63607 ST
1390.29 260.357 0.63607 1 0.473835 1390.29 202.446 0.603623 1 0.506282 1332.36 202.446 0.603623 1 0.506282 ST
1332.36 260.357 0.473835 1 0.63607 1390.29 260.357 0.63607 1 0.473835 1332.36 202.446 0.603623 1 0.506282 ST
289.643 781.554 0.603623 1 0.506282 289.643 723.643 0.0479676 1 1 231.714 723.643 0.0236323 0.0236323 0.879423 ST
231.714 781.554 0.603623 1 0.506282 289.643 781.554 0.603623 1 0.506282 231.714 723.643 0.0236323 0.0236323 0.879423 ST
289.643 723.643 0.0479676 1 1 289.643 665.732 0.0236323 0.757747 1 231.714 665.732 0.0236323 0.0236323 0.603623 ST
231.714 723.643 0.0236323 0.0236323 0.879423 289.643 723.643 0.0479676 1 1 231.714 665.732 0.0236323 0.0236323 0.603623 ST
289.643 665.732 0.0236323 0.757747 1 289.643 607.821 0.0236323 0.757747 1 231.714 607.821 0.0236323 0.0236323 0.684741 ST
231.714 665.732 0.0236323 0.0236323 0.603623 289.643 665.732 0.0236323 0.757747 1 231.714 607.821 0.0236323 0.0236323 0.684741 ST
289.643 607.821 0.0236323 0.757747 1 289.643 549.911 0.0236323 0.919982 1 231.714 549.911 0.0236323 0.0236323 0.992988 ST
231.714 607.821 0.0236323 0.0236323 0.684741 289.643 607.821 0.0236323 0.757747 1 231.714 549.911 0.0236323 0.0236323 0.992988 ST
289.643 549.911 0.0236323 0.919982 1 289.643 492 0.112862 1 0.997044 231.714 492 0.0236323 0.335935 1 ST
231.714 549.911 0.0236323 0.0236323 0.992988 289.643 549.911 0.0236323 0.919982 1 231.714 492 0.0236323 0.335935 1 ST
289.643 492 0.112862 1 0.997044 289.643 434.089 0.36027 1 0.749635 231.714 434.089 0.0236323 0.741523 1 ST
231.714 492 0.0236323 0.335935 1 289.643 492 0.112862 1 0.997044 231.714 434.089 0.0236323 0.741523 1 ST
289.643 434.089 0.36027 1 0.749635 289.643 376.179 0.571176 1 0.538729 231.714 376.179 0.0804146 1 1 ST
231.714 434.089 0.0236323 0.741523 1 289.643 434.089 0.36027 1 0.749635 231.714 376.179 0.0804146 1 1 ST
289.643 376.179 0.571176 1 0.538729 289.643 318.268 0.700964 1 0.408941 231.714 318.268 0.376494 1 0.733411 ST
231.714 376.179 0.0804146 1 1 289.643 376.179 0.571176 1 0.538729 231.714 318.268 0.376494 1 0.733411 ST
289.643 318.268 0.700964 1 0.408941 289.643 260.357 0.717188 1 0.392717 231.714 260.357 0.554953 1 0.554953 ST
231.714 318.268 0.376494 1 0.733411 289.643 318.268 0.700964 1 0.408941 231.714 260.357 0.554953 1 0.554953 ST
289.643 260.357 0.717188 1 0.392717 289.643 202.446 0.603623 1 0.506282 231.714 202.446 0.603623 1 0.506282 ST
231.714 260.357 0.554953 1 0.554953 289.643 260.357 0.717188 1 0.392717 231.714 202.446 0.603623 1 0.506282 ST
347.571 781.554 0.603623 1 0.506282 347.571 723.643 0.538729 1 0.571176 289.643 723.643 0.0479676 1 1 ST
289.643 781.554 0.603623 1 0.506282 347.571 781.554 0.603623 1 0.506282 289.643 723.643 0.0479676 1 1 ST
347.571 723.643 0.538729 1 0.571176 347.571 665.732 0.473835 1 0.63607 289.643 665.732 0.0236323 0.757747 1 ST
289.643 723.643 0.0479676 1 1 347.571 723.643 0.538729 1 0.571176 289.643 665.732 0.0236323 0.757747 1 ST
347.571 665.732 0.473835 1 0.63607 347.571 607.821 0.490059 1 0.619847 289.643 607.821 0.0236323 0.757747 1 ST
289.643 665.732 0.0236323 0.757747 1 347.571 665.732 0.473835 1 0.63607 289.643 607.821 0.0236323 0.757747 1 ST
347.571 607.821 0.490059 1 0.619847 347.571 549.911 0.603623 1 0.506282 289.643 549.911 0.0236323 0.919982 1 ST
289.643 607.821 0.0236323 0.757747 1 347.571 607.821 0.490059 1 0.619847 289.643 549.911 0.0236323 0.919982 1 ST
347.571 549.911 0.603623 1 0.506282 347.571 492 0.733411 1 0.376494 289.643 492 0.112862 1 0.997044 ST
289.643 549.911 0.0236323 0.919982 1 347.571 549.911 0.603623 1 0.506282 289.643 492 0.112862 1 0.997044 ST
347.571 492 0.733411 1 0.376494 347.571 434.089 0.879423 1 0.230482 289.643 434.089 0.36027 1 0.749635 ST
289.643 492 0.112862 1 0.997044 347.571 492 0.733411 1 0.376494 289.643 434.089 0.36027 1 0.749635 ST
347.571 434.089 0.879423 1 0.230482 347.571 376.179 0.960541 1 0.149365 289.643 376.179 0.571176 1 0.538729 ST
289.643 434.089 0.36027 1 0.749635 347.571 434.089 0.879423 1 0.230482 289.643 376.179 0.571176 1 0.538729 ST
347.571 376.179 0.960541 1 0.149365 347.571 318.268 0.960541 1 0.149365 289.643 318.268 0.700964 1 0.408941 ST
289.643 376.179 0.571176 1 0.538729 347.571 376.179 0.960541 1 0.149365 289.643 318.268 0.700964 1 0.408941 ST
347.571 318.268 0.960541 1 0.149365 347.571 260.357 0.863199 1 0.246706 289.643 260.357 0.717188 1 0.392717 ST
289.643 318.268 0.700964 1 0.408941 347.571 318.268 0.960541 1 0.149365 289.643 260.357 0.717188 1 0.392717 ST
347.571 260.357 0.863199 1 0.246706 347.571 202.446 0.603623 1 0.506282 289.643 202.446 0.603623 1 0.506282 ST
289.643 260.357 0.717188 1 0.392717 347.571 260.357 0.863199 1 0.246706 289.643 202.446 0.603623 1 0.506282 ST
405.5 781.554 0.603623 1 0.506282 405.5 723.643 0.798305 1 0.3116 347.571 723.643 0.538729 1 0.571176 ST
347.571 781.554 0.603623 1 0.506282 405.5 781.554 0.603623 1 0.506282 347.571 723.643 0.538729 1 0.571176 ST
405.5 723.643 0.798305 1 0.3116 405.5 665.732 0.91187 1 0.198035 347.571 665.732 0.473835 1 0.63607 ST
347.571 723.643 0.538729 1 0.571176 405.5 723.643 0.798305 1 0.3116 347.571 665.732 0.473835 1 0.63607 ST
405.5 665.732 0.91187 1 0.198035 405.5 607.821 1 1 0.100694 347.571 607.821 0.490059 1 0.619847 ST
347.571 665.732 0.473835 1 0.63607 405.5 665.732 0.91187 1 0.198035 347.571 607.821 0.490059 1 0.619847 ST
405.5 607.821 1 1 0.100694 405.5 549.911 1 1 0.0236323 347.571 549.911 0.603623 1 0.506282 ST
347.571 607.821 0.490059 1 0.619847 405.5 607.821 1 1 0.100694 347.571 549.911 0.603623 1 0.506282 ST
405.5 549.911 1 1 0.0236323 405.5 492 1 0.952429 0.0236323 347.571 492 0.733411 1 0.376494 ST
347.571 549.911 0.603623 1 0.506282 405.5 549.911 1 1 0.0236323 347.571 492 0.733411 1 0.376494 ST
405.5 492 1 0.952429 0.0236323 405.5 434.089 1 0.887535 0.0236323 347.571 434.089 0.879423 1 0.230482 ST
347.571 492 0.733411 1 0.376494 405.5 492 1 0.952429 0.0236323 347.571 434.089 0.879423 1 0.230482 ST
405.5 434.089 1 0.887535 0.0236323 405.5 376.179 1 0.887535 0.0236323 347.571 376.179 0.960541 1 0.149365 ST
347.571 434.089 0.879423 1 0.230482 405.5 434.089 1 0.887535 0.0236323 347.571 376.179 0.960541 1 0.149365 ST
405.5 376.179 1 0.887535 0.0236323 405.5 318.268 1 0.984876 0.0236323 347.571 318.268 0.960541 1 0.149365 ST
347.571 376.179 0.960541 1 0.149365 405.5 376.179 1 0.887535 0.0236323 347.571 318.268 0.960541 1 0.149365 ST
405.5 318.268 1 0.984876 0.0236323 405.5 260.357 0.960541 1 0.149365 347.571 260.357 0.863199 1 0.246706 ST
347.571 318.268 0.960541 1 0.149365 405.5 318.268 1 0.984876 0.0236323 347.571 260.357 0.863199 1 0.246706 ST
405.5 260.357 0.960541 1 0.149365 405.5 202.446 0.603623 1 0.506282 347.571 202.446 0.603623 1 0.506282 ST
347.571 260.357 0.863199 1 0.246706 405.5 260.357 0.960541 1 0.149365 347.571 202.446 0.603623 1 0.506282 ST
463.429 781.554 0.603623 1 0.506282 463.429 723.643 0.944317 1 0.165588 405.5 723.643 0.798305 1 0.3116 ST
405.5 781.554 0.603623 1 0.506282 463.429 781.554 0.603623 1 0.506282 405.5 723.643 0.798305 1 0.3116 ST
463.429 723.643 0.944317 1 0.165588 463.429 665.732 1 0.984876 0.0236323 405.5 665.732 0.91187 1 0.198035 ST
405.5 723.643 0.798305 1 0.3116 463.429 723.643 0.944317 1 0.165588 405.5 665.732 0.91187 1 0.198035 ST
463.429 665.732 1 0.984876 0.0236323 463.429 607.821 1 0.822641 0.0236323 405.5 607.821 1 1 0.100694 ST
405.5 665.732 0.91187 1 0.198035 463.429 665.732 1 0.984876 0.0236323 405.5 607.821 1 1 0.100694 ST
463.429 607.821 1 0.822641 0.0236323 463.429 549.911 1 0.7253 0.0236323 405.5 549.911 1 1 0.0236323 ST
405.5 607.821 1 1 0.100694 463.429 607.821 1 0.822641 0.0236323 405.5 549.911 1 1 0.0236323 ST
463.429 549.911 1 0.7253 0.0236323 463.429 492 1 0.660406 0.0236323 405.5 492 1 0.952429 0.0236323 ST
405.5 549.911 1 1 0.0236323 463.429 549.911 1 0.7253 0.0236323 405.5 492 1 0.952429 0.0236323 ST
463.429 492 1 0.660406 0.0236323 463.429 434.089 1 0.644182 0.0236323 405.5 434.089 1 0.887535 0.0236323 ST
405.5 492 1 0.952429 0.0236323 463.429 492 1 0.660406 0.0236323 405.5 434.089 1 0.887535 0.0236323 ST
463.429 434.089 1 0.644182 0.0236323 463.429 376.179 1 0.692853 0.0236323 405.5 376.179 1 0.887535 0.0236323 ST
405.5 434.089 1 0.887535 0.0236323 463.429 434.089 1 0.644182 0.0236323 405.5 376.179 1 0.887535 0.0236323 ST
463.429 376.179 1 0.692853 0.0236323 463.429 318.268 1 0.855088 0.0236323 405.5 318.268 1 0.984876 0.0236323 ST
405.5 376.179 1 0.887535 0.0236323 463.429 376.179 1 0.692853 0.0236323 405.5 318.268 1 0.984876 0.0236323 ST
463.429 318.268 1 0.855088 0.0236323 463.429 260.357 1 1 0.0844705 405.5 260.357 0.960541 1 0.149365 ST
405.5 318.268 1 0.984876 0.0236323 463.429 318.268 1 0.855088 0.0236323 405.5 260.357 0.960541 1 0.149365 ST
463.429 260.357 1 1 0.0844705 463.429 202.446 0.603623 1 0.506282 405.5 202.446 0.603623 1 0.506282 ST
405.5 260.357 0.960541 1 0.149365 463.429 260.357 1 1 0.0844705 405.5 202.446 0.603623 1 0.506282 ST
521.357 781.554 0.603623 1 0.506282 521.357 723.643 1 1 0.100694 463.429 723.643 0.944317 1 0.165588 ST
463.429 781.554 0.603623 1 0.506282 521.357 781.554 0.603623 1 0.506282 463.429 723.643 0.944317 1 0.165588 ST
521.357 723.643 1 1 0.100694 521.357 665.732 1 0.838864 0.0236323 463.429 665.732 1 0.984876 0.0236323 ST
463.429 723.643 0.944317 1 0.165588 521.357 723.643 1 1 0.100694 463.429 665.732 1 0.984876 0.0236323 ST
521.357 665.732 1 0.838864 0.0236323 521.357 607.821 1 0.660406 0.0236323 463.429 607.821 1 0.822641 0.0236323 ST
463.429 665.732 1 0.984876 0.0236323 521.357 665.732 1 0.838864 0.0236323 463.429 607.821 1 0.822641 0.0236323 ST
521.357 607.821 1 0.660406 0.0236323 521.357 549.911 1 0.546841 0.0236323 463.429 549.911 1 0.7253 0.0236323 ST
463.429 607.821 1 0.822641 0.0236323 521.357 607.821 1 0.660406 0.0236323 463.429 549.911 1 0.7253 0.0236323 ST
521.357 549.911 1 0.546841 0.0236323 521.357 492 1 0.49817 0.0236323 463.429 492 1 0.660406 0.0236323 ST
463.429 549.911 1 0.7253 0.0236323 521.357 549.911 1 0.546841 0.0236323 463.429 492 1 0.660406 0.0236323 ST
521.357 492 1 0.49817 0.0236323 521.357 434.089 1 0.49817 0.0236323 463.429 434.089 1 0.644182 0.0236323 ST
463.429 492 1 0.660406 0.0236323 521.357 492 1 0.49817 0.0236323 463.429 434.089 1 0.644182 0.0236323 ST
521.357 434.089 1 0.49817 0.0236323 521.357 376.179 1 0.595511 0.0236323 463.429 376.179 1 0.692853 0.0236323 ST
463.429 434.089 1 0.644182 0.0236323 521.357 434.089 1 0.49817 0.0236323 463.429 376.179 1 0.692853 0.0236323 ST
521.357 376.179 1 0.595511 0.0236323 521.357 318.268 1 0.77397 0.0236323 463.429 318.268 1 0.855088 0.0236323 ST
463.429 376.179 1 0.692853 0.0236323 521.357 376.179 1 0.595511 0.0236323 463.429 318.268 1 0.855088 0.0236323 ST
521.357 318.268 1 0.77397 0.0236323 521.357 260.357 1 1 0.0520235 463.429 260.357 1 1 0.0844705 ST
463.429 318.268 1 0.855088 0.0236323 521.357 318.268 1 0.77397 0.0236323 463.429 260.357 1 1 0.0844705 ST
521.357 260.357 1 1 0.0520235 521.357 202.446 0.603623 1 0.506282 463.429 202.446 0.603623 1 0.506282 ST
463.429 260.357 1 1 0.0844705 521.357 260.357 1 1 0.0520235 463.429 202.446 0.603623 1 0.506282 ST
579.286 781.554 0.603623 1 0.506282 579.286 723.643 1 1 0.068247 521.357 723.643 1 1 0.100694 ST
521.357 781.554 0.603623 1 0.506282 579.286 781.554 0.603623 1 0.506282 521.357 723.643 1 1 0.100694 ST
579.286 723.643 1 1 0.068247 579.286 665.732 1 0.806417 0.0236323 521.357 665.732 1 0.838864 0.0236323 ST
521.357 723.643 1 1 0.100694 579.286 723.643 1 1 0.068247 521.357 665.732 1 0.838864 0.0236323 ST
579.286 665.732 1 0.806417 0.0236323 579.286 607.821 1 0.611735 0.0236323 521.357 607.821 1 0.660406 0.0236323 ST
521.357 665.732 1 0.838864 0.0236323 579.286 665.732 1 0.806417 0.0236323 521.357 607.821 1 0.660406 0.0236323 ST
579.286 607.821 1 0.611735 0.0236323 579.286 549.911 1 0.49817 0.0236323 521.357 549.911 1 0.546841 0.0236323 ST
521.357 607.821 1 0.660406 0.0236323 579.286 607.821 1 0.611735 0.0236323 521.357 549.911 1 0.546841 0.0236323 ST
579.286 549.911 1 0.49817 0.0236323 579.286 492 1 0.4495 0.0236323 521.357 492 1 0.49817 0.0236323 ST
521.357 549.911 1 0.546841 0.0236323 579.286 549.911 1 0.49817 0.0236323 521.357 492 1 0.49817 0.0236323 ST
579.286 492 1 0.4495 0.0236323 579.286 434.089 1 0.465723 0.0236323 521.357 434.089 1 0.49817 0.0236323 ST
521.357 492 1 0.49817 0.0236323 579.286 492 1 0.4495 0.0236323 521.357 434.089 1 0.49817 0.0236323 ST
579.286 434.089 1 0.465723 0.0236323 579.286 376.179 1 0.579288 0.0236323 521.357 376.179 1 0.595511 0.0236323 ST
521.357 434.089 1 0.49817 0.0236323 579.286 434.089 1 0.465723 0.0236323 521.357 376.179 1 0.595511 0.0236323 ST
579.286 376.179 1 0.579288 0.0236323 579.286 318.268 1 0.77397 0.0236323 521.357 318.268 1 0.77397 0.0236323 ST
521.357 376.179 1 0.595511 0.0236323 579.286 376.179 1 0.579288 0.0236323 521.357 318.268 1 0.77397 0.0236323 ST
579.286 318.268 1 0.77397 0.0236323 579.286 260.357 1 1 0.0520235 521.357 260.357 1 1 0.0520235 ST
521.357 318.268 1 0.77397 0.0236323 579.286 318.268 1 0.77397 0.0236323 521.357 260.357 1 1 0.0520235 ST
579.286 260.357 1 1 0.0520235 579.286 202.446 0.603623 1 0.506282 521.357 202.446 0.603623 1 0.506282 ST
521.357 260.357 1 1 0.0520235 579.286 260.357 1 1 0.0520235 521.357 202.446 0.603623 1 0.506282 ST
637.214 781.554 0.603623 1 0.506282 637.214 723.643 1 1 0.100694 579.286 723.643 1 1 0.068247 ST
579.286 781.554 0.603623 1 0.506282 637.214 781.554 0.603623 1 0.506282 579.286 723.643 1 1 0.068247 ST
637.214 723.643 1 1 0.100694 637.214 665.732 1 0.838864 0.0236323 579.286 665.732 1 0.806417 0.0236323 ST
579.286 723.643 1 1 0.068247 637.214 723.643 1 1 0.100694 579.286 665.732 1 0.806417 0.0236323 ST
637.214 665.732 1 0.838864 0.0236323 637.214 607.821 1 0.660406 0.0236323 579.286 607.821 1 0.611735 0.0236323 ST
579.286 665.732 1 0.806417 0.0236323 637.214 665.732 1 0.838864 0.0236323 579.286 607.821 1 0.611735 0.0236323 ST
637.214 607.821 1 0.660406 0.0236323 637.214 549.911 1 0.563064 0.0236323 579.286 549.911 1 0.49817 0.0236323 ST
579.286 607.821 1 0.611735 0.0236323 637.214 607.821 1 0.660406 0.0236323 579.286 549.911 1 0.49817 0.0236323 ST
637.214 549.911 1 0.563064 0.0236323 637.214 492 1 0.514394 0.0236323 579.286 492 1 0.4495 0.0236323 ST
579.286 549.911 1 0.49817 0.0236323 637.214 549.911 1 0.563064 0.0236323 579.286 492 1 0.4495 0.0236323 ST
637.214 492 1 0.514394 0.0236323 637.214 434.089 1 0.546841 0.0236323 579.286 434.089 1 0.465723 0.0236323 ST
579.286 492 1 0.4495 0.0236323 637.214 492 1 0.514394 0.0236323 579.286 434.089 1 0.465723 0.0236323 ST
637.214 434.089 1 0.546841 0.0236323 637.214 376.179 1 0.644182 0.0236323 579.286 376.179 1 0.579288 0.0236323 ST
579.286 434.089 1 0.465723 0.0236323 637.214 434.089 1 0.546841 0.0236323 579.286 376.179 1 0.579288 0.0236323 ST
637.214 376.179 1 0.644182 0.0236323 637.214 318.268 1 0.822641 0.0236323 579.286 318.268 1 0.77397 0.0236323 ST
579.286 376.179 1 0.579288 0.0236323 637.214 376.179 1 0.644182 0.0236323 579.286 318.268 1 0.77397 0.0236323 ST
637.214 318.268 1 0.822641 0.0236323 637.214 260.357 1 1 0.0844705 579.286 260.357 1 1 0.0520235 ST
579.286 318.268 1 0.77397 0.0236323 637.214 318.268 1 0.822641 0.0236323 579.286 260.357 1 1 0.0520235 ST
637.214 260.357 1 1 0.0844705 637.214 202.446 0.603623 1 0.506282 579.286 202.446 0.603623 1 0.506282 ST
579.286 260.357 1 1 0.0520235 637.214 260.357 1 1 0.0844705 579.286 202.446 0.603623 1 0.506282 ST
695.143 781.554 0.603623 1 0.506282 695.143 723.643 0.944317 1 0.165588 637.214 723.643 1 1 0.100694 ST
637.214 781.554 0.603623 1 0.506282 695.143 781.554 0.603623 1 0.506282 637.214 723.643 1 1 0.100694 ST
695.143 723.643 0.944317 1 0.165588 695.143 665.732 1 0.968652 0.0236323 637.214 665.732 1 0.838864 0.0236323 ST
637.214 723.643 1 1 0.100694 695.143 723.643 0.944317 1 0.165588 637.214 665.732 1 0.838864 0.0236323 ST
695.143 665.732 1 0.968652 0.0236323 695.143 607.821 1 0.822641 0.0236323 637.214 607.821 1 0.660406 0.0236323 ST
637.214 665.732 1 0.838864 0.0236323 695.143 665.732 1 0.968652 0.0236323 637.214 607.821 1 0.660406 0.0236323 ST
695.143 607.821 1 0.822641 0.0236323 695.143 549.911 1 0.741523 0.0236323 637.214 549.911 1 0.563064 0.0236323 ST
637.214 607.821 1 0.660406 0.0236323 695.143 607.821 1 0.822641 0.0236323 637.214 549.911 1 0.563064 0.0236323 ST
695.143 549.911 1 0.741523 0.0236323 695.143 492 1 0.7253 0.0236323 637.214 492 1 0.514394 0.0236323 ST
637.214 549.911 1 0.563064 0.0236323 695.143 549.911 1 0.741523 0.0236323 637.214 492 1 0.514394 0.0236323 ST
695.143 492 1 0.7253 0.0236323 695.143 434.089 1 0.741523 0.0236323 637.214 434.089 1 0.546841 0.0236323 ST
637.214 492 1 0.514394 0.0236323 695.143 492 1 0.7253 0.0236323 637.214 434.089 1 0.546841 0.0236323 ST
695.143 434.089 1 0.741523 0.0236323 695.143 376.179 1 0.806417 0.0236323 637.214 376.179 1 0.644182 0.0236323 ST
637.214 434.089 1 0.546841 0.0236323 695.143 434.089 1 0.741523 0.0236323 637.214 376.179 1 0.644182 0.0236323 ST
695.143 376.179 1 0.806417 0.0236323 695.143 318.268 1 0.952429 0.0236323 637.214 318.268 1 0.822641 0.0236323 ST
637.214 376.179 1 0.644182 0.0236323 695.143 376.179 1 0.806417 0.0236323 637.214 318.268 1 0.822641 0.0236323 ST
695.143 318.268 1 0.952429 0.0236323 695.143 260.357 0.960541 1 0.149365 637.214 260.357 1 1 0.0844705 ST
637.214 318.268 1 0.822641 0.0236323 695.143 318.268 1 0.952429 0.0236323 637.214 260.357 1 1 0.0844705 ST
695.143 260.357 0.960541 1 0.149365 695.143 202.446 0.603623 1 0.506282 637.214 202.446 0.603623 1 0.506282 ST
637.214 260.357 1 1 0.0844705 695.143 260.357 0.960541 1 0.149365 637.214 202.446 0.603623 1 0.506282 ST
753.071 781.554 0.603623 1 0.506282 753.071 723.643 0.830752 1 0.279153 695.143 723.643 0.944317 1 0.165588 ST
695.143 781.554 0.603623 1 0.506282 753.071 781.554 0.603623 1 0.506282 695.143 723.643 0.944317 1 0.165588 ST
753.071 723.643 0.830752 1 0.279153 753.071 665.732 0.960541 1 0.149365 695.143 665.732 1 0.968652 0.0236323 ST
695.143 723.643 0.944317 1 0.165588 753.071 723.643 0.830752 1 0.279153 695.143 665.732 1 0.968652 0.0236323 ST
753.071 665.732 0.960541 1 0.149365 753.071 607.821 1 1 0.0844705 695.143 607.821 1 0.822641 0.0236323 ST
695.143 665.732 1 0.968652 0.0236323 753.071 665.732 0.960541 1 0.149365 695.143 607.821 1 0.822641 0.0236323 ST
753.071 607.821 1 1 0.0844705 753.071 549.911 1 1 0.0357999 695.143 549.911 1 0.741523 0.0236323 ST
695.143 607.821 1 0.822641 0.0236323 753.071 607.821 1 1 0.0844705 695.143 549.911 1 0.741523 0.0236323 ST
753.071 549.911 1 1 0.0357999 753.071 492 1 1 0.0236323 695.143 492 1 0.7253 0.0236323 ST
695.143 549.911 1 0.741523 0.0236323 753.071 549.911 1 1 0.0357999 695.143 492 1 0.7253 0.0236323 ST
753.071 492 1 1 0.0236323 753.071 434.089 1 1 0.0357999 695.143 434.089 1 0.741523 0.0236323 ST
695.143 492 1 0.7253 0.0236323 753.071 492 1 1 0.0236323 695.143 434.089 1 0.741523 0.0236323 ST
753.071 434.089 1 1 0.0357999 753.071 376.179 1 1 0.068247 695.143 376.179 1 0.806417 0.0236323 ST
695.143 434.089 1 0.741523 0.0236323 753.071 434.089 1 1 0.0357999 695.143 376.179 1 0.806417 0.0236323 ST
753.071 376.179 1 1 0.068247 753.071 318.268 0.960541 1 0.149365 695.143 318.268 1 0.952429 0.0236323 ST
695.143 376.179 1 0.806417 0.0236323 753.071 376.179 1 1 0.068247 695.143 318.268 1 0.952429 0.0236323 ST
753.071 318.268 0.960541 1 0.149365 753.071 260.357 0.830752 1 0.279153 695.143 260.357 0.960541 1 0.149365 ST
695.143 318.268 1 0.952429 0.0236323 753.071 318.268 0.960541 1 0.149365 695.143 260.357 0.960541 1 0.149365 ST
753.071 260.357 0.830752 1 0.279153 753.071 202.446 0.603623 1 0.506282 695.143 202.446 0.603623 1 0.506282 ST
695.143 260.357 0.960541 1 0.149365 753.071 260.357 0.830752 1 0.279153 695.143 202.446 0.603623 1 0.506282 ST
811 781.554 0.603623 1 0.506282 811 723.643 0.603623 1 0.506282 753.071 723.643 0.830752 1 0.279153 ST
753.071 781.554 0.603623 1 0.506282 811 781.554 0.603623 1 0.506282 753.071 723.643 0.830752 1 0.279153 ST
811 723.643 0.603623 1 0.506282 811 665.732 0.603623 1 0.506282 753.071 665.732 0.960541 1 0.149365 ST
753.071 723.643 0.830752 1 0.279153 811 723.643 0.603623 1 0.506282 753.071 665.732 0.960541 1 0.149365 ST
811 665.732 0.603623 1 0.506282 811 607.821 0.603623 1 0.506282 753.071 607.821 1 1 0.0844705 ST
753.071 665.732 0.960541 1 0.149365 811 665.732 0.603623 1 0.506282 753.071 607.821 1 1 0.0844705 ST
811 607.821 0.603623 1 0.506282 811 549.911 0.603623 1 0.506282 753.071 549.911 1 1 0.0357999 ST
753.071 607.821 1 1 0.0844705 811 607.821 0.603623 1 0.506282 753.071 549.911 1 1 0.0357999 ST
811 549.911 0.603623 1 0.506282 811 492 0.603623 1 0.506282 753.071 492 1 1 0.0236323 ST
753.071 549.911 1 1 0.0357999 811 549.911 0.603623 1 0.506282 753.071 492 1 1 0.0236323 ST
811 492 0.603623 1 0.506282 811 434.089 0.603623 1 0.506282 753.071 434.089 1 1 0.0357999 ST
753.071 492 1 1 0.0236323 811 492 0.603623 1 0.506282 753.071 434.089 1 1 0.0357999 ST
811 434.089 0.603623 1 0.506282 811 376.179 0.603623 1 0.506282 753.071 376.179 1 1 0.068247 ST
753.071 434.089 1 1 0.0357999 811 434.089 0.603623 1 0.506282 753.071 376.179 1 1 0.068247 ST
811 376.179 0.603623 1 0.506282 811 318.268 0.603623 1 0.506282 753.071 318.268 0.960541 1 0.149365 ST
753.071 376.179 1 1 0.068247 811 376.179 0.603623 1 0.506282 753.071 318.268 0.960541 1 0.149365 ST
811 318.268 0.603623 1 0.506282 811 260.357 0.603623 1 0.506282 753.071 260.357 0.830752 1 0.279153 ST
753.071 318.268 0.960541 1 0.149365 811 318.268 0.603623 1 0.506282 753.071 260.357 0.830752 1 0.279153 ST
0.603623 1 0.506282 C
811 260.357 811 202.446 753.071 202.446 T
753.071 260.357 0.830752 1 0.279153 811 260.357 0.603623 1 0.506282 753.071 202.446 0.603623 1 0.506282 ST
1 W
0.0236323 0.29132 1 C
811 723.643 LS
868.929 723.643 L
868.929 781.554 L
811 781.554 L
811 723.643 LE
811 665.732 LS
868.929 665.732 L
868.929 723.643 L
811 723.643 L
811 665.732 LE
811 607.821 LS
868.929 607.821 L
868.929 665.732 L
811 665.732 L
811 607.821 LE
811 549.911 LS
868.929 549.911 L
868.929 607.821 L
811 607.821 L
811 549.911 LE
811 492 LS
868.929 492 L
868.929 549.911 L
811 549.911 L
811 492 LE
811 434.089 LS
868.929 434.089 L
868.929 492 L
811 492 L
811 434.089 LE
811 376.179 LS
868.929 376.179 L
868.929 434.089 L
811 434.089 L
811 376.179 LE
811 318.268 LS
868.929 318.268 L
868.929 376.179 L
811 376.179 L
811 318.268 LE
811 260.357 LS
868.929 260.357 L
868.929 318.268 L
811 318.268 L
811 260.357 LE
811 202.446 LS
868.929 202.446 L
868.929 260.357 L
811 260.357 L
811 202.446 LE
868.929 723.643 LS
926.857 723.643 L
926.857 781.554 L
868.929 781.554 L
868.929 723.643 LE
868.929 665.732 LS
926.857 665.732 L
926.857 723.643 L
868.929 723.643 L
868.929 665.732 LE
868.929 607.821 LS
926.857 607.821 L
926.857 665.732 L
868.929 665.732 L
868.929 607.821 LE
868.929 549.911 LS
926.857 549.911 L
926.857 607.821 L
868.929 607.821 L
868.929 549.911 LE
868.929 492 LS
926.857 492 L
926.857 549.911 L
868.929 549.911 L
868.929 492 LE
868.929 434.089 LS
926.857 434.089 L
926.857 492 L
868.929 492 L
868.929 434.089 LE
868.929 376.179 LS
926.857 376.179 L
926.857 434.089 L
868.929 434.089 L
868.929 376.179 LE
868.929 318.268 LS
926.857 318.268 L
926.857 376.179 L
868.929 376.179 L
868.929 318.268 LE
868.929 260.357 LS
926.857 260.357 L
926.857 318.268 L
868.929 318.268 L
868.929 260.357 LE
868.929 202.446 LS
926.857 202.446 L
926.857 260.357 L
868.929 260.357 L
868.929 202.446 LE
926.857 723.643 LS
984.786 723.643 L
984.786 781.554 L
926.857 781.554 L
926.857 723.643 LE
926.857 665.732 LS
984.786 665.732 L
984.786 723.643 L
926.857 723.643 L
926.857 665.732 LE
926.857 607.821 LS
984.786 607.821 L
984.786 665.732 L
926.857 665.732 L
926.857 607.821 LE
926.857 549.911 LS
984.786 549.911 L
984.786 607.821 L
926.857 607.821 L
926.857 549.911 LE
926.857 492 LS
984.786 492 L
984.786 549.911 L
926.857 549.911 L
926.857 492 LE
926.857 434.089 LS
984.786 434.089 L
984.786 492 L
926.857 492 L
926.857 434.089 LE
926.857 376.179 LS
984.786 376.179 L
984.786 434.089 L
926.857 434.089 L
926.857 376.179 LE
926.857 318.268 LS
984.786 318.268 L
984.786 376.179 L
926.857 376.179 L
926.857 318.268 LE
926.857 260.357 LS
984.786 260.357 L
984.786 318.268 L
926.857 318.268 L
926.857 260.357 LE
926.857 202.446 LS
984.786 202.446 L
984.786 260.357 L
926.857 260.357 L
926.857 202.446 LE
984.786 723.643 LS
1042.71 723.643 L
1042.71 781.554 L
984.786 781.554 L
984.786 723.643 LE
984.786 665.732 LS
1042.71 665.732 L
1042.71 723.643 L
984.786 723.643 L
984.786 665.732 LE
984.786 607.821 LS
1042.71 607.821 L
1042.71 665.732 L
984.786 665.732 L
984.786 607.821 LE
984.786 549.911 LS
1042.71 549.911 L
1042.71 607.821 L
984.786 607.821 L
984.786 549.911 LE
984.786 492 LS
1042.71 492 L
1042.71 549.911 L
984.786 549.911 L
984.786 492 LE
984.786 434.089 LS
1042.71 434.089 L
1042.71 492 L
984.786 492 L
984.786 434.089 LE
984.786 376.179 LS
1042.71 376.179 L
1042.71 434.089 L
984.786 434.089 L
984.786 376.179 LE
984.786 318.268 LS
1042.71 318.268 L
1042.71 376.179 L
984.786 376.179 L
984.786 318.268 LE
984.786 260.357 LS
1042.71 260.357 L
1042.71 318.268 L
984.786 318.268 L
984.786 260.357 LE
984.786 202.446 LS
1042.71 202.446 L
1042.71 260.357 L
984.786 260.357 L
984.786 202.446 LE
1042.71 723.643 LS
1100.64 723.643 L
1100.64 781.554 L
1042.71 781.554 L
1042.71 723.643 LE
1042.71 665.732 LS
1100.64 665.732 L
1100.64 723.643 L
1042.71 723.643 L
1042.71 665.732 LE
1042.71 607.821 LS
1100.64 607.821 L
1100.64 665.732 L
1042.71 665.732 L
1042.71 607.821 LE
1042.71 549.911 LS
1100.64 549.911 L
1100.64 607.821 L
1042.71 607.821 L
1042.71 549.911 LE
1042.71 492 LS
1100.64 492 L
1100.64 549.911 L
1042.71 549.911 L
1042.71 492 LE
1042.71 434.089 LS
1100.64 434.089 L
1100.64 492 L
1042.71 492 L
1042.71 434.089 LE
1042.71 376.179 LS
1100.64 376.179 L
1100.64 434.089 L
1042.71 434.089 L
1042.71 376.179 LE
1042.71 318.268 LS
1100.64 318.268 L
1100.64 376.179 L
1042.71 376.179 L
1042.71 318.268 LE
1042.71 260.357 LS
1100.64 260.357 L
1100.64 318.268 L
1042.71 318.268 L
1042.71 260.357 LE
1042.71 202.446 LS
1100.64 202.446 L
1100.64 260.357 L
1042.71 260.357 L
1042.71 202.446 LE
1100.64 723.643 LS
1158.57 723.643 L
1158.57 781.554 L
1100.64 781.554 L
1100.64 723.643 LE
1100.64 665.732 LS
1158.57 665.732 L
1158.57 723.643 L
1100.64 723.643 L
1100.64 665.732 LE
1100.64 607.821 LS
1158.57 607.821 L
1158.57 665.732 L
1100.64 665.732 L
1100.64 607.821 LE
1100.64 549.911 LS
1158.57 549.911 L
1158.57 607.821 L
1100.64 607.821 L
1100.64 549.911 LE
1100.64 492 LS
1158.57 492 L
1158.57 549.911 L
1100.64 549.911 L
1100.64 492 LE
1100.64 434.089 LS
1158.57 434.089 L
1158.57 492 L
1100.64 492 L
1100.64 434.089 LE
1100.64 376.179 LS
1158.57 376.179 L
1158.57 434.089 L
1100.64 434.089 L
1100.64 376.179 LE
1100.64 318.268 LS
1158.57 318.268 L
1158.57 376.179 L
1100.64 376.179 L
1100.64 318.268 LE
1100.64 260.357 LS
1158.57 260.357 L
1158.57 318.268 L
1100.64 318.268 L
1100.64 260.357 LE
1100.64 202.446 LS
1158.57 202.446 L
1158.57 260.357 L
1100.64 260.357 L
1100.64 202.446 LE
1158.57 723.643 LS
1216.5 723.643 L
1216.5 781.554 L
1158.57 781.554 L
1158.57 723.643 LE
1158.57 665.732 LS
1216.5 665.732 L
1216.5 723.643 L
1158.57 723.643 L
1158.57 665.732 LE
1158.57 607.821 LS
1216.5 607.821 L
1216.5 665.732 L
1158.57 665.732 L
1158.57 607.821 LE
1158.57 549.911 LS
1216.5 549.911 L
1216.5 607.821 L
1158.57 607.821 L
1158.57 549.911 LE
1158.57 492 LS
1216.5 492 L
1216.5 549.911 L
1158.57 549.911 L
1158.57 492 LE
1158.57 434.089 LS
1216.5 434.089 L
1216.5 492 L
1158.57 492 L
1158.57 434.089 LE
1158.57 376.179 LS
1216.5 376.179 L
1216.5 434.089 L
1158.57 434.089 L
1158.57 376.179 LE
1158.57 318.268 LS
1216.5 318.268 L
1216.5 376.179 L
1158.57 376.179 L
1158.57 318.268 LE
1158.57 260.357 LS
1216.5 260.357 L
1216.5 318.268 L
1158.57 318.268 L
1158.57 260.357 LE
1158.57 202.446 LS
1216.5 202.446 L
1216.5 260.357 L
1158.57 260.357 L
1158.57 202.446 LE
1216.5 723.643 LS
1274.43 723.643 L
1274.43 781.554 L
1216.5 781.554 L
1216.5 723.643 LE
1216.5 665.732 LS
1274.43 665.732 L
1274.43 723.643 L
1216.5 723.643 L
1216.5 665.732 LE
1216.5 607.821 LS
1274.43 607.821 L
1274.43 665.732 L
1216.5 665.732 L
1216.5 607.821 LE
1216.5 549.911 LS
1274.43 549.911 L
1274.43 607.821 L
1216.5 607.821 L
1216.5 549.911 LE
1216.5 492 LS
1274.43 492 L
1274.43 549.911 L
1216.5 549.911 L
1216.5 492 LE
1216.5 434.089 LS
1274.43 434.089 L
1274.43 492 L
1216.5 492 L
1216.5 434.089 LE
1216.5 376.179 LS
1274.43 376.179 L
1274.43 434.089 L
1216.5 434.089 L
1216.5 376.179 LE
1216.5 318.268 LS
1274.43 318.268 L
1274.43 376.179 L
1216.5 376.179 L
1216.5 318.268 LE
1216.5 260.357 LS
1274.43 260.357 L
1274.43 318.268 L
1216.5 318.268 L
1216.5 260.357 LE
1216.5 202.446 LS
1274.43 202.446 L
1274.43 260.357 L
1216.5 260.357 L
1216.5 202.446 LE
1274.43 723.643 LS
1332.36 723.643 L
1332.36 781.554 L
1274.43 781.554 L
1274.43 723.643 LE
1274.43 665.732 LS
1332.36 665.732 L
1332.36 723.643 L
1274.43 723.643 L
1274.43 665.732 LE
1274.43 607.821 LS
1332.36 607.821 L
1332.36 665.732 L
1274.43 665.732 L
1274.43 607.821 LE
1274.43 549.911 LS
1332.36 549.911 L
1332.36 607.821 L
1274.43 607.821 L
1274.43 549.911 LE
1274.43 492 LS
1332.36 492 L
1332.36 549.911 L
1274.43 549.911 L
1274.43 492 LE
1274.43 434.089 LS
1332.36 434.089 L
1332.36 492 L
1274.43 492 L
1274.43 434.089 LE
1274.43 376.179 LS
1332.36 376.179 L
1332.36 434.089 L
1274.43 434.089 L
1274.43 376.179 LE
1274.43 318.268 LS
1332.36 318.268 L
1332.36 376.179 L
1274.43 376.179 L
1274.43 318.268 LE
1274.43 260.357 LS
1332.36 260.357 L
1332.36 318.268 L
1274.43 318.268 L
1274.43 260.357 LE
1274.43 202.446 LS
1332.36 202.446 L
1332.36 260.357 L
1274.43 260.357 L
1274.43 202.446 LE
1332.36 723.643 LS
1390.29 723.643 L
1390.29 781.554 L
1332.36 781.554 L
1332.36 723.643 LE
1332.36 665.732 LS
1390.29 665.732 L
1390.29 723.643 L
1332.36 723.643 L
1332.36 665.732 LE
1332.36 607.821 LS
1390.29 607.821 L
1390.29 665.732 L
1332.36 665.732 L
1332.36 607.821 LE
1332.36 549.911 LS
1390.29 549.911 L
1390.29 607.821 L
1332.36 607.821 L
1332.36 549.911 LE
1332.36 492 LS
1390.29 492 L
1390.29 549.911 L
1332.36 549.911 L
1332.36 492 LE
1332.36 434.089 LS
1390.29 434.089 L
1390.29 492 L
1332.36 492 L
1332.36 434.089 LE
1332.36 376.179 LS
1390.29 376.179 L
1390.29 434.089 L
1332.36 434.089 L
1332.36 376.179 LE
1332.36 318.268 LS
1390.29 318.268 L
1390.29 376.179 L
1332.36 376.179 L
1332.36 318.268 LE
1332.36 260.357 LS
1390.29 260.357 L
1390.29 318.268 L
1332.36 318.268 L
1332.36 260.357 LE
1332.36 202.446 LS
1390.29 202.446 L
1390.29 260.357 L
1332.36 260.357 L
1332.36 202.446 LE
231.714 723.643 LS
289.643 723.643 L
289.643 781.554 L
231.714 781.554 L
231.714 723.643 LE
231.714 665.732 LS
289.643 665.732 L
289.643 723.643 L
231.714 723.643 L
231.714 665.732 LE
231.714 607.821 LS
289.643 607.821 L
289.643 665.732 L
231.714 665.732 L
231.714 607.821 LE
231.714 549.911 LS
289.643 549.911 L
289.643 607.821 L
231.714 607.821 L
231.714 549.911 LE
231.714 492 LS
289.643 492 L
289.643 549.911 L
231.714 549.911 L
231.714 492 LE
231.714 434.089 LS
289.643 434.089 L
289.643 492 L
231.714 492 L
231.714 434.089 LE
231.714 376.179 LS
289.643 376.179 L
289.643 434.089 L
231.714 434.089 L
231.714 376.179 LE
231.714 318.268 LS
289.643 318.268 L
289.643 376.179 L
231.714 376.179 L
231.714 318.268 LE
231.714 260.357 LS
289.643 260.357 L
289.643 318.268 L
231.714 318.268 L
231.714 260.357 LE
231.714 202.446 LS
289.643 202.446 L
289.643 260.357 L
231.714 260.357 L
231.714 202.446 LE
289.643 723.643 LS
347.571 723.643 L
347.571 781.554 L
289.643 781.554 L
289.643 723.643 LE
289.643 665.732 LS
347.571 665.732 L
347.571 723.643 L
289.643 723.643 L
289.643 665.732 LE
289.643 607.821 LS
347.571 607.821 L
347.571 665.732 L
289.643 665.732 L
289.643 607.821 LE
289.643 549.911 LS
347.571 549.911 L
347.571 607.821 L
289.643 607.821 L
289.643 549.911 LE
289.643 492 LS
347.571 492 L
347.571 549.911 L
289.643 549.911 L
289.643 492 LE
289.643 434.089 LS
347.571 434.089 L
347.571 492 L
289.643 492 L
289.643 434.089 LE
289.643 376.179 LS
347.571 376.179 L
347.571 434.089 L
289.643 434.089 L
289.643 376.179 LE
289.643 318.268 LS
347.571 318.268 L
347.571 376.179 L
289.643 376.179 L
289.643 318.268 LE
289.643 260.357 LS
347.571 260.357 L
347.571 318.268 L
289.643 318.268 L
289.643 260.357 LE
289.643 202.446 LS
347.571 202.446 L
347.571 260.357 L
289.643 260.357 L
289.643 202.446 LE
347.571 723.643 LS
405.5 723.643 L
405.5 781.554 L
347.571 781.554 L
347.571 723.643 LE
347.571 665.732 LS
405.5 665.732 L
405.5 723.643 L
347.571 723.643 L
347.571 665.732 LE
347.571 607.821 LS
405.5 607.821 L
405.5 665.732 L
347.571 665.732 L
347.571 607.821 LE
347.571 549.911 LS
405.5 549.911 L
405.5 607.821 L
347.571 607.821 L
347.571 549.911 LE
347.571 492 LS
405.5 492 L
405.5 549.911 L
347.571 549.911 L
347.571 492 LE
347.571 434.089 LS
405.5 434.089 L
405.5 492 L
347.571 492 L
347.571 434.089 LE
347.571 376.179 LS
405.5 376.179 L
405.5 434.089 L
347.571 434.089 L
347.571 376.179 LE
347.571 318.268 LS
405.5 318.268 L
405.5 376.179 L
347.571 376.179 L
347.571 318.268 LE
347.571 260.357 LS
405.5 260.357 L
405.5 318.268 L
347.571 318.268 L
347.571 260.357 LE
347.571 202.446 LS
405.5 202.446 L
405.5 260.357 L
347.571 260.357 L
347.571 202.446 LE
405.5 723.643 LS
463.429 723.643 L
463.429 781.554 L
405.5 781.554 L
405.5 723.643 LE
405.5 665.732 LS
463.429 665.732 L
463.429 723.643 L
405.5 723.643 L
405.5 665.732 LE
405.5 607.821 LS
463.429 607.821 L
463.429 665.732 L
405.5 665.732 L
405.5 607.821 LE
405.5 549.911 LS
463.429 549.911 L
463.429 607.821 L
405.5 607.821 L
405.5 549.911 LE
405.5 492 LS
463.429 492 L
463.429 549.911 L
405.5 549.911 L
405.5 492 LE
405.5 434.089 LS
463.429 434.089 L
463.429 492 L
405.5 492 L
405.5 434.089 LE
405.5 376.179 LS
463.429 376.179 L
463.429 434.089 L
405.5 434.089 L
405.5 376.179 LE
405.5 318.268 LS
463.429 318.268 L
463.429 376.179 L
405.5 376.179 L
405.5 318.268 LE
405.5 260.357 LS
463.429 260.357 L
463.429 318.268 L
405.5 318.268 L
405.5 260.357 LE
405.5 202.446 LS
463.429 202.446 L
463.429 260.357 L
405.5 260.357 L
405.5 202.446 LE
463.429 723.643 LS
521.357 723.643 L
521.357 781.554 L
463.429 781.554 L
463.429 723.643 LE
463.429 665.732 LS
521.357 665.732 L
521.357 723.643 L
463.429 723.643 L
463.429 665.732 LE
463.429 607.821 LS
521.357 607.821 L
521.357 665.732 L
463.429 665.732 L
463.429 607.821 LE
463.429 549.911 LS
521.357 549.911 L
521.357 607.821 L
463.429 607.821 L
463.429 549.911 LE
463.429 492 LS
521.357 492 L
521.357 549.911 L
463.429 549.911 L
463.429 492 LE
463.429 434.089 LS
521.357 434.089 L
521.357 492 L
463.429 492 L
463.429 434.089 LE
463.429 376.179 LS
521.357 376.179 L
521.357 434.089 L
463.429 434.089 L
463.429 376.179 LE
463.429 318.268 LS
521.357 318.268 L
521.357 376.179 L
463.429 376.179 L
463.429 318.268 LE
463.429 260.357 LS
521.357 260.357 L
521.357 318.268 L
463.429 318.268 L
463.429 260.357 LE
463.429 202.446 LS
521.357 202.446 L
521.357 260.357 L
463.429 260.357 L
463.429 202.446 LE
521.357 723.643 LS
579.286 723.643 L
579.286 781.554 L
521.357 781.554 L
521.357 723.643 LE
521.357 665.732 LS
579.286 665.732 L
579.286 723.643 L
521.357 723.643 L
521.357 665.732 LE
521.357 607.821 LS
579.286 607.821 L
579.286 665.732 L
521.357 665.732 L
521.357 607.821 LE
521.357 549.911 LS
579.286 549.911 L
579.286 607.821 L
521.357 607.821 L
521.357 549.911 LE
521.357 492 LS
579.286 492 L
579.286 549.911 L
521.357 549.911 L
521.357 492 LE
521.357 434.089 LS
579.286 434.089 L
579.286 492 L
521.357 492 L
521.357 434.089 LE
521.357 376.179 LS
579.286 376.179 L
579.286 434.089 L
521.357 434.089 L
521.357 376.179 LE
521.357 318.268 LS
579.286 318.268 L
579.286 376.179 L
521.357 376.179 L
521.357 318.268 LE
521.357 260.357 LS
579.286 260.357 L
579.286 318.268 L
521.357 318.268 L
521.357 260.357 LE
521.357 202.446 LS
579.286 202.446 L
579.286 260.357 L
521.357 260.357 L
521.357 202.446 LE
579.286 723.643 LS
637.214 723.643 L
637.214 781.554 L
579.286 781.554 L
579.286 723.643 LE
579.286 665.732 LS
637.214 665.732 L
637.214 723.643 L
579.286 723.643 L
579.286 665.732 LE
579.286 607.821 LS
637.214 607.821 L
637.214 665.732 L
579.286 665.732 L
579.286 607.821 LE
579.286 549.911 LS
637.214 549.911 L
637.214 607.821 L
579.286 607.821 L
579.286 549.911 LE
579.286 492 LS
637.214 492 L
637.214 549.911 L
579.286 549.911 L
579.286 492 LE
579.286 434.089 LS
637.214 434.089 L
637.214 492 L
579.286 492 L
579.286 434.089 LE
579.286 376.179 LS
637.214 376.179 L
637.214 434.089 L
579.286 434.089 L
579.286 376.179 LE
579.286 318.268 LS
637.214 318.268 L
637.214 376.179 L
579.286 376.179 L
579.286 318.268 LE
579.286 260.357 LS
637.214 260.357 L
637.214 318.268 L
579.286 318.268 L
579.286 260.357 LE
579.286 202.446 LS
637.214 202.446 L
637.214 260.357 L
579.286 260.357 L
579.286 202.446 LE
637.214 723.643 LS
695.143 723.643 L
695.143 781.554 L
637.214 781.554 L
637.214 723.643 LE
637.214 665.732 LS
695.143 665.732 L
695.143 723.643 L
637.214 723.643 L
637.214 665.732 LE
637.214 607.821 LS
695.143 607.821 L
695.143 665.732 L
637.214 665.732 L
637.214 607.821 LE
637.214 549.911 LS
695.143 549.911 L
695.143 607.821 L
637.214 607.821 L
637.214 549.911 LE
637.214 492 LS
695.143 492 L
695.143 549.911 L
637.214 549.911 L
637.214 492 LE
637.214 434.089 LS
695.143 434.089 L
695.143 492 L
637.214 492 L
637.214 434.089 LE
637.214 376.179 LS
695.143 376.179 L
695.143 434.089 L
637.214 434.089 L
637.214 376.179 LE
637.214 318.268 LS
695.143 318.268 L
695.143 376.179 L
637.214 376.179 L
637.214 318.268 LE
637.214 260.357 LS
695.143 260.357 L
695.143 318.268 L
637.214 318.268 L
637.214 260.357 LE
637.214 202.446 LS
695.143 202.446 L
695.143 260.357 L
637.214 260.357 L
637.214 202.446 LE
695.143 723.643 LS
753.071 723.643 L
753.071 781.554 L
695.143 781.554 L
695.143 723.643 LE
695.143 665.732 LS
753.071 665.732 L
753.071 723.643 L
695.143 723.643 L
695.143 665.732 LE
695.143 607.821 LS
753.071 607.821 L
753.071 665.732 L
695.143 665.732 L
695.143 607.821 LE
695.143 549.911 LS
753.071 549.911 L
753.071 607.821 L
695.143 607.821 L
695.143 549.911 LE
695.143 492 LS
753.071 492 L
753.071 549.911 L
695.143 549.911 L
695.143 492 LE
695.143 434.089 LS
753.071 434.089 L
753.071 492 L
695.143 492 L
695.143 434.089 LE
695.143 376.179 LS
753.071 376.179 L
753.071 434.089 L
695.143 434.089 L
695.143 376.179 LE
695.143 318.268 LS
753.071 318.268 L
753.071 376.179 L
695.143 376.179 L
695.143 318.268 LE
695.143 260.357 LS
753.071 260.357 L
753.071 318.268 L
695.143 318.268 L
695.143 260.357 LE
695.143 202.446 LS
753.071 202.446 L
753.071 260.357 L
695.143 260.357 L
695.143 202.446 LE
753.071 723.643 LS
811 723.643 L
811 781.554 L
753.071 781.554 L
753.071 723.643 LE
753.071 665.732 LS
811 665.732 L
811 723.643 L
753.071 723.643 L
753.071 665.732 LE
753.071 607.821 LS
811 607.821 L
811 665.732 L
753.071 665.732 L
753.071 607.821 LE
753.071 549.911 LS
811 549.911 L
811 607.821 L
753.071 607.821 L
753.071 549.911 LE
753.071 492 LS
811 492 L
811 549.911 L
753.071 549.911 L
753.071 492 LE
753.071 434.089 LS
811 434.089 L
811 492 L
753.071 492 L
753.071 434.089 LE
753.071 376.179 LS
811 376.179 L
811 434.089 L
753.071 434.089 L
753.071 376.179 LE
753.071 318.268 LS
811 318.268 L
811 376.179 L
753.071 376.179 L
753.071 318.268 LE
753.071 260.357 LS
811 260.357 L
811 318.268 L
753.071 318.268 L
753.071 260.357 LE
753.071 202.446 LS
811 202.446 L
811 260.357 L
753.071 260.357 L
753.071 202.446 LE
grestore

/Helvetica findfont 10 scalefont setfont	
205 800 moveto
(A) show
797 800 moveto
(B) show
1393 800 moveto
(C) show
205 150 moveto
(D) show
797 150 moveto
(E) show
1393 150 moveto
(F) show


showpage
cleartomark
%%PageTrailer
%%Trailer
end
%%EOF
