%!PS-Adobe-3.0 EPSF-3.0
%%Title: rectangle-non-unif-extrude
%%Creator: GL2PS 1.4.3, (C) 1999-2020 C. Geuzaine
%%For: Gmsh
%%CreationDate: Sat Nov 23 18:36:58 2024
%%LanguageLevel: 3
%%DocumentData: Clean7Bit
%%Pages: 1
%%BoundingBox: 160 180 1006 470
%%EndComments
%%BeginProlog
/gl2psdict 64 dict def gl2psdict begin
/tryPS3shading false def % set to false to force subdivision
/rThreshold 0.0666667 def % red component subdivision threshold
/gThreshold 0.05 def % green component subdivision threshold
/bThreshold 0.1 def % blue component subdivision threshold
/BD { bind def } bind def
/C  { setrgbcolor } BD
/G  { 0.082 mul exch 0.6094 mul add exch 0.3086 mul add neg 1.0 add setgray } BD
/W  { setlinewidth } BD
/LC  { setlinecap } BD
/LJ  { setlinejoin } BD
/FC { findfont exch /SH exch def SH scalefont setfont } BD
/SW { dup stringwidth pop } BD
/S  { FC moveto show } BD
/SBC{ FC moveto SW -2 div 0 rmoveto show } BD
/SBR{ FC moveto SW neg 0 rmoveto show } BD
/SCL{ FC moveto 0 SH -2 div rmoveto show } BD
/SCC{ FC moveto SW -2 div SH -2 div rmoveto show } BD
/SCR{ FC moveto SW neg SH -2 div rmoveto show } BD
/STL{ FC moveto 0 SH neg rmoveto show } BD
/STC{ FC moveto SW -2 div SH neg rmoveto show } BD
/STR{ FC moveto SW neg SH neg rmoveto show } BD
/FCT { FC translate 0 0 } BD
/SR  { gsave FCT moveto rotate show grestore } BD
/SBCR{ gsave FCT moveto rotate SW -2 div 0 rmoveto show grestore } BD
/SBRR{ gsave FCT moveto rotate SW neg 0 rmoveto show grestore } BD
/SCLR{ gsave FCT moveto rotate 0 SH -2 div rmoveto show grestore} BD
/SCCR{ gsave FCT moveto rotate SW -2 div SH -2 div rmoveto show grestore} BD
/SCRR{ gsave FCT moveto rotate SW neg SH -2 div rmoveto show grestore} BD
/STLR{ gsave FCT moveto rotate 0 SH neg rmoveto show grestore } BD
/STCR{ gsave FCT moveto rotate SW -2 div SH neg rmoveto show grestore } BD
/STRR{ gsave FCT moveto rotate SW neg SH neg rmoveto show grestore } BD
/P  { newpath 0.0 360.0 arc closepath fill } BD
/R  { newpath moveto lineto lineto lineto closepath fill } BD
/LS { newpath moveto } BD
/L  { lineto } BD
/LE { lineto stroke } BD
/T  { newpath moveto lineto lineto closepath fill } BD
/STshfill {
      /b1 exch def /g1 exch def /r1 exch def /y1 exch def /x1 exch def
      /b2 exch def /g2 exch def /r2 exch def /y2 exch def /x2 exch def
      /b3 exch def /g3 exch def /r3 exch def /y3 exch def /x3 exch def
      gsave << /ShadingType 4 /ColorSpace [/DeviceRGB]
      /DataSource [ 0 x1 y1 r1 g1 b1 0 x2 y2 r2 g2 b2 0 x3 y3 r3 g3 b3 ] >>
      shfill grestore } BD
/Tm { 3 -1 roll 8 -1 roll 13 -1 roll add add 3 div
      3 -1 roll 7 -1 roll 11 -1 roll add add 3 div
      3 -1 roll 6 -1 roll 9 -1 roll add add 3 div C T } BD
/STsplit {
      4 index 15 index add 0.5 mul
      4 index 15 index add 0.5 mul
      4 index 15 index add 0.5 mul
      4 index 15 index add 0.5 mul
      4 index 15 index add 0.5 mul
      5 copy 5 copy 25 15 roll
      9 index 30 index add 0.5 mul
      9 index 30 index add 0.5 mul
      9 index 30 index add 0.5 mul
      9 index 30 index add 0.5 mul
      9 index 30 index add 0.5 mul
      5 copy 5 copy 35 5 roll 25 5 roll 15 5 roll
      4 index 10 index add 0.5 mul
      4 index 10 index add 0.5 mul
      4 index 10 index add 0.5 mul
      4 index 10 index add 0.5 mul
      4 index 10 index add 0.5 mul
      5 copy 5 copy 40 5 roll 25 5 roll 15 5 roll 25 5 roll
      STnoshfill STnoshfill STnoshfill STnoshfill } BD
/STnoshfill {
      2 index 8 index sub abs rThreshold gt
      { STsplit }
      { 1 index 7 index sub abs gThreshold gt
        { STsplit }
        { dup 6 index sub abs bThreshold gt
          { STsplit }
          { 2 index 13 index sub abs rThreshold gt
            { STsplit }
            { 1 index 12 index sub abs gThreshold gt
              { STsplit }
              { dup 11 index sub abs bThreshold gt
                { STsplit }
                { 7 index 13 index sub abs rThreshold gt
                  { STsplit }
                  { 6 index 12 index sub abs gThreshold gt
                    { STsplit }
                    { 5 index 11 index sub abs bThreshold gt
                      { STsplit }
                      { Tm }
                      ifelse }
                    ifelse }
                  ifelse }
                ifelse }
              ifelse }
            ifelse }
          ifelse }
        ifelse }
      ifelse } BD
tryPS3shading
{ /shfill where
  { /ST { STshfill } BD }
  { /ST { STnoshfill } BD }
  ifelse }
{ /ST { STnoshfill } BD }
ifelse
end
%%EndProlog
%%BeginSetup
/DeviceRGB setcolorspace
gl2psdict begin
%%EndSetup
%%Page: 1 1
%%BeginPageSetup
%%EndPageSetup
mark
gsave
1.0 1.0 scale
1 W
1.05788 0.510338 0.0236322 C
175.04 465.31 LS
166.571 465.31 L
166.571 432.128 L
175.04 432.128 L
175.04 465.31 LE
175.04 432.128 LS
166.571 432.128 L
166.571 401.963 L
175.04 401.963 L
175.04 432.128 LE
175.04 401.963 LS
166.571 401.963 L
166.571 374.54 L
175.04 374.54 L
175.04 401.963 LE
175.04 374.54 LS
166.571 374.54 L
166.571 349.611 L
175.04 349.611 L
175.04 374.54 LE
175.04 349.611 LS
166.571 349.611 L
166.571 326.947 L
175.04 326.947 L
175.04 349.611 LE
175.04 326.947 LS
166.571 326.947 L
166.571 306.344 L
175.04 306.344 L
175.04 326.947 LE
175.04 306.344 LS
166.571 306.344 L
166.571 287.614 L
175.04 287.614 L
175.04 306.344 LE
175.04 287.614 LS
166.571 287.614 L
166.571 270.587 L
175.04 270.587 L
175.04 287.614 LE
175.04 270.587 LS
166.571 270.587 L
166.571 255.107 L
175.04 255.107 L
175.04 270.587 LE
175.04 255.107 LS
166.571 255.107 L
166.571 241.035 L
175.04 241.035 L
175.04 255.107 LE
175.04 241.035 LS
166.571 241.035 L
166.571 228.242 L
175.04 228.242 L
175.04 241.035 LE
175.04 228.242 LS
166.571 228.242 L
166.571 216.612 L
175.04 216.612 L
175.04 228.242 LE
175.04 216.612 LS
166.571 216.612 L
166.571 206.04 L
175.04 206.04 L
175.04 216.612 LE
175.04 206.04 LS
166.571 206.04 L
166.571 196.428 L
175.04 196.428 L
175.04 206.04 LE
175.04 196.428 LS
166.571 196.428 L
166.571 187.69 L
175.04 187.69 L
175.04 196.428 LE
184.355 465.31 LS
175.04 465.31 L
175.04 432.128 L
184.355 432.128 L
184.355 465.31 LE
184.355 432.128 LS
175.04 432.128 L
175.04 401.963 L
184.355 401.963 L
184.355 432.128 LE
184.355 401.963 LS
175.04 401.963 L
175.04 374.54 L
184.355 374.54 L
184.355 401.963 LE
184.355 374.54 LS
175.04 374.54 L
175.04 349.611 L
184.355 349.611 L
184.355 374.54 LE
184.355 349.611 LS
175.04 349.611 L
175.04 326.947 L
184.355 326.947 L
184.355 349.611 LE
184.355 326.947 LS
175.04 326.947 L
175.04 306.344 L
184.355 306.344 L
184.355 326.947 LE
184.355 306.344 LS
175.04 306.344 L
175.04 287.614 L
184.355 287.614 L
184.355 306.344 LE
184.355 287.614 LS
175.04 287.614 L
175.04 270.587 L
184.355 270.587 L
184.355 287.614 LE
184.355 270.587 LS
175.04 270.587 L
175.04 255.107 L
184.355 255.107 L
184.355 270.587 LE
184.355 255.107 LS
175.04 255.107 L
175.04 241.035 L
184.355 241.035 L
184.355 255.107 LE
184.355 241.035 LS
175.04 241.035 L
175.04 228.242 L
184.355 228.242 L
184.355 241.035 LE
184.355 228.242 LS
175.04 228.242 L
175.04 216.612 L
184.355 216.612 L
184.355 228.242 LE
184.355 216.612 LS
175.04 216.612 L
175.04 206.04 L
184.355 206.04 L
184.355 216.612 LE
184.355 206.04 LS
175.04 206.04 L
175.04 196.428 L
184.355 196.428 L
184.355 206.04 LE
184.355 196.428 LS
175.04 196.428 L
175.04 187.69 L
184.355 187.69 L
184.355 196.428 LE
194.602 465.31 LS
184.355 465.31 L
184.355 432.128 L
194.602 432.128 L
194.602 465.31 LE
194.602 432.128 LS
184.355 432.128 L
184.355 401.963 L
194.602 401.963 L
194.602 432.128 LE
194.602 401.963 LS
184.355 401.963 L
184.355 374.54 L
194.602 374.54 L
194.602 401.963 LE
194.602 374.54 LS
184.355 374.54 L
184.355 349.611 L
194.602 349.611 L
194.602 374.54 LE
194.602 349.611 LS
184.355 349.611 L
184.355 326.947 L
194.602 326.947 L
194.602 349.611 LE
194.602 326.947 LS
184.355 326.947 L
184.355 306.344 L
194.602 306.344 L
194.602 326.947 LE
194.602 306.344 LS
184.355 306.344 L
184.355 287.614 L
194.602 287.614 L
194.602 306.344 LE
194.602 287.614 LS
184.355 287.614 L
184.355 270.587 L
194.602 270.587 L
194.602 287.614 LE
194.602 270.587 LS
184.355 270.587 L
184.355 255.107 L
194.602 255.107 L
194.602 270.587 LE
194.602 255.107 LS
184.355 255.107 L
184.355 241.035 L
194.602 241.035 L
194.602 255.107 LE
194.602 241.035 LS
184.355 241.035 L
184.355 228.242 L
194.602 228.242 L
194.602 241.035 LE
194.602 228.242 LS
184.355 228.242 L
184.355 216.612 L
194.602 216.612 L
194.602 228.242 LE
194.602 216.612 LS
184.355 216.612 L
184.355 206.04 L
194.602 206.04 L
194.602 216.612 LE
194.602 206.04 LS
184.355 206.04 L
184.355 196.428 L
194.602 196.428 L
194.602 206.04 LE
194.602 196.428 LS
184.355 196.428 L
184.355 187.69 L
194.602 187.69 L
194.602 196.428 LE
205.874 465.31 LS
194.602 465.31 L
194.602 432.128 L
205.874 432.128 L
205.874 465.31 LE
205.874 432.128 LS
194.602 432.128 L
194.602 401.963 L
205.874 401.963 L
205.874 432.128 LE
205.874 401.963 LS
194.602 401.963 L
194.602 374.54 L
205.874 374.54 L
205.874 401.963 LE
205.874 374.54 LS
194.602 374.54 L
194.602 349.611 L
205.874 349.611 L
205.874 374.54 LE
205.874 349.611 LS
194.602 349.611 L
194.602 326.947 L
205.874 326.947 L
205.874 349.611 LE
205.874 326.947 LS
194.602 326.947 L
194.602 306.344 L
205.874 306.344 L
205.874 326.947 LE
205.874 306.344 LS
194.602 306.344 L
194.602 287.614 L
205.874 287.614 L
205.874 306.344 LE
205.874 287.614 LS
194.602 287.614 L
194.602 270.587 L
205.874 270.587 L
205.874 287.614 LE
205.874 270.587 LS
194.602 270.587 L
194.602 255.107 L
205.874 255.107 L
205.874 270.587 LE
205.874 255.107 LS
194.602 255.107 L
194.602 241.035 L
205.874 241.035 L
205.874 255.107 LE
205.874 241.035 LS
194.602 241.035 L
194.602 228.242 L
205.874 228.242 L
205.874 241.035 LE
205.874 228.242 LS
194.602 228.242 L
194.602 216.612 L
205.874 216.612 L
205.874 228.242 LE
205.874 216.612 LS
194.602 216.612 L
194.602 206.04 L
205.874 206.04 L
205.874 216.612 LE
205.874 206.04 LS
194.602 206.04 L
194.602 196.428 L
205.874 196.428 L
205.874 206.04 LE
205.874 196.428 LS
194.602 196.428 L
194.602 187.69 L
205.874 187.69 L
205.874 196.428 LE
218.273 465.31 LS
205.874 465.31 L
205.874 432.128 L
218.273 432.128 L
218.273 465.31 LE
218.273 432.128 LS
205.874 432.128 L
205.874 401.963 L
218.273 401.963 L
218.273 432.128 LE
218.273 401.963 LS
205.874 401.963 L
205.874 374.54 L
218.273 374.54 L
218.273 401.963 LE
218.273 374.54 LS
205.874 374.54 L
205.874 349.611 L
218.273 349.611 L
218.273 374.54 LE
218.273 349.611 LS
205.874 349.611 L
205.874 326.947 L
218.273 326.947 L
218.273 349.611 LE
218.273 326.947 LS
205.874 326.947 L
205.874 306.344 L
218.273 306.344 L
218.273 326.947 LE
218.273 306.344 LS
205.874 306.344 L
205.874 287.614 L
218.273 287.614 L
218.273 306.344 LE
218.273 287.614 LS
205.874 287.614 L
205.874 270.587 L
218.273 270.587 L
218.273 287.614 LE
218.273 270.587 LS
205.874 270.587 L
205.874 255.107 L
218.273 255.107 L
218.273 270.587 LE
218.273 255.107 LS
205.874 255.107 L
205.874 241.035 L
218.273 241.035 L
218.273 255.107 LE
218.273 241.035 LS
205.874 241.035 L
205.874 228.242 L
218.273 228.242 L
218.273 241.035 LE
218.273 228.242 LS
205.874 228.242 L
205.874 216.612 L
218.273 216.612 L
218.273 228.242 LE
218.273 216.612 LS
205.874 216.612 L
205.874 206.04 L
218.273 206.04 L
218.273 216.612 LE
218.273 206.04 LS
205.874 206.04 L
205.874 196.428 L
218.273 196.428 L
218.273 206.04 LE
218.273 196.428 LS
205.874 196.428 L
205.874 187.69 L
218.273 187.69 L
218.273 196.428 LE
231.912 465.31 LS
218.273 465.31 L
218.273 432.128 L
231.912 432.128 L
231.912 465.31 LE
231.912 432.128 LS
218.273 432.128 L
218.273 401.963 L
231.912 401.963 L
231.912 432.128 LE
231.912 401.963 LS
218.273 401.963 L
218.273 374.54 L
231.912 374.54 L
231.912 401.963 LE
231.912 374.54 LS
218.273 374.54 L
218.273 349.611 L
231.912 349.611 L
231.912 374.54 LE
231.912 349.611 LS
218.273 349.611 L
218.273 326.947 L
231.912 326.947 L
231.912 349.611 LE
231.912 326.947 LS
218.273 326.947 L
218.273 306.344 L
231.912 306.344 L
231.912 326.947 LE
231.912 306.344 LS
218.273 306.344 L
218.273 287.614 L
231.912 287.614 L
231.912 306.344 LE
231.912 287.614 LS
218.273 287.614 L
218.273 270.587 L
231.912 270.587 L
231.912 287.614 LE
231.912 270.587 LS
218.273 270.587 L
218.273 255.107 L
231.912 255.107 L
231.912 270.587 LE
231.912 255.107 LS
218.273 255.107 L
218.273 241.035 L
231.912 241.035 L
231.912 255.107 LE
231.912 241.035 LS
218.273 241.035 L
218.273 228.242 L
231.912 228.242 L
231.912 241.035 LE
231.912 228.242 LS
218.273 228.242 L
218.273 216.612 L
231.912 216.612 L
231.912 228.242 LE
231.912 216.612 LS
218.273 216.612 L
218.273 206.04 L
231.912 206.04 L
231.912 216.612 LE
231.912 206.04 LS
218.273 206.04 L
218.273 196.428 L
231.912 196.428 L
231.912 206.04 LE
231.912 196.428 LS
218.273 196.428 L
218.273 187.69 L
231.912 187.69 L
231.912 196.428 LE
246.914 465.31 LS
231.912 465.31 L
231.912 432.128 L
246.914 432.128 L
246.914 465.31 LE
246.914 432.128 LS
231.912 432.128 L
231.912 401.963 L
246.914 401.963 L
246.914 432.128 LE
246.914 401.963 LS
231.912 401.963 L
231.912 374.54 L
246.914 374.54 L
246.914 401.963 LE
246.914 374.54 LS
231.912 374.54 L
231.912 349.611 L
246.914 349.611 L
246.914 374.54 LE
246.914 349.611 LS
231.912 349.611 L
231.912 326.947 L
246.914 326.947 L
246.914 349.611 LE
246.914 326.947 LS
231.912 326.947 L
231.912 306.344 L
246.914 306.344 L
246.914 326.947 LE
246.914 306.344 LS
231.912 306.344 L
231.912 287.614 L
246.914 287.614 L
246.914 306.344 LE
246.914 287.614 LS
231.912 287.614 L
231.912 270.587 L
246.914 270.587 L
246.914 287.614 LE
246.914 270.587 LS
231.912 270.587 L
231.912 255.107 L
246.914 255.107 L
246.914 270.587 LE
246.914 255.107 LS
231.912 255.107 L
231.912 241.035 L
246.914 241.035 L
246.914 255.107 LE
246.914 241.035 LS
231.912 241.035 L
231.912 228.242 L
246.914 228.242 L
246.914 241.035 LE
246.914 228.242 LS
231.912 228.242 L
231.912 216.612 L
246.914 216.612 L
246.914 228.242 LE
246.914 216.612 LS
231.912 216.612 L
231.912 206.04 L
246.914 206.04 L
246.914 216.612 LE
246.914 206.04 LS
231.912 206.04 L
231.912 196.428 L
246.914 196.428 L
246.914 206.04 LE
246.914 196.428 LS
231.912 196.428 L
231.912 187.69 L
246.914 187.69 L
246.914 196.428 LE
263.417 465.31 LS
246.914 465.31 L
246.914 432.128 L
263.417 432.128 L
263.417 465.31 LE
263.417 432.128 LS
246.914 432.128 L
246.914 401.963 L
263.417 401.963 L
263.417 432.128 LE
263.417 401.963 LS
246.914 401.963 L
246.914 374.54 L
263.417 374.54 L
263.417 401.963 LE
263.417 374.54 LS
246.914 374.54 L
246.914 349.611 L
263.417 349.611 L
263.417 374.54 LE
263.417 349.611 LS
246.914 349.611 L
246.914 326.947 L
263.417 326.947 L
263.417 349.611 LE
263.417 326.947 LS
246.914 326.947 L
246.914 306.344 L
263.417 306.344 L
263.417 326.947 LE
263.417 306.344 LS
246.914 306.344 L
246.914 287.614 L
263.417 287.614 L
263.417 306.344 LE
263.417 287.614 LS
246.914 287.614 L
246.914 270.587 L
263.417 270.587 L
263.417 287.614 LE
263.417 270.587 LS
246.914 270.587 L
246.914 255.107 L
263.417 255.107 L
263.417 270.587 LE
263.417 255.107 LS
246.914 255.107 L
246.914 241.035 L
263.417 241.035 L
263.417 255.107 LE
263.417 241.035 LS
246.914 241.035 L
246.914 228.242 L
263.417 228.242 L
263.417 241.035 LE
263.417 228.242 LS
246.914 228.242 L
246.914 216.612 L
263.417 216.612 L
263.417 228.242 LE
263.417 216.612 LS
246.914 216.612 L
246.914 206.04 L
263.417 206.04 L
263.417 216.612 LE
263.417 206.04 LS
246.914 206.04 L
246.914 196.428 L
263.417 196.428 L
263.417 206.04 LE
263.417 196.428 LS
246.914 196.428 L
246.914 187.69 L
263.417 187.69 L
263.417 196.428 LE
281.57 465.31 LS
263.417 465.31 L
263.417 432.128 L
281.57 432.128 L
281.57 465.31 LE
281.57 432.128 LS
263.417 432.128 L
263.417 401.963 L
281.57 401.963 L
281.57 432.128 LE
281.57 401.963 LS
263.417 401.963 L
263.417 374.54 L
281.57 374.54 L
281.57 401.963 LE
281.57 374.54 LS
263.417 374.54 L
263.417 349.611 L
281.57 349.611 L
281.57 374.54 LE
281.57 349.611 LS
263.417 349.611 L
263.417 326.947 L
281.57 326.947 L
281.57 349.611 LE
281.57 326.947 LS
263.417 326.947 L
263.417 306.344 L
281.57 306.344 L
281.57 326.947 LE
281.57 306.344 LS
263.417 306.344 L
263.417 287.614 L
281.57 287.614 L
281.57 306.344 LE
281.57 287.614 LS
263.417 287.614 L
263.417 270.587 L
281.57 270.587 L
281.57 287.614 LE
281.57 270.587 LS
263.417 270.587 L
263.417 255.107 L
281.57 255.107 L
281.57 270.587 LE
281.57 255.107 LS
263.417 255.107 L
263.417 241.035 L
281.57 241.035 L
281.57 255.107 LE
281.57 241.035 LS
263.417 241.035 L
263.417 228.242 L
281.57 228.242 L
281.57 241.035 LE
281.57 228.242 LS
263.417 228.242 L
263.417 216.612 L
281.57 216.612 L
281.57 228.242 LE
281.57 216.612 LS
263.417 216.612 L
263.417 206.04 L
281.57 206.04 L
281.57 216.612 LE
281.57 206.04 LS
263.417 206.04 L
263.417 196.428 L
281.57 196.428 L
281.57 206.04 LE
281.57 196.428 LS
263.417 196.428 L
263.417 187.69 L
281.57 187.69 L
281.57 196.428 LE
301.538 465.31 LS
281.57 465.31 L
281.57 432.128 L
301.538 432.128 L
301.538 465.31 LE
301.538 432.128 LS
281.57 432.128 L
281.57 401.963 L
301.538 401.963 L
301.538 432.128 LE
301.538 401.963 LS
281.57 401.963 L
281.57 374.54 L
301.538 374.54 L
301.538 401.963 LE
301.538 374.54 LS
281.57 374.54 L
281.57 349.611 L
301.538 349.611 L
301.538 374.54 LE
301.538 349.611 LS
281.57 349.611 L
281.57 326.947 L
301.538 326.947 L
301.538 349.611 LE
301.538 326.947 LS
281.57 326.947 L
281.57 306.344 L
301.538 306.344 L
301.538 326.947 LE
301.538 306.344 LS
281.57 306.344 L
281.57 287.614 L
301.538 287.614 L
301.538 306.344 LE
301.538 287.614 LS
281.57 287.614 L
281.57 270.587 L
301.538 270.587 L
301.538 287.614 LE
301.538 270.587 LS
281.57 270.587 L
281.57 255.107 L
301.538 255.107 L
301.538 270.587 LE
301.538 255.107 LS
281.57 255.107 L
281.57 241.035 L
301.538 241.035 L
301.538 255.107 LE
301.538 241.035 LS
281.57 241.035 L
281.57 228.242 L
301.538 228.242 L
301.538 241.035 LE
301.538 228.242 LS
281.57 228.242 L
281.57 216.612 L
301.538 216.612 L
301.538 228.242 LE
301.538 216.612 LS
281.57 216.612 L
281.57 206.04 L
301.538 206.04 L
301.538 216.612 LE
301.538 206.04 LS
281.57 206.04 L
281.57 196.428 L
301.538 196.428 L
301.538 206.04 LE
301.538 196.428 LS
281.57 196.428 L
281.57 187.69 L
301.538 187.69 L
301.538 196.428 LE
323.504 465.31 LS
301.538 465.31 L
301.538 432.128 L
323.504 432.128 L
323.504 465.31 LE
323.504 432.128 LS
301.538 432.128 L
301.538 401.963 L
323.504 401.963 L
323.504 432.128 LE
323.504 401.963 LS
301.538 401.963 L
301.538 374.54 L
323.504 374.54 L
323.504 401.963 LE
323.504 374.54 LS
301.538 374.54 L
301.538 349.611 L
323.504 349.611 L
323.504 374.54 LE
323.504 349.611 LS
301.538 349.611 L
301.538 326.947 L
323.504 326.947 L
323.504 349.611 LE
323.504 326.947 LS
301.538 326.947 L
301.538 306.344 L
323.504 306.344 L
323.504 326.947 LE
323.504 306.344 LS
301.538 306.344 L
301.538 287.614 L
323.504 287.614 L
323.504 306.344 LE
323.504 287.614 LS
301.538 287.614 L
301.538 270.587 L
323.504 270.587 L
323.504 287.614 LE
323.504 270.587 LS
301.538 270.587 L
301.538 255.107 L
323.504 255.107 L
323.504 270.587 LE
323.504 255.107 LS
301.538 255.107 L
301.538 241.035 L
323.504 241.035 L
323.504 255.107 LE
323.504 241.035 LS
301.538 241.035 L
301.538 228.242 L
323.504 228.242 L
323.504 241.035 LE
323.504 228.242 LS
301.538 228.242 L
301.538 216.612 L
323.504 216.612 L
323.504 228.242 LE
323.504 216.612 LS
301.538 216.612 L
301.538 206.04 L
323.504 206.04 L
323.504 216.612 LE
323.504 206.04 LS
301.538 206.04 L
301.538 196.428 L
323.504 196.428 L
323.504 206.04 LE
323.504 196.428 LS
301.538 196.428 L
301.538 187.69 L
323.504 187.69 L
323.504 196.428 LE
347.665 465.31 LS
323.504 465.31 L
323.504 432.128 L
347.665 432.128 L
347.665 465.31 LE
347.665 432.128 LS
323.504 432.128 L
323.504 401.963 L
347.665 401.963 L
347.665 432.128 LE
347.665 401.963 LS
323.504 401.963 L
323.504 374.54 L
347.665 374.54 L
347.665 401.963 LE
347.665 374.54 LS
323.504 374.54 L
323.504 349.611 L
347.665 349.611 L
347.665 374.54 LE
347.665 349.611 LS
323.504 349.611 L
323.504 326.947 L
347.665 326.947 L
347.665 349.611 LE
347.665 326.947 LS
323.504 326.947 L
323.504 306.344 L
347.665 306.344 L
347.665 326.947 LE
347.665 306.344 LS
323.504 306.344 L
323.504 287.614 L
347.665 287.614 L
347.665 306.344 LE
347.665 287.614 LS
323.504 287.614 L
323.504 270.587 L
347.665 270.587 L
347.665 287.614 LE
347.665 270.587 LS
323.504 270.587 L
323.504 255.107 L
347.665 255.107 L
347.665 270.587 LE
347.665 255.107 LS
323.504 255.107 L
323.504 241.035 L
347.665 241.035 L
347.665 255.107 LE
347.665 241.035 LS
323.504 241.035 L
323.504 228.242 L
347.665 228.242 L
347.665 241.035 LE
347.665 228.242 LS
323.504 228.242 L
323.504 216.612 L
347.665 216.612 L
347.665 228.242 LE
347.665 216.612 LS
323.504 216.612 L
323.504 206.04 L
347.665 206.04 L
347.665 216.612 LE
347.665 206.04 LS
323.504 206.04 L
323.504 196.428 L
347.665 196.428 L
347.665 206.04 LE
347.665 196.428 LS
323.504 196.428 L
323.504 187.69 L
347.665 187.69 L
347.665 196.428 LE
374.243 465.31 LS
347.665 465.31 L
347.665 432.128 L
374.243 432.128 L
374.243 465.31 LE
374.243 432.128 LS
347.665 432.128 L
347.665 401.963 L
374.243 401.963 L
374.243 432.128 LE
374.243 401.963 LS
347.665 401.963 L
347.665 374.54 L
374.243 374.54 L
374.243 401.963 LE
374.243 374.54 LS
347.665 374.54 L
347.665 349.611 L
374.243 349.611 L
374.243 374.54 LE
374.243 349.611 LS
347.665 349.611 L
347.665 326.947 L
374.243 326.947 L
374.243 349.611 LE
374.243 326.947 LS
347.665 326.947 L
347.665 306.344 L
374.243 306.344 L
374.243 326.947 LE
374.243 306.344 LS
347.665 306.344 L
347.665 287.614 L
374.243 287.614 L
374.243 306.344 LE
374.243 287.614 LS
347.665 287.614 L
347.665 270.587 L
374.243 270.587 L
374.243 287.614 LE
374.243 270.587 LS
347.665 270.587 L
347.665 255.107 L
374.243 255.107 L
374.243 270.587 LE
374.243 255.107 LS
347.665 255.107 L
347.665 241.035 L
374.243 241.035 L
374.243 255.107 LE
374.243 241.035 LS
347.665 241.035 L
347.665 228.242 L
374.243 228.242 L
374.243 241.035 LE
374.243 228.242 LS
347.665 228.242 L
347.665 216.612 L
374.243 216.612 L
374.243 228.242 LE
374.243 216.612 LS
347.665 216.612 L
347.665 206.04 L
374.243 206.04 L
374.243 216.612 LE
374.243 206.04 LS
347.665 206.04 L
347.665 196.428 L
374.243 196.428 L
374.243 206.04 LE
374.243 196.428 LS
347.665 196.428 L
347.665 187.69 L
374.243 187.69 L
374.243 196.428 LE
403.479 465.31 LS
374.243 465.31 L
374.243 432.128 L
403.479 432.128 L
403.479 465.31 LE
403.479 432.128 LS
374.243 432.128 L
374.243 401.963 L
403.479 401.963 L
403.479 432.128 LE
403.479 401.963 LS
374.243 401.963 L
374.243 374.54 L
403.479 374.54 L
403.479 401.963 LE
403.479 374.54 LS
374.243 374.54 L
374.243 349.611 L
403.479 349.611 L
403.479 374.54 LE
403.479 349.611 LS
374.243 349.611 L
374.243 326.947 L
403.479 326.947 L
403.479 349.611 LE
403.479 326.947 LS
374.243 326.947 L
374.243 306.344 L
403.479 306.344 L
403.479 326.947 LE
403.479 306.344 LS
374.243 306.344 L
374.243 287.614 L
403.479 287.614 L
403.479 306.344 LE
403.479 287.614 LS
374.243 287.614 L
374.243 270.587 L
403.479 270.587 L
403.479 287.614 LE
403.479 270.587 LS
374.243 270.587 L
374.243 255.107 L
403.479 255.107 L
403.479 270.587 LE
403.479 255.107 LS
374.243 255.107 L
374.243 241.035 L
403.479 241.035 L
403.479 255.107 LE
403.479 241.035 LS
374.243 241.035 L
374.243 228.242 L
403.479 228.242 L
403.479 241.035 LE
403.479 228.242 LS
374.243 228.242 L
374.243 216.612 L
403.479 216.612 L
403.479 228.242 LE
403.479 216.612 LS
374.243 216.612 L
374.243 206.04 L
403.479 206.04 L
403.479 216.612 LE
403.479 206.04 LS
374.243 206.04 L
374.243 196.428 L
403.479 196.428 L
403.479 206.04 LE
403.479 196.428 LS
374.243 196.428 L
374.243 187.69 L
403.479 187.69 L
403.479 196.428 LE
435.638 465.31 LS
403.479 465.31 L
403.479 432.128 L
435.638 432.128 L
435.638 465.31 LE
435.638 432.128 LS
403.479 432.128 L
403.479 401.963 L
435.638 401.963 L
435.638 432.128 LE
435.638 401.963 LS
403.479 401.963 L
403.479 374.54 L
435.638 374.54 L
435.638 401.963 LE
435.638 374.54 LS
403.479 374.54 L
403.479 349.611 L
435.638 349.611 L
435.638 374.54 LE
435.638 349.611 LS
403.479 349.611 L
403.479 326.947 L
435.638 326.947 L
435.638 349.611 LE
435.638 326.947 LS
403.479 326.947 L
403.479 306.344 L
435.638 306.344 L
435.638 326.947 LE
435.638 306.344 LS
403.479 306.344 L
403.479 287.614 L
435.638 287.614 L
435.638 306.344 LE
435.638 287.614 LS
403.479 287.614 L
403.479 270.587 L
435.638 270.587 L
435.638 287.614 LE
435.638 270.587 LS
403.479 270.587 L
403.479 255.107 L
435.638 255.107 L
435.638 270.587 LE
435.638 255.107 LS
403.479 255.107 L
403.479 241.035 L
435.638 241.035 L
435.638 255.107 LE
435.638 241.035 LS
403.479 241.035 L
403.479 228.242 L
435.638 228.242 L
435.638 241.035 LE
435.638 228.242 LS
403.479 228.242 L
403.479 216.612 L
435.638 216.612 L
435.638 228.242 LE
435.638 216.612 LS
403.479 216.612 L
403.479 206.04 L
435.638 206.04 L
435.638 216.612 LE
435.638 206.04 LS
403.479 206.04 L
403.479 196.428 L
435.638 196.428 L
435.638 206.04 LE
435.638 196.428 LS
403.479 196.428 L
403.479 187.69 L
435.638 187.69 L
435.638 196.428 LE
471.014 465.31 LS
435.638 465.31 L
435.638 432.128 L
471.014 432.128 L
471.014 465.31 LE
471.014 432.128 LS
435.638 432.128 L
435.638 401.963 L
471.014 401.963 L
471.014 432.128 LE
471.014 401.963 LS
435.638 401.963 L
435.638 374.54 L
471.014 374.54 L
471.014 401.963 LE
471.014 374.54 LS
435.638 374.54 L
435.638 349.611 L
471.014 349.611 L
471.014 374.54 LE
471.014 349.611 LS
435.638 349.611 L
435.638 326.947 L
471.014 326.947 L
471.014 349.611 LE
471.014 326.947 LS
435.638 326.947 L
435.638 306.344 L
471.014 306.344 L
471.014 326.947 LE
471.014 306.344 LS
435.638 306.344 L
435.638 287.614 L
471.014 287.614 L
471.014 306.344 LE
471.014 287.614 LS
435.638 287.614 L
435.638 270.587 L
471.014 270.587 L
471.014 287.614 LE
471.014 270.587 LS
435.638 270.587 L
435.638 255.107 L
471.014 255.107 L
471.014 270.587 LE
471.014 255.107 LS
435.638 255.107 L
435.638 241.035 L
471.014 241.035 L
471.014 255.107 LE
471.014 241.035 LS
435.638 241.035 L
435.638 228.242 L
471.014 228.242 L
471.014 241.035 LE
471.014 228.242 LS
435.638 228.242 L
435.638 216.612 L
471.014 216.612 L
471.014 228.242 LE
471.014 216.612 LS
435.638 216.612 L
435.638 206.04 L
471.014 206.04 L
471.014 216.612 LE
471.014 206.04 LS
435.638 206.04 L
435.638 196.428 L
471.014 196.428 L
471.014 206.04 LE
471.014 196.428 LS
435.638 196.428 L
435.638 187.69 L
471.014 187.69 L
471.014 196.428 LE
509.925 465.31 LS
471.014 465.31 L
471.014 432.128 L
509.925 432.128 L
509.925 465.31 LE
509.925 432.128 LS
471.014 432.128 L
471.014 401.963 L
509.925 401.963 L
509.925 432.128 LE
509.925 401.963 LS
471.014 401.963 L
471.014 374.54 L
509.925 374.54 L
509.925 401.963 LE
509.925 374.54 LS
471.014 374.54 L
471.014 349.611 L
509.925 349.611 L
509.925 374.54 LE
509.925 349.611 LS
471.014 349.611 L
471.014 326.947 L
509.925 326.947 L
509.925 349.611 LE
509.925 326.947 LS
471.014 326.947 L
471.014 306.344 L
509.925 306.344 L
509.925 326.947 LE
509.925 306.344 LS
471.014 306.344 L
471.014 287.614 L
509.925 287.614 L
509.925 306.344 LE
509.925 287.614 LS
471.014 287.614 L
471.014 270.587 L
509.925 270.587 L
509.925 287.614 LE
509.925 270.587 LS
471.014 270.587 L
471.014 255.107 L
509.925 255.107 L
509.925 270.587 LE
509.925 255.107 LS
471.014 255.107 L
471.014 241.035 L
509.925 241.035 L
509.925 255.107 LE
509.925 241.035 LS
471.014 241.035 L
471.014 228.242 L
509.925 228.242 L
509.925 241.035 LE
509.925 228.242 LS
471.014 228.242 L
471.014 216.612 L
509.925 216.612 L
509.925 228.242 LE
509.925 216.612 LS
471.014 216.612 L
471.014 206.04 L
509.925 206.04 L
509.925 216.612 LE
509.925 206.04 LS
471.014 206.04 L
471.014 196.428 L
509.925 196.428 L
509.925 206.04 LE
509.925 196.428 LS
471.014 196.428 L
471.014 187.69 L
509.925 187.69 L
509.925 196.428 LE
552.731 465.31 LS
509.925 465.31 L
509.925 432.128 L
552.731 432.128 L
552.731 465.31 LE
552.731 432.128 LS
509.925 432.128 L
509.925 401.963 L
552.731 401.963 L
552.731 432.128 LE
552.731 401.963 LS
509.925 401.963 L
509.925 374.54 L
552.731 374.54 L
552.731 401.963 LE
552.731 374.54 LS
509.925 374.54 L
509.925 349.611 L
552.731 349.611 L
552.731 374.54 LE
552.731 349.611 LS
509.925 349.611 L
509.925 326.947 L
552.731 326.947 L
552.731 349.611 LE
552.731 326.947 LS
509.925 326.947 L
509.925 306.344 L
552.731 306.344 L
552.731 326.947 LE
552.731 306.344 LS
509.925 306.344 L
509.925 287.614 L
552.731 287.614 L
552.731 306.344 LE
552.731 287.614 LS
509.925 287.614 L
509.925 270.587 L
552.731 270.587 L
552.731 287.614 LE
552.731 270.587 LS
509.925 270.587 L
509.925 255.107 L
552.731 255.107 L
552.731 270.587 LE
552.731 255.107 LS
509.925 255.107 L
509.925 241.035 L
552.731 241.035 L
552.731 255.107 LE
552.731 241.035 LS
509.925 241.035 L
509.925 228.242 L
552.731 228.242 L
552.731 241.035 LE
552.731 228.242 LS
509.925 228.242 L
509.925 216.612 L
552.731 216.612 L
552.731 228.242 LE
552.731 216.612 LS
509.925 216.612 L
509.925 206.04 L
552.731 206.04 L
552.731 216.612 LE
552.731 206.04 LS
509.925 206.04 L
509.925 196.428 L
552.731 196.428 L
552.731 206.04 LE
552.731 196.428 LS
509.925 196.428 L
509.925 187.69 L
552.731 187.69 L
552.731 196.428 LE
599.815 465.31 LS
552.731 465.31 L
552.731 432.128 L
599.815 432.128 L
599.815 465.31 LE
599.815 432.128 LS
552.731 432.128 L
552.731 401.963 L
599.815 401.963 L
599.815 432.128 LE
599.815 401.963 LS
552.731 401.963 L
552.731 374.54 L
599.815 374.54 L
599.815 401.963 LE
599.815 374.54 LS
552.731 374.54 L
552.731 349.611 L
599.815 349.611 L
599.815 374.54 LE
599.815 349.611 LS
552.731 349.611 L
552.731 326.947 L
599.815 326.947 L
599.815 349.611 LE
599.815 326.947 LS
552.731 326.947 L
552.731 306.344 L
599.815 306.344 L
599.815 326.947 LE
599.815 306.344 LS
552.731 306.344 L
552.731 287.614 L
599.815 287.614 L
599.815 306.344 LE
599.815 287.614 LS
552.731 287.614 L
552.731 270.587 L
599.815 270.587 L
599.815 287.614 LE
599.815 270.587 LS
552.731 270.587 L
552.731 255.107 L
599.815 255.107 L
599.815 270.587 LE
599.815 255.107 LS
552.731 255.107 L
552.731 241.035 L
599.815 241.035 L
599.815 255.107 LE
599.815 241.035 LS
552.731 241.035 L
552.731 228.242 L
599.815 228.242 L
599.815 241.035 LE
599.815 228.242 LS
552.731 228.242 L
552.731 216.612 L
599.815 216.612 L
599.815 228.242 LE
599.815 216.612 LS
552.731 216.612 L
552.731 206.04 L
599.815 206.04 L
599.815 216.612 LE
599.815 206.04 LS
552.731 206.04 L
552.731 196.428 L
599.815 196.428 L
599.815 206.04 LE
599.815 196.428 LS
552.731 196.428 L
552.731 187.69 L
599.815 187.69 L
599.815 196.428 LE
651.608 465.31 LS
599.815 465.31 L
599.815 432.128 L
651.608 432.128 L
651.608 465.31 LE
651.608 432.128 LS
599.815 432.128 L
599.815 401.963 L
651.608 401.963 L
651.608 432.128 LE
651.608 401.963 LS
599.815 401.963 L
599.815 374.54 L
651.608 374.54 L
651.608 401.963 LE
651.608 374.54 LS
599.815 374.54 L
599.815 349.611 L
651.608 349.611 L
651.608 374.54 LE
651.608 349.611 LS
599.815 349.611 L
599.815 326.947 L
651.608 326.947 L
651.608 349.611 LE
651.608 326.947 LS
599.815 326.947 L
599.815 306.344 L
651.608 306.344 L
651.608 326.947 LE
651.608 306.344 LS
599.815 306.344 L
599.815 287.614 L
651.608 287.614 L
651.608 306.344 LE
651.608 287.614 LS
599.815 287.614 L
599.815 270.587 L
651.608 270.587 L
651.608 287.614 LE
651.608 270.587 LS
599.815 270.587 L
599.815 255.107 L
651.608 255.107 L
651.608 270.587 LE
651.608 255.107 LS
599.815 255.107 L
599.815 241.035 L
651.608 241.035 L
651.608 255.107 LE
651.608 241.035 LS
599.815 241.035 L
599.815 228.242 L
651.608 228.242 L
651.608 241.035 LE
651.608 228.242 LS
599.815 228.242 L
599.815 216.612 L
651.608 216.612 L
651.608 228.242 LE
651.608 216.612 LS
599.815 216.612 L
599.815 206.04 L
651.608 206.04 L
651.608 216.612 LE
651.608 206.04 LS
599.815 206.04 L
599.815 196.428 L
651.608 196.428 L
651.608 206.04 LE
651.608 196.428 LS
599.815 196.428 L
599.815 187.69 L
651.608 187.69 L
651.608 196.428 LE
708.581 465.31 LS
651.608 465.31 L
651.608 432.128 L
708.581 432.128 L
708.581 465.31 LE
708.581 432.128 LS
651.608 432.128 L
651.608 401.963 L
708.581 401.963 L
708.581 432.128 LE
708.581 401.963 LS
651.608 401.963 L
651.608 374.54 L
708.581 374.54 L
708.581 401.963 LE
708.581 374.54 LS
651.608 374.54 L
651.608 349.611 L
708.581 349.611 L
708.581 374.54 LE
708.581 349.611 LS
651.608 349.611 L
651.608 326.947 L
708.581 326.947 L
708.581 349.611 LE
708.581 326.947 LS
651.608 326.947 L
651.608 306.344 L
708.581 306.344 L
708.581 326.947 LE
708.581 306.344 LS
651.608 306.344 L
651.608 287.614 L
708.581 287.614 L
708.581 306.344 LE
708.581 287.614 LS
651.608 287.614 L
651.608 270.587 L
708.581 270.587 L
708.581 287.614 LE
708.581 270.587 LS
651.608 270.587 L
651.608 255.107 L
708.581 255.107 L
708.581 270.587 LE
708.581 255.107 LS
651.608 255.107 L
651.608 241.035 L
708.581 241.035 L
708.581 255.107 LE
708.581 241.035 LS
651.608 241.035 L
651.608 228.242 L
708.581 228.242 L
708.581 241.035 LE
708.581 228.242 LS
651.608 228.242 L
651.608 216.612 L
708.581 216.612 L
708.581 228.242 LE
708.581 216.612 LS
651.608 216.612 L
651.608 206.04 L
708.581 206.04 L
708.581 216.612 LE
708.581 206.04 LS
651.608 206.04 L
651.608 196.428 L
708.581 196.428 L
708.581 206.04 LE
708.581 196.428 LS
651.608 196.428 L
651.608 187.69 L
708.581 187.69 L
708.581 196.428 LE
771.248 465.31 LS
708.581 465.31 L
708.581 432.128 L
771.248 432.128 L
771.248 465.31 LE
771.248 432.128 LS
708.581 432.128 L
708.581 401.963 L
771.248 401.963 L
771.248 432.128 LE
771.248 401.963 LS
708.581 401.963 L
708.581 374.54 L
771.248 374.54 L
771.248 401.963 LE
771.248 374.54 LS
708.581 374.54 L
708.581 349.611 L
771.248 349.611 L
771.248 374.54 LE
771.248 349.611 LS
708.581 349.611 L
708.581 326.947 L
771.248 326.947 L
771.248 349.611 LE
771.248 326.947 LS
708.581 326.947 L
708.581 306.344 L
771.248 306.344 L
771.248 326.947 LE
771.248 306.344 LS
708.581 306.344 L
708.581 287.614 L
771.248 287.614 L
771.248 306.344 LE
771.248 287.614 LS
708.581 287.614 L
708.581 270.587 L
771.248 270.587 L
771.248 287.614 LE
771.248 270.587 LS
708.581 270.587 L
708.581 255.107 L
771.248 255.107 L
771.248 270.587 LE
771.248 255.107 LS
708.581 255.107 L
708.581 241.035 L
771.248 241.035 L
771.248 255.107 LE
771.248 241.035 LS
708.581 241.035 L
708.581 228.242 L
771.248 228.242 L
771.248 241.035 LE
771.248 228.242 LS
708.581 228.242 L
708.581 216.612 L
771.248 216.612 L
771.248 228.242 LE
771.248 216.612 LS
708.581 216.612 L
708.581 206.04 L
771.248 206.04 L
771.248 216.612 LE
771.248 206.04 LS
708.581 206.04 L
708.581 196.428 L
771.248 196.428 L
771.248 206.04 LE
771.248 196.428 LS
708.581 196.428 L
708.581 187.69 L
771.248 187.69 L
771.248 196.428 LE
840.186 465.31 LS
771.248 465.31 L
771.248 432.128 L
840.186 432.128 L
840.186 465.31 LE
840.186 432.128 LS
771.248 432.128 L
771.248 401.963 L
840.186 401.963 L
840.186 432.128 LE
840.186 401.963 LS
771.248 401.963 L
771.248 374.54 L
840.186 374.54 L
840.186 401.963 LE
840.186 374.54 LS
771.248 374.54 L
771.248 349.611 L
840.186 349.611 L
840.186 374.54 LE
840.186 349.611 LS
771.248 349.611 L
771.248 326.947 L
840.186 326.947 L
840.186 349.611 LE
840.186 326.947 LS
771.248 326.947 L
771.248 306.344 L
840.186 306.344 L
840.186 326.947 LE
840.186 306.344 LS
771.248 306.344 L
771.248 287.614 L
840.186 287.614 L
840.186 306.344 LE
840.186 287.614 LS
771.248 287.614 L
771.248 270.587 L
840.186 270.587 L
840.186 287.614 LE
840.186 270.587 LS
771.248 270.587 L
771.248 255.107 L
840.186 255.107 L
840.186 270.587 LE
840.186 255.107 LS
771.248 255.107 L
771.248 241.035 L
840.186 241.035 L
840.186 255.107 LE
840.186 241.035 LS
771.248 241.035 L
771.248 228.242 L
840.186 228.242 L
840.186 241.035 LE
840.186 228.242 LS
771.248 228.242 L
771.248 216.612 L
840.186 216.612 L
840.186 228.242 LE
840.186 216.612 LS
771.248 216.612 L
771.248 206.04 L
840.186 206.04 L
840.186 216.612 LE
840.186 206.04 LS
771.248 206.04 L
771.248 196.428 L
840.186 196.428 L
840.186 206.04 LE
840.186 196.428 LS
771.248 196.428 L
771.248 187.69 L
840.186 187.69 L
840.186 196.428 LE
916.015 465.31 LS
840.186 465.31 L
840.186 432.128 L
916.015 432.128 L
916.015 465.31 LE
916.015 432.128 LS
840.186 432.128 L
840.186 401.963 L
916.015 401.963 L
916.015 432.128 LE
916.015 401.963 LS
840.186 401.963 L
840.186 374.54 L
916.015 374.54 L
916.015 401.963 LE
916.015 374.54 LS
840.186 374.54 L
840.186 349.611 L
916.015 349.611 L
916.015 374.54 LE
916.015 349.611 LS
840.186 349.611 L
840.186 326.947 L
916.015 326.947 L
916.015 349.611 LE
916.015 326.947 LS
840.186 326.947 L
840.186 306.344 L
916.015 306.344 L
916.015 326.947 LE
916.015 306.344 LS
840.186 306.344 L
840.186 287.614 L
916.015 287.614 L
916.015 306.344 LE
916.015 287.614 LS
840.186 287.614 L
840.186 270.587 L
916.015 270.587 L
916.015 287.614 LE
916.015 270.587 LS
840.186 270.587 L
840.186 255.107 L
916.015 255.107 L
916.015 270.587 LE
916.015 255.107 LS
840.186 255.107 L
840.186 241.035 L
916.015 241.035 L
916.015 255.107 LE
916.015 241.035 LS
840.186 241.035 L
840.186 228.242 L
916.015 228.242 L
916.015 241.035 LE
916.015 228.242 LS
840.186 228.242 L
840.186 216.612 L
916.015 216.612 L
916.015 228.242 LE
916.015 216.612 LS
840.186 216.612 L
840.186 206.04 L
916.015 206.04 L
916.015 216.612 LE
916.015 206.04 LS
840.186 206.04 L
840.186 196.428 L
916.015 196.428 L
916.015 206.04 LE
916.015 196.428 LS
840.186 196.428 L
840.186 187.69 L
916.015 187.69 L
916.015 196.428 LE
999.429 465.31 LS
916.015 465.31 L
916.015 432.128 L
999.429 432.128 L
999.429 465.31 LE
999.429 432.128 LS
916.015 432.128 L
916.015 401.963 L
999.429 401.963 L
999.429 432.128 LE
999.429 401.963 LS
916.015 401.963 L
916.015 374.54 L
999.429 374.54 L
999.429 401.963 LE
999.429 374.54 LS
916.015 374.54 L
916.015 349.611 L
999.429 349.611 L
999.429 374.54 LE
999.429 349.611 LS
916.015 349.611 L
916.015 326.947 L
999.429 326.947 L
999.429 349.611 LE
999.429 326.947 LS
916.015 326.947 L
916.015 306.344 L
999.429 306.344 L
999.429 326.947 LE
999.429 306.344 LS
916.015 306.344 L
916.015 287.614 L
999.429 287.614 L
999.429 306.344 LE
999.429 287.614 LS
916.015 287.614 L
916.015 270.587 L
999.429 270.587 L
999.429 287.614 LE
999.429 270.587 LS
916.015 270.587 L
916.015 255.107 L
999.429 255.107 L
999.429 270.587 LE
999.429 255.107 LS
916.015 255.107 L
916.015 241.035 L
999.429 241.035 L
999.429 255.107 LE
999.429 241.035 LS
916.015 241.035 L
916.015 228.242 L
999.429 228.242 L
999.429 241.035 LE
999.429 228.242 LS
916.015 228.242 L
916.015 216.612 L
999.429 216.612 L
999.429 228.242 LE
999.429 216.612 LS
916.015 216.612 L
916.015 206.04 L
999.429 206.04 L
999.429 216.612 LE
999.429 206.04 LS
916.015 206.04 L
916.015 196.428 L
999.429 196.428 L
999.429 206.04 LE
999.429 196.428 LS
916.015 196.428 L
916.015 187.69 L
999.429 187.69 L
999.429 196.428 LE
3 setlinewidth
1 0 0 setrgbcolor
165 188 LS 999 188 LE
0 0 1 setrgbcolor
999 188 LS 999 466 LE
(A) 140 180 15 /Helvetica S
(B) 1010 180 15 /Helvetica S
(C) 1010 466 15 /Helvetica S
gsave 0 setgray % 0 0.35 0 setrgbcolor
165 188 moveto
165 188 3.5 0 360 arc fill
999 188 moveto
999 188 3.5 0 360 arc fill
999 466 moveto
999 466 3.5 0 360 arc fill
grestore
grestore
showpage
cleartomark
%%PageTrailer
%%Trailer
end
%%EOF
