%!PS-Adobe-3.0 EPSF-3.0
%%Title:                     angle-d
%%BoundingBox:     57   20   142   71
%%EndComments

% these procedures have been posted in comp.lang.postscript
% by Bill Lee, bill@leeweyr.sccsi.com, on Apr 19 1995
% subject: arc with arrow head


%* _____________________________ Arrows ____________________________________
%* Procedure to draw the path for an arrow head. Note: the arrowhead will be
%* added to the current path. The arrowhead will also be drawn and filled.
%*
%*      Usage:  Linewidth PreviousX PreviousY
%*                      ArrowHead
%*              
%*                 where: LineWidth is the width in points of the arrow head
%*                        lines
%*
%*                        PreviousX and PreviousY along with the currentpoint
%*                        define the direction that the arrow points
%*
%*              Note: If Linewidth is zero, a value of 1 will be substituted
/ArrowHead {
          currentpoint moveto
          currentpoint
          4 2 roll exch 4 -1 roll exch
          sub 3 1 roll sub
          exch atan matrix currentmatrix exch rotate exch
          dup 0 eq
            { pop 1 } if
          dup scale
          -7 2 rlineto
          1 -2 rlineto
          -1 -2 rlineto
          7 2 rlineto
          currentpoint
          gsave
            newpath moveto
            -7 2 rlineto
            1 -2 rlineto
            -1 -2 rlineto
            closepath
            fill
          grestore
          setmatrix
} bind def

%* _____________________________ RLineto^ ____________________________________
%* Procedure to add a relative line to the current path and then add the
%* path for an arrow on its end.
%*
%*      Usage:  x y RLineto^
%*
%*                where: x and y are the offsets from the current point
%*              
/RLineto^ {
        currentlinewidth currentpoint 5 3 roll
        rlineto
        ArrowHead
} bind def

%* _____________________________ Lineto^ ____________________________________
%* Procedure to add a line to the current path and then add the
%* path for an arrow on its end.
%*
%*      Usage:  x y Lineto^
%*
%*                where: x and y are the new points for the path
%*              
/Lineto^ {
        currentlinewidth currentpoint 5 3 roll
        lineto
        ArrowHead
} bind def

%* _____________________________ Arc^ ____________________________________
%* Procedure to add an arc to the current path and then add the
%* path for arrow on its end.
%*
%*      Usage:  x y r ang1 ang2 Arc^
%*
%*                where: x, y, ang1, ang2, and r are the normal parameters
%*                       for drawing an arc.
%*              
/Arc^ {
        5 copy arc
        exch pop 2 sub
        dup cos 2 index mul 4 index add
        exch sin 2 index mul 3 index add
        currentlinewidth  3 1 roll
        ArrowHead pop pop pop
} bind def

%* _____________________________ Arcn^ ____________________________________
%* Procedure to add an arc to the current path and then add the
%* path for arrow on its end.
%*
%*      Usage:  x y r ang1 ang2 Arcn^
%*
%*                where: x, y, ang1, ang2, and r are the normal parameters
%*                       for drawing an arcn.
%*              
/Arcn^ {
        5 copy arcn
        exch pop 2 add
        dup cos 2 index mul 4 index add
        exch sin 2 index mul 3 index add
        currentlinewidth  3 1 roll
        ArrowHead pop pop pop
} bind def


1 setlinecap

gsave 0 setlinewidth 0.9 setgray
60 30 moveto
85 35 lineto
105 65 lineto
120 35 lineto
140 30 lineto
135 23 129 23 125 22 curveto
119 22 115 23 111 22 curveto
104 21 99 21 94 22 curveto
89 23 84 21 78 22 curveto
71 24 65 25 60 30 curveto
closepath fill grestore

0.2 setgray 0.5 setlinewidth
92.5 47 moveto 82 54.5 Lineto^ stroke
114 48 moveto 126 53.5 Lineto^ stroke

0.8 setlinewidth
1 0.5 0 setrgbcolor
60 30 moveto
85 35 lineto
105 65 Lineto^
120 35 Lineto^
140 30 lineto
stroke

0.4 setlinewidth

40 60 moveto
85 35 moveto 78 22 lineto stroke
85 35 moveto 94 22 lineto stroke
120 35 moveto 85 35 lineto stroke
120 35 moveto 111 22 lineto stroke
120 35 moveto 111 22 lineto stroke


/Helvetica findfont 10 scalefont setfont	
80 38 moveto (A) show
107 65 moveto (B) show
122 37 moveto (C) show
81 58 moveto (nab) show
120 58 moveto (nbc) show


showpage
%%Trailer
%EOF
