%!PS-Adobe-3.0 EPSF-3.0
%%Title: manifem-s.fig
%%Creator: fig2dev Version 3.2.7a
%%CreationDate: 2019-09-29 14:11:13
%%BoundingBox: 15 294 888 483
%%Magnification: 1.0000
%%EndComments
%%BeginProlog
/$F2psDict 200 dict def
$F2psDict begin
$F2psDict /mtrx matrix put
/col-1 {0 setgray} bind def

end

/cp {closepath} bind def
/ef {eofill} bind def
/gr {grestore} bind def
/gs {gsave} bind def
/sa {save} bind def
/rs {restore} bind def
/l {lineto} bind def
/rl {rlineto} bind def
/m {moveto} bind def
/rm {rmoveto} bind def
/n {newpath} bind def
/s {stroke} bind def
/sh {show} bind def
/slc {setlinecap} bind def
/slj {setlinejoin} bind def
/slw {setlinewidth} bind def
/srgb {setrgbcolor} bind def
/rot {rotate} bind def
/sc {scale} bind def
/sd {setdash} bind def
/ff {findfont} bind def
/sf {setfont} bind def
/scf {scalefont} bind def
/sw {stringwidth} bind def
/tr {translate} bind def
/tnt {dup dup currentrgbcolor
  4 -2 roll dup 1 exch sub 3 -1 roll mul add
  4 -2 roll dup 1 exch sub 3 -1 roll mul add
  4 -2 roll dup 1 exch sub 3 -1 roll mul add srgb}
  bind def
/shd {dup dup currentrgbcolor 4 -2 roll mul 4 -2 roll mul
  4 -2 roll mul srgb} bind def
/$F2psBegin {$F2psDict begin /$F2psEnteredState save def} def
/$F2psEnd {$F2psEnteredState restore end} def

/pageheader {
sa
n 0 497 m 0 0 l 888 0 l 888 497 l cp clip
-87.4 541.5 tr
1 -1 sc
$F2psBegin
10 setmiterlimit
0 slj 0 slc
 0.06000 0.06000 sc
} bind def
/pagefooter {
$F2psEnd
restore
} bind def
%%EndProlog
pageheader
%
% Fig objects follow

0 400 translate
1 0.8 scale
0. 0. 0.3 setrgbcolor

% here starts figure with depth 50
% Polyline
2 slj
0 slc
250 slw  % 180
n 1500 2625 m 1502 2621 l 1507 2613 l 1516 2600 l 1529 2581 l 1545 2557 l
 1563 2529 l 1583 2501 l 1602 2472 l 1622 2445 l 1640 2421 l
 1658 2399 l 1674 2379 l 1690 2362 l 1705 2347 l 1720 2334 l
 1735 2323 l 1750 2313 l 1762 2306 l 1773 2299 l 1786 2294 l
 1798 2289 l 1812 2285 l 1825 2281 l 1839 2279 l 1854 2277 l
 1869 2277 l 1884 2278 l 1899 2280 l 1915 2284 l 1930 2288 l
 1946 2294 l 1961 2302 l 1977 2311 l 1992 2321 l 2007 2332 l
 2021 2345 l 2036 2359 l 2050 2375 l 2063 2392 l 2077 2410 l
 2090 2430 l 2100 2446 l 2110 2463 l 2120 2481 l 2129 2500 l
 2139 2521 l 2149 2542 l 2159 2565 l 2168 2590 l 2178 2615 l
 2188 2643 l 2197 2671 l 2206 2700 l 2215 2731 l 2224 2763 l
 2233 2796 l 2241 2831 l 2249 2866 l 2256 2901 l 2263 2938 l
 2270 2975 l 2275 3013 l 2281 3051 l 2286 3089 l 2290 3127 l
 2294 3166 l 2297 3205 l 2300 3244 l 2302 3283 l 2304 3323 l
 2305 3362 l 2305 3402 l 2305 3443 l 2304 3483 l 2303 3525 l
 2301 3567 l 2299 3610 l 2296 3654 l 2293 3698 l 2289 3743 l
 2284 3789 l 2280 3835 l 2274 3881 l 2269 3927 l 2263 3972 l
 2256 4018 l 2250 4062 l 2243 4106 l 2236 4149 l 2229 4191 l
 2221 4231 l 2214 4269 l 2207 4306 l 2200 4340 l 2192 4372 l
 2185 4402 l 2178 4429 l 2172 4454 l 2165 4476 l 2159 4496 l
 2153 4512 l 2147 4527 l 2142 4538 l 2137 4547 l 2133 4553 l
 2128 4556 l 2124 4556 l 2120 4553 l 2116 4547 l 2113 4538 l
 2110 4526 l 2108 4511 l 2106 4493 l 2104 4472 l 2103 4448 l
 2103 4422 l 2102 4393 l 2103 4362 l 2104 4328 l 2105 4292 l
 2107 4255 l 2109 4215 l 2112 4175 l 2116 4133 l 2120 4091 l
 2124 4047 l 2129 4003 l 2134 3959 l 2140 3915 l 2146 3871 l
 2152 3827 l 2159 3783 l 2166 3739 l 2174 3696 l 2183 3653 l
 2190 3614 l 2198 3576 l 2207 3538 l 2216 3499 l 2225 3460 l
 2235 3420 l 2245 3381 l 2256 3341 l 2268 3301 l 2280 3261 l
 2292 3220 l 2305 3180 l 2318 3139 l 2331 3099 l 2345 3059 l
 2359 3020 l 2374 2981 l 2389 2942 l 2404 2905 l 2419 2868 l
 2434 2833 l 2449 2798 l 2464 2765 l 2479 2732 l 2494 2702 l
 2509 2672 l 2524 2644 l 2539 2617 l 2553 2591 l 2568 2567 l
 2582 2544 l 2597 2522 l 2611 2502 l 2625 2483 l 2639 2464 l
 2653 2447 l 2668 2431 l 2682 2415 l 2697 2401 l 2711 2388 l
 2726 2375 l 2741 2364 l 2756 2354 l 2771 2345 l 2786 2337 l
 2801 2330 l 2816 2324 l 2831 2319 l 2846 2316 l 2860 2314 l
 2875 2313 l 2889 2313 l 2903 2315 l 2917 2318 l 2930 2322 l
 2943 2327 l 2956 2334 l 2968 2341 l 2979 2350 l 2990 2360 l
 3001 2370 l 3011 2382 l 3020 2395 l 3029 2408 l 3037 2423 l
 3045 2439 l 3053 2455 l 3060 2473 l 3067 2492 l 3074 2513 l
 3080 2535 l 3086 2559 l 3091 2584 l 3096 2611 l 3101 2639 l
 3105 2668 l 3109 2699 l 3112 2731 l 3115 2765 l 3118 2800 l
 3120 2836 l 3122 2873 l 3123 2912 l 3124 2951 l 3124 2991 l
 3124 3031 l 3124 3072 l 3123 3113 l 3122 3155 l 3121 3197 l
 3119 3238 l 3117 3280 l 3114 3321 l 3112 3362 l 3109 3403 l
 3105 3443 l 3102 3483 l 3098 3523 l 3094 3563 l 3090 3603 l
 3085 3645 l 3080 3688 l 3075 3731 l 3069 3774 l 3064 3818 l
 3057 3861 l 3051 3905 l 3044 3950 l 3038 3994 l 3030 4037 l
 3023 4081 l 3016 4123 l 3008 4165 l 3001 4206 l 2993 4246 l
 2986 4284 l 2978 4320 l 2971 4355 l 2963 4387 l 2956 4417 l
 2949 4445 l 2943 4470 l 2936 4493 l 2930 4513 l 2924 4531 l
 2919 4546 l 2914 4559 l 2909 4568 l 2904 4575 l 2900 4580 l
 2896 4582 l 2892 4581 l 2888 4577 l 2885 4570 l 2882 4560 l
 2880 4547 l 2878 4531 l 2877 4512 l 2876 4490 l 2875 4466 l
 2875 4439 l 2876 4409 l 2877 4377 l 2879 4343 l 2882 4307 l
 2885 4269 l 2889 4229 l 2894 4189 l 2899 4147 l 2905 4105 l
 2911 4062 l 2918 4018 l 2925 3975 l 2934 3931 l 2942 3887 l
 2952 3843 l 2962 3799 l 2973 3755 l 2981 3721 l 2991 3686 l
 3000 3651 l 3011 3615 l 3021 3579 l 3033 3543 l 3045 3507 l
 3057 3469 l 3070 3432 l 3083 3394 l 3097 3356 l 3112 3318 l
 3127 3279 l 3142 3241 l 3158 3202 l 3174 3164 l 3190 3126 l
 3207 3088 l 3224 3051 l 3241 3015 l 3258 2979 l 3275 2944 l
 3292 2910 l 3309 2877 l 3326 2845 l 3343 2814 l 3360 2784 l
 3377 2756 l 3393 2728 l 3409 2702 l 3425 2677 l 3441 2653 l
 3457 2631 l 3472 2610 l 3487 2589 l 3503 2570 l 3515 2554 l
 3528 2539 l 3541 2525 l 3554 2512 l 3567 2499 l 3580 2487 l
 3592 2475 l 3605 2465 l 3618 2455 l 3631 2446 l 3643 2438 l
 3656 2431 l 3669 2425 l 3681 2420 l 3693 2416 l 3706 2412 l
 3718 2410 l 3730 2409 l 3741 2409 l 3753 2410 l 3764 2413 l
 3774 2416 l 3785 2421 l 3795 2426 l 3805 2433 l 3814 2441 l
 3823 2450 l 3831 2460 l 3839 2471 l 3847 2484 l 3854 2497 l
 3860 2512 l 3866 2527 l 3872 2544 l 3877 2561 l 3882 2580 l
 3886 2599 l 3890 2620 l 3893 2641 l 3896 2664 l 3898 2688 l
 3900 2713 l 3902 2741 l 3903 2771 l 3903 2803 l 3903 2836 l
 3903 2871 l 3902 2907 l 3901 2945 l 3899 2984 l 3897 3025 l
 3895 3067 l 3893 3110 l 3890 3154 l 3887 3200 l 3884 3246 l
 3881 3293 l 3878 3341 l 3874 3389 l 3871 3437 l 3868 3486 l
 3865 3534 l 3861 3583 l 3859 3631 l 3856 3678 l 3853 3725 l
 3851 3771 l 3849 3816 l 3848 3860 l 3847 3903 l 3846 3944 l
 3846 3984 l 3846 4023 l 3847 4060 l 3848 4095 l 3850 4129 l
 3852 4162 l 3855 4193 l 3858 4222 l 3863 4250 l 3869 4283 l
 3876 4314 l 3885 4343 l 3894 4370 l 3905 4396 l 3917 4419 l
 3930 4441 l 3944 4460 l 3958 4479 l 3974 4495 l 3991 4510 l
 4008 4523 l 4026 4534 l 4045 4544 l 4064 4552 l 4083 4558 l
 4103 4564 l 4123 4567 l 4143 4570 l 4162 4571 l 4182 4571 l
 4201 4570 l 4220 4568 l 4238 4565 l 4256 4562 l 4274 4558 l
 4290 4553 l 4307 4548 l 4322 4543 l 4338 4538 l 4359 4529 l
 4380 4519 l 4400 4509 l 4419 4497 l 4438 4485 l 4457 4471 l
 4477 4455 l 4496 4438 l 4516 4419 l 4537 4399 l 4557 4378 l
 4577 4357 l 4596 4337 l 4613 4318 l 4626 4303 l 4637 4290 l
 4644 4282 l 4648 4277 l
 4650 4275 l s % Polyline
n 6090 2595 m 6087 2593 l 6081 2590 l 6071 2583 l 6055 2574 l 6034 2562 l
 6009 2547 l 5980 2530 l 5948 2512 l 5916 2494 l 5883 2476 l
 5852 2459 l 5821 2443 l 5792 2429 l 5765 2416 l 5739 2405 l
 5715 2395 l 5691 2386 l 5669 2379 l 5647 2372 l 5625 2367 l
 5603 2363 l 5580 2359 l 5557 2356 l 5534 2354 l 5510 2352 l
 5485 2352 l 5460 2352 l 5434 2353 l 5408 2355 l 5381 2358 l
 5353 2362 l 5326 2367 l 5299 2373 l 5272 2380 l 5245 2388 l
 5219 2396 l 5193 2405 l 5168 2415 l 5144 2426 l 5121 2437 l
 5098 2449 l 5076 2462 l 5055 2475 l 5037 2487 l 5019 2500 l
 5002 2513 l 4984 2527 l 4966 2542 l 4949 2559 l 4931 2576 l
 4913 2594 l 4896 2613 l 4878 2633 l 4861 2654 l 4844 2675 l
 4827 2698 l 4810 2721 l 4795 2745 l 4779 2769 l 4764 2794 l
 4750 2819 l 4737 2844 l 4724 2870 l 4712 2896 l 4700 2922 l
 4689 2948 l 4679 2974 l 4669 3001 l 4660 3028 l 4652 3053 l
 4644 3079 l 4637 3106 l 4629 3134 l 4623 3162 l 4616 3192 l
 4610 3222 l 4604 3253 l 4599 3285 l 4594 3318 l 4589 3351 l
 4585 3385 l 4582 3419 l 4579 3454 l 4576 3488 l 4574 3523 l
 4573 3557 l 4572 3591 l 4572 3625 l 4573 3658 l 4573 3691 l
 4575 3723 l 4577 3754 l 4580 3784 l 4583 3814 l 4586 3843 l
 4590 3872 l 4595 3900 l 4600 3928 l 4606 3956 l 4612 3983 l
 4620 4011 l 4627 4038 l 4636 4066 l 4646 4093 l 4656 4121 l
 4667 4148 l 4679 4176 l 4692 4202 l 4706 4229 l 4721 4255 l
 4737 4280 l 4753 4305 l 4770 4329 l 4788 4352 l 4806 4374 l
 4825 4395 l 4845 4415 l 4865 4433 l 4885 4451 l 4906 4467 l
 4927 4482 l 4949 4496 l 4971 4509 l 4994 4521 l 5018 4533 l
 5040 4542 l 5063 4551 l 5088 4559 l 5112 4566 l 5138 4572 l
 5165 4577 l 5192 4581 l 5221 4585 l 5250 4587 l 5280 4588 l
 5310 4588 l 5341 4587 l 5372 4585 l 5403 4581 l 5434 4576 l
 5466 4570 l 5497 4562 l 5527 4553 l 5558 4543 l 5587 4531 l
 5616 4518 l 5644 4504 l 5671 4489 l 5698 4473 l 5723 4455 l
 5747 4437 l 5771 4417 l 5793 4396 l 5814 4374 l 5835 4350 l
 5852 4328 l 5869 4305 l 5886 4280 l 5902 4255 l 5917 4228 l
 5933 4200 l 5947 4170 l 5962 4139 l 5976 4107 l 5989 4074 l
 6003 4040 l 6016 4004 l 6028 3968 l 6040 3930 l 6052 3892 l
 6063 3854 l 6073 3814 l 6083 3775 l 6093 3735 l 6102 3695 l
 6111 3656 l 6119 3616 l 6127 3577 l 6134 3538 l 6141 3499 l
 6147 3462 l 6153 3425 l 6159 3388 l 6164 3353 l 6169 3318 l
 6173 3284 l 6177 3250 l 6181 3217 l 6185 3185 l 6190 3140 l
 6195 3096 l 6199 3053 l 6203 3010 l 6206 2968 l 6210 2927 l
 6213 2886 l 6215 2847 l 6217 2809 l 6219 2772 l 6220 2737 l
 6221 2704 l 6221 2673 l 6221 2645 l 6221 2619 l 6220 2597 l
 6218 2577 l 6217 2559 l 6214 2545 l 6212 2534 l 6209 2526 l
 6205 2520 l 6202 2517 l 6198 2518 l 6193 2520 l 6189 2525 l
 6184 2532 l 6179 2542 l 6174 2554 l 6168 2568 l 6162 2586 l
 6156 2605 l 6150 2627 l 6144 2651 l 6137 2678 l 6131 2706 l
 6125 2737 l 6119 2769 l 6114 2803 l 6108 2838 l 6103 2875 l
 6099 2912 l 6094 2950 l 6091 2989 l 6087 3028 l 6085 3067 l
 6083 3107 l 6081 3147 l 6080 3187 l 6080 3228 l 6080 3261 l
 6081 3295 l 6082 3330 l 6083 3365 l 6085 3401 l 6088 3437 l
 6091 3475 l 6094 3512 l 6098 3551 l 6103 3590 l 6107 3629 l
 6113 3668 l 6119 3708 l 6125 3748 l 6132 3787 l 6139 3826 l
 6147 3865 l 6155 3903 l 6164 3940 l 6173 3976 l 6182 4011 l
 6192 4045 l 6201 4078 l 6211 4110 l 6222 4140 l 6232 4169 l
 6243 4196 l 6254 4222 l 6265 4247 l 6277 4270 l 6288 4292 l
 6300 4313 l 6313 4333 l 6326 4352 l 6340 4371 l 6355 4387 l
 6369 4403 l 6385 4418 l 6400 4431 l 6417 4443 l 6433 4453 l
 6450 4463 l 6467 4471 l 6485 4477 l 6502 4482 l 6520 4486 l
 6538 4488 l 6556 4489 l 6573 4488 l 6591 4486 l 6608 4483 l
 6625 4478 l 6641 4472 l 6657 4465 l 6672 4456 l 6687 4447 l
 6701 4436 l 6715 4424 l 6728 4412 l 6741 4398 l 6753 4383 l
 6765 4368 l 6776 4351 l 6787 4333 l 6798 4314 l 6808 4293 l
 6818 4272 l 6828 4249 l 6837 4224 l 6847 4199 l 6856 4172 l
 6865 4144 l 6873 4114 l 6882 4084 l 6890 4052 l 6898 4020 l
 6906 3987 l 6914 3953 l 6922 3919 l 6929 3884 l 6936 3849 l
 6943 3814 l 6949 3779 l 6956 3744 l 6962 3709 l 6968 3675 l
 6974 3640 l 6980 3606 l 6985 3573 l 6991 3539 l 6997 3506 l
 7003 3473 l 7008 3439 l 7014 3406 l 7020 3372 l 7026 3338 l
 7033 3304 l 7040 3269 l 7047 3234 l 7054 3198 l 7062 3163 l
 7070 3127 l 7078 3091 l 7086 3055 l 7095 3020 l 7105 2985 l
 7114 2950 l 7124 2916 l 7134 2883 l 7145 2850 l 7155 2819 l
 7166 2789 l 7177 2759 l 7189 2732 l 7200 2705 l 7212 2680 l
 7224 2656 l 7236 2634 l 7249 2613 l 7261 2593 l 7274 2575 l
 7288 2558 l 7301 2541 l 7315 2526 l 7330 2512 l 7345 2499 l
 7361 2487 l 7377 2476 l 7394 2467 l 7411 2458 l 7429 2451 l
 7447 2445 l 7465 2440 l 7484 2437 l 7503 2435 l 7521 2435 l
 7540 2436 l 7559 2439 l 7577 2443 l 7595 2448 l 7613 2455 l
 7630 2464 l 7647 2474 l 7663 2485 l 7679 2497 l 7693 2511 l
 7707 2526 l 7721 2542 l 7734 2560 l 7746 2579 l 7757 2599 l
 7768 2620 l 7777 2641 l 7786 2664 l 7794 2688 l 7802 2713 l
 7809 2740 l 7816 2768 l 7823 2797 l 7829 2828 l 7835 2861 l
 7840 2895 l 7844 2929 l 7849 2966 l 7852 3003 l 7855 3041 l
 7858 3080 l 7860 3119 l 7862 3159 l 7863 3200 l 7864 3240 l
 7864 3281 l 7864 3321 l 7863 3361 l 7862 3401 l 7861 3440 l
 7859 3479 l 7857 3517 l 7854 3555 l 7852 3592 l 7849 3628 l
 7845 3663 l 7841 3698 l 7838 3733 l 7832 3774 l 7827 3816 l
 7821 3857 l 7814 3897 l 7807 3938 l 7800 3978 l 7792 4017 l
 7784 4056 l 7776 4095 l 7767 4132 l 7758 4168 l 7750 4202 l
 7741 4235 l 7732 4266 l 7723 4295 l 7714 4322 l 7706 4347 l
 7698 4369 l 7690 4388 l 7683 4405 l 7676 4420 l 7669 4431 l
 7663 4440 l 7657 4447 l 7652 4451 l 7648 4453 l 7643 4452 l
 7639 4448 l 7636 4442 l 7633 4433 l 7631 4422 l 7629 4408 l
 7628 4392 l 7627 4373 l 7627 4351 l 7628 4327 l 7630 4301 l
 7632 4272 l 7635 4242 l 7638 4209 l 7643 4175 l 7648 4139 l
 7654 4102 l 7660 4064 l 7668 4025 l 7676 3986 l 7684 3946 l
 7694 3905 l 7704 3865 l 7714 3824 l 7725 3782 l 7738 3740 l
 7747 3707 l 7757 3674 l 7768 3641 l 7780 3607 l 7792 3572 l
 7804 3536 l 7817 3500 l 7831 3464 l 7845 3426 l 7860 3389 l
 7875 3351 l 7891 3312 l 7908 3274 l 7924 3235 l 7942 3197 l
 7959 3158 l 7977 3120 l 7995 3082 l 8014 3045 l 8032 3009 l
 8050 2973 l 8069 2939 l 8087 2905 l 8106 2873 l 8124 2841 l
 8142 2811 l 8160 2782 l 8178 2755 l 8195 2729 l 8213 2704 l
 8230 2681 l 8247 2658 l 8263 2637 l 8280 2618 l 8298 2598 l
 8315 2579 l 8333 2562 l 8350 2546 l 8368 2530 l 8386 2516 l
 8404 2504 l 8422 2492 l 8439 2482 l 8457 2472 l 8475 2464 l
 8493 2458 l 8510 2452 l 8528 2448 l 8545 2446 l 8561 2444 l
 8578 2444 l 8593 2445 l 8608 2448 l 8623 2452 l 8637 2457 l
 8650 2463 l 8663 2470 l 8675 2478 l 8686 2488 l 8697 2498 l
 8707 2510 l 8716 2522 l 8724 2535 l 8732 2549 l 8739 2564 l
 8745 2580 l 8751 2598 l 8756 2617 l 8761 2637 l 8765 2659 l
 8769 2682 l 8772 2706 l 8774 2731 l 8776 2758 l 8778 2786 l
 8778 2815 l 8779 2846 l 8779 2877 l 8778 2909 l 8777 2943 l
 8775 2976 l 8774 3011 l 8771 3046 l 8769 3081 l 8766 3116 l
 8763 3151 l 8760 3186 l 8757 3221 l 8754 3255 l 8750 3289 l
 8747 3323 l 8743 3356 l 8740 3389 l 8737 3421 l 8733 3453 l
 8730 3485 l 8727 3519 l 8723 3553 l 8720 3587 l 8717 3621 l
 8715 3655 l 8712 3689 l 8710 3724 l 8708 3759 l 8707 3794 l
 8706 3829 l 8705 3863 l 8705 3898 l 8706 3932 l 8707 3965 l
 8709 3998 l 8712 4029 l 8715 4060 l 8719 4090 l 8724 4118 l
 8729 4146 l 8735 4171 l 8742 4196 l 8750 4219 l 8758 4241 l
 8767 4261 l 8777 4280 l 8788 4298 l 8800 4315 l 8812 4330 l
 8825 4343 l 8838 4356 l 8853 4368 l 8869 4380 l 8885 4390 l
 8902 4399 l 8921 4407 l 8940 4414 l 8960 4420 l 8980 4425 l
 9002 4428 l 9024 4431 l 9046 4431 l 9068 4431 l 9091 4429 l
 9114 4426 l 9137 4421 l 9160 4415 l 9182 4408 l 9204 4399 l
 9226 4389 l 9247 4378 l 9268 4366 l 9288 4352 l 9308 4337 l
 9327 4321 l 9345 4304 l 9363 4285 l 9380 4265 l 9395 4246 l
 9409 4226 l 9423 4205 l 9437 4183 l 9451 4159 l 9465 4134 l
 9478 4108 l 9491 4081 l 9504 4052 l 9517 4022 l 9530 3991 l
 9542 3959 l 9554 3925 l 9566 3891 l 9578 3856 l 9590 3820 l
 9601 3783 l 9612 3746 l 9623 3708 l 9633 3670 l 9644 3632 l
 9654 3594 l 9663 3556 l 9672 3518 l 9681 3481 l 9690 3443 l
 9698 3406 l 9706 3370 l 9714 3334 l 9722 3298 l 9729 3263 l
 9736 3228 l 9743 3194 l 9750 3160 l 9758 3119 l 9767 3078 l
 9775 3037 l 9783 2996 l 9791 2955 l 9799 2914 l 9806 2873 l
 9814 2833 l 9821 2793 l 9828 2754 l 9835 2715 l 9842 2678 l
 9848 2641 l 9853 2606 l 9859 2573 l 9863 2542 l 9867 2512 l
 9871 2485 l 9874 2460 l 9876 2438 l 9877 2418 l 9878 2400 l
 9879 2385 l 9878 2372 l 9877 2362 l 9875 2355 l 9873 2350 l
 9870 2348 l 9866 2348 l 9862 2350 l 9857 2355 l 9851 2363 l
 9844 2373 l 9837 2385 l 9830 2401 l 9822 2419 l 9814 2439 l
 9805 2462 l 9796 2487 l 9787 2515 l 9778 2544 l 9769 2576 l
 9760 2610 l 9751 2645 l 9743 2682 l 9735 2720 l 9727 2759 l
 9720 2799 l 9714 2840 l 9708 2881 l 9703 2923 l 9699 2965 l
 9695 3008 l 9693 3051 l 9691 3094 l 9690 3138 l 9690 3174 l
 9690 3211 l 9692 3248 l 9693 3287 l 9696 3325 l 9699 3365 l
 9702 3405 l 9707 3446 l 9712 3487 l 9717 3529 l 9723 3571 l
 9730 3613 l 9737 3655 l 9745 3698 l 9754 3740 l 9763 3782 l
 9772 3823 l 9782 3864 l 9792 3904 l 9803 3943 l 9814 3981 l
 9825 4018 l 9837 4053 l 9848 4088 l 9860 4120 l 9872 4151 l
 9884 4181 l 9896 4209 l 9908 4235 l 9920 4260 l 9933 4283 l
 9945 4304 l 9958 4324 l 9970 4343 l 9985 4363 l 10001 4381 l
 10017 4397 l 10033 4412 l 10050 4424 l 10066 4435 l 10084 4444 l
 10101 4452 l 10119 4457 l 10137 4461 l 10156 4463 l 10174 4464 l
 10193 4464 l 10212 4461 l 10230 4458 l 10248 4453 l 10266 4447 l
 10284 4440 l 10301 4433 l 10318 4424 l 10335 4415 l 10350 4405 l
 10366 4395 l 10381 4384 l 10395 4373 l 10409 4362 l 10422 4351 l
 10435 4340 l 10453 4324 l 10470 4308 l 10486 4291 l 10503 4273 l
 10519 4255 l 10537 4234 l 10554 4212 l 10573 4189 l 10592 4163 l
 10612 4137 l 10632 4109 l 10652 4081 l 10670 4055 l 10687 4031 l
 10701 4010 l 10712 3995 l 10719 3984 l 10723 3978 l
 10725 3975 l s % Polyline
n 9794 1609 m 9786 1618 l 9778 1627 l 9769 1636 l 9760 1644 l 9751 1653 l
 9742 1662 l 9735 1670 l 9729 1678 l 9725 1685 l 9723 1693 l
 9723 1700 l 9724 1709 l 9727 1718 l 9731 1728 l 9736 1738 l
 9741 1749 l 9746 1760 l 9751 1772 l 9756 1783 l 9759 1795 l
 9761 1807 l 9763 1819 l 9764 1833 l 9765 1846 l 9767 1860 l
 9768 1873 l 9771 1884 l 9774 1894 l 9779 1901 l 9785 1907 l
 9793 1911 l 9803 1913 l 9815 1914 l 9829 1913 l 9844 1912 l
 9860 1911 l 9876 1910 l 9891 1909 l 9905 1908 l 9918 1909 l
 9933 1912 l 9948 1916 l 9962 1921 l 9976 1926 l 9988 1930 l
 9998 1933 l 10007 1933 l 10015 1930 l 10021 1926 l 10026 1919 l
 10031 1910 l 10036 1899 l 10041 1887 l 10046 1873 l 10051 1860 l
 10056 1848 l 10060 1836 l 10065 1825 l 10072 1812 l 10079 1801 l
 10087 1789 l 10094 1778 l 10100 1768 l 10104 1759 l 10107 1750 l
 10107 1742 l 10105 1734 l 10101 1724 l 10095 1714 l 10088 1703 l
 10081 1691 l 10074 1679 l 10068 1667 l 10064 1655 l 10062 1645 l
 10060 1634 l 10059 1623 l 10058 1611 l 10058 1599 l 10057 1588 l
 10056 1578 l 10055 1569 l 10052 1561 l 10049 1556 l 10043 1550 l
 10035 1546 l 10024 1544 l 10012 1543 l 9998 1542 l 9984 1541 l
 9970 1540 l 9957 1538 l 9946 1535 l 9935 1532 l 9924 1529 l
 9912 1525 l 9901 1522 l 9890 1519 l 9880 1517 l 9870 1517 l
 9862 1517 l 9855 1520 l 9848 1523 l 9842 1529 l 9836 1537 l
 9830 1546 l 9824 1556 l 9818 1567 l 9813 1578 l 9806 1589 l
 9800 1599 l
 cp s % Polyline
n 10783 2797 m 10787 2753 l 10792 2708 l 10797 2664 l 10802 2618 l 10808 2572 l
 10814 2525 l 10820 2478 l 10826 2430 l 10833 2382 l 10840 2333 l
 10848 2283 l 10856 2233 l 10865 2183 l 10874 2133 l 10883 2082 l
 10894 2031 l 10904 1980 l 10915 1929 l 10927 1879 l 10939 1828 l
 10952 1779 l 10965 1729 l 10979 1681 l 10993 1633 l 11008 1587 l
 11023 1541 l 11038 1496 l 11055 1453 l 11071 1411 l 11088 1370 l
 11106 1331 l 11124 1293 l 11142 1257 l 11161 1222 l 11180 1189 l
 11199 1157 l 11220 1127 l 11240 1098 l 11261 1071 l 11283 1045 l
 11305 1021 l 11328 998 l 11356 973 l 11384 950 l 11414 929 l
 11444 909 l 11476 891 l 11509 874 l 11543 859 l 11577 846 l
 11613 834 l 11650 823 l 11687 814 l 11726 807 l 11765 801 l
 11804 797 l 11844 794 l 11884 792 l 11924 792 l 11964 793 l
 12003 796 l 12043 800 l 12082 805 l 12120 811 l 12158 818 l
 12195 826 l 12230 836 l 12265 845 l 12298 856 l 12331 868 l
 12362 880 l 12391 892 l 12420 905 l 12446 919 l 12472 933 l
 12496 947 l 12519 962 l 12540 977 l 12564 995 l 12587 1015 l
 12607 1034 l 12627 1054 l 12644 1075 l 12660 1097 l 12675 1119 l
 12688 1141 l 12699 1164 l 12709 1188 l 12717 1211 l 12724 1235 l
 12729 1259 l 12733 1284 l 12736 1308 l 12736 1331 l 12736 1355 l
 12734 1378 l 12731 1400 l 12726 1422 l 12720 1443 l 12714 1464 l
 12706 1483 l 12698 1502 l 12688 1520 l 12678 1536 l 12667 1552 l
 12656 1567 l 12644 1581 l 12631 1594 l 12614 1609 l 12596 1623 l
 12577 1637 l 12557 1649 l 12536 1660 l 12514 1671 l 12491 1681 l
 12467 1691 l 12443 1700 l 12417 1709 l 12392 1717 l 12366 1725 l
 12340 1733 l 12314 1741 l 12289 1748 l 12264 1756 l 12240 1763 l
 12216 1771 l 12194 1779 l 12172 1788 l 12152 1797 l 12133 1806 l
 12114 1816 l 12097 1827 l 12082 1838 l 12067 1849 l 12054 1862 l
 12041 1875 l 12028 1889 l 12016 1904 l 12005 1920 l 11995 1937 l
 11986 1954 l 11978 1972 l 11971 1990 l 11964 2008 l 11959 2027 l
 11955 2046 l 11953 2064 l 11951 2083 l 11951 2101 l 11952 2119 l
 11954 2136 l 11957 2153 l 11961 2169 l 11967 2184 l 11973 2199 l
 11981 2212 l 11990 2225 l 12000 2238 l 12013 2251 l 12028 2264 l
 12045 2276 l 12063 2288 l 12083 2299 l 12103 2311 l 12125 2322 l
 12148 2333 l 12172 2344 l 12196 2355 l 12220 2366 l 12244 2377 l
 12267 2389 l 12289 2401 l 12310 2413 l 12330 2425 l 12349 2438 l
 12365 2452 l 12380 2466 l 12393 2480 l 12404 2496 l 12413 2513 l
 12418 2527 l 12423 2543 l 12426 2560 l 12427 2578 l 12428 2597 l
 12426 2616 l 12424 2636 l 12420 2657 l 12414 2678 l 12408 2700 l
 12399 2721 l 12390 2743 l 12380 2765 l 12368 2786 l 12355 2807 l
 12342 2827 l 12327 2846 l 12312 2864 l 12296 2881 l 12280 2897 l
 12263 2911 l 12246 2924 l 12229 2936 l 12211 2946 l 12193 2955 l
 12175 2963 l 12155 2969 l 12134 2974 l 12112 2977 l 12090 2980 l
 12068 2981 l 12044 2982 l 12021 2983 l 11997 2983 l 11972 2983 l
 11948 2984 l 11924 2985 l 11900 2987 l 11876 2990 l 11853 2993 l
 11831 2999 l 11810 3006 l 11790 3014 l 11772 3025 l 11754 3037 l
 11738 3052 l 11723 3070 l 11710 3089 l 11698 3112 l 11688 3138 l
 11680 3159 l 11674 3182 l 11668 3207 l 11662 3234 l 11657 3263 l
 11653 3294 l 11649 3327 l 11645 3361 l 11641 3397 l 11637 3435 l
 11634 3474 l 11631 3514 l 11627 3555 l 11624 3597 l 11621 3640 l
 11617 3683 l 11614 3726 l 11610 3769 l 11606 3812 l 11601 3855 l
 11596 3896 l 11591 3937 l 11586 3977 l 11579 4015 l 11573 4053 l
 11566 4088 l 11558 4123 l 11549 4155 l 11540 4186 l 11530 4216 l
 11519 4243 l 11507 4269 l 11495 4292 l 11482 4314 l 11468 4335 l
 11454 4354 l 11438 4372 l 11422 4388 l 11404 4404 l 11386 4418 l
 11367 4430 l 11347 4442 l 11327 4452 l 11306 4460 l 11284 4467 l
 11262 4472 l 11239 4476 l 11217 4478 l 11194 4479 l 11171 4478 l
 11148 4476 l 11125 4472 l 11103 4467 l 11081 4460 l 11059 4451 l
 11038 4442 l 11017 4431 l 10998 4418 l 10978 4405 l 10960 4390 l
 10942 4374 l 10926 4357 l 10910 4339 l 10894 4319 l 10880 4299 l
 10867 4277 l 10855 4257 l 10844 4235 l 10834 4213 l 10824 4189 l
 10815 4164 l 10807 4138 l 10798 4110 l 10791 4081 l 10784 4051 l
 10777 4020 l 10771 3987 l 10766 3952 l 10761 3917 l 10756 3880 l
 10752 3842 l 10749 3802 l 10746 3762 l 10744 3721 l 10742 3678 l
 10740 3635 l 10740 3591 l 10739 3546 l 10739 3501 l 10740 3455 l
 10741 3409 l 10742 3363 l 10744 3316 l 10746 3269 l 10748 3222 l
 10751 3175 l 10754 3128 l 10758 3081 l 10761 3034 l 10765 2987 l
 10769 2940 l 10774 2892 l 10778 2845 l
 cp s % Polyline
n 14025 1125 m 14028 1124 l 14035 1123 l 14048 1121 l 14067 1119 l 14092 1115 l
 14122 1111 l 14156 1108 l 14193 1104 l 14230 1101 l 14267 1100 l
 14303 1099 l 14336 1100 l 14367 1103 l 14396 1107 l 14422 1113 l
 14446 1121 l 14467 1130 l 14487 1142 l 14505 1156 l 14522 1173 l
 14539 1191 l 14553 1210 l 14566 1232 l 14579 1254 l 14592 1279 l
 14605 1305 l 14617 1333 l 14629 1362 l 14642 1391 l 14654 1422 l
 14666 1453 l 14678 1483 l 14690 1514 l 14702 1544 l 14714 1572 l
 14727 1599 l 14739 1625 l 14751 1648 l 14763 1669 l 14775 1688 l
 14787 1704 l 14799 1717 l 14812 1727 l 14825 1735 l 14839 1739 l
 14852 1740 l 14865 1739 l 14879 1735 l 14895 1729 l 14910 1720 l
 14927 1709 l 14945 1696 l 14964 1681 l 14983 1664 l 15003 1645 l
 15025 1624 l 15047 1602 l 15069 1579 l 15093 1555 l 15117 1531 l
 15141 1506 l 15166 1481 l 15191 1456 l 15216 1431 l 15241 1407 l
 15266 1384 l 15292 1361 l 15318 1339 l 15344 1319 l 15370 1299 l
 15396 1281 l 15418 1267 l 15440 1254 l 15463 1241 l 15486 1230 l
 15510 1219 l 15535 1209 l 15559 1199 l 15585 1191 l 15610 1184 l
 15636 1177 l 15662 1172 l 15689 1168 l 15715 1165 l 15742 1163 l
 15768 1162 l 15794 1163 l 15820 1165 l 15846 1168 l 15870 1173 l
 15895 1179 l 15918 1186 l 15941 1195 l 15962 1205 l 15983 1216 l
 16003 1228 l 16022 1242 l 16040 1257 l 16057 1273 l 16072 1290 l
 16087 1309 l 16101 1329 l 16114 1350 l 16124 1370 l 16134 1391 l
 16144 1414 l 16152 1438 l 16160 1463 l 16168 1489 l 16174 1517 l
 16181 1547 l 16186 1578 l 16191 1610 l 16195 1644 l 16199 1679 l
 16202 1716 l 16205 1754 l 16207 1793 l 16208 1833 l 16208 1874 l
 16209 1916 l 16208 1959 l 16207 2003 l 16205 2047 l 16203 2092 l
 16201 2137 l 16198 2182 l 16194 2228 l 16190 2273 l 16186 2319 l
 16181 2365 l 16176 2410 l 16171 2455 l 16165 2501 l 16160 2546 l
 16154 2591 l 16147 2636 l 16141 2681 l 16134 2726 l 16128 2766 l
 16121 2808 l 16114 2849 l 16107 2891 l 16100 2933 l 16092 2976 l
 16084 3019 l 16076 3063 l 16067 3107 l 16059 3152 l 16049 3197 l
 16040 3242 l 16030 3288 l 16019 3333 l 16009 3379 l 15997 3425 l
 15986 3470 l 15974 3516 l 15962 3561 l 15950 3605 l 15937 3649 l
 15925 3693 l 15911 3735 l 15898 3777 l 15885 3818 l 15871 3857 l
 15857 3896 l 15843 3933 l 15829 3970 l 15815 4005 l 15800 4038 l
 15786 4070 l 15771 4101 l 15756 4131 l 15741 4159 l 15726 4186 l
 15711 4211 l 15696 4236 l 15680 4259 l 15665 4280 l 15646 4305 l
 15626 4327 l 15607 4348 l 15586 4368 l 15566 4387 l 15545 4404 l
 15523 4419 l 15501 4433 l 15478 4446 l 15456 4457 l 15432 4467 l
 15409 4476 l 15386 4482 l 15362 4488 l 15339 4491 l 15315 4494 l
 15292 4494 l 15269 4493 l 15247 4491 l 15225 4487 l 15204 4482 l
 15183 4476 l 15163 4468 l 15144 4459 l 15125 4449 l 15108 4437 l
 15091 4425 l 15076 4411 l 15061 4397 l 15047 4382 l 15034 4365 l
 15022 4348 l 15011 4330 l 15002 4311 l 14992 4290 l 14983 4267 l
 14976 4243 l 14970 4218 l 14964 4190 l 14960 4161 l 14957 4129 l
 14955 4095 l 14954 4059 l 14954 4020 l 14954 3978 l 14956 3933 l
 14959 3885 l 14962 3834 l 14967 3781 l 14972 3726 l 14978 3669 l
 14984 3611 l 14991 3553 l 14998 3496 l 15005 3442 l 15011 3390 l
 15018 3343 l 15023 3301 l 15028 3265 l 15033 3236 l 15036 3214 l
 15038 3197 l 15040 3187 l 15041 3181 l
 15041 3179 l s % Polyline
n 15085 3083 m 15082 3086 l 15076 3094 l 15065 3106 l 15049 3124 l 15029 3148 l
 15004 3174 l 14978 3203 l 14950 3233 l 14922 3261 l 14895 3286 l
 14869 3309 l 14845 3328 l 14823 3344 l 14802 3356 l 14783 3364 l
 14765 3369 l 14748 3371 l 14731 3369 l 14715 3364 l 14698 3357 l
 14682 3346 l 14665 3334 l 14648 3319 l 14631 3302 l 14614 3283 l
 14596 3263 l 14579 3242 l 14561 3221 l 14544 3199 l 14526 3179 l
 14510 3158 l 14493 3140 l 14478 3123 l 14463 3108 l 14448 3096 l
 14435 3087 l 14421 3080 l 14409 3077 l 14397 3077 l 14386 3079 l
 14376 3085 l 14366 3094 l 14356 3106 l 14346 3120 l 14336 3138 l
 14326 3158 l 14316 3180 l 14306 3205 l 14296 3232 l 14287 3261 l
 14277 3291 l 14269 3323 l 14260 3355 l 14251 3389 l 14243 3422 l
 14236 3455 l 14228 3488 l 14221 3521 l 14214 3554 l 14208 3585 l
 14201 3617 l 14195 3645 l 14189 3674 l 14184 3702 l 14178 3731 l
 14171 3759 l 14165 3788 l 14159 3818 l 14153 3847 l 14146 3876 l
 14139 3905 l 14133 3934 l 14126 3963 l 14119 3991 l 14112 4018 l
 14105 4045 l 14098 4070 l 14091 4095 l 14084 4119 l 14077 4141 l
 14070 4163 l 14063 4183 l 14055 4203 l 14048 4221 l 14041 4239 l
 14032 4260 l 14023 4280 l 14013 4299 l 14002 4318 l 13992 4336 l
 13980 4354 l 13968 4370 l 13956 4386 l 13943 4401 l 13930 4415 l
 13916 4428 l 13902 4439 l 13888 4449 l 13875 4458 l 13861 4465 l
 13847 4471 l 13833 4475 l 13820 4479 l 13806 4481 l 13792 4482 l
 13777 4481 l 13761 4479 l 13744 4475 l 13726 4470 l 13707 4462 l
 13685 4453 l 13662 4441 l 13637 4428 l 13610 4412 l 13581 4395 l
 13553 4378 l 13527 4362 l 13504 4347 l 13485 4335 l 13472 4326 l
 13465 4321 l
 13461 4319 l s % Polyline
n 12675 1050 m 12678 1049 l 12684 1047 l 12694 1043 l 12711 1038 l 12733 1030 l
 12760 1021 l 12792 1010 l 12828 999 l 12866 987 l 12904 975 l
 12943 963 l 12981 951 l 13017 941 l 13052 932 l 13086 923 l
 13117 915 l 13148 909 l 13176 903 l 13204 899 l 13232 895 l
 13259 892 l 13285 889 l 13313 888 l 13338 886 l 13363 886 l
 13390 886 l 13416 886 l 13444 888 l 13471 890 l 13499 892 l
 13528 896 l 13557 900 l 13586 905 l 13614 911 l 13643 918 l
 13671 925 l 13699 934 l 13726 943 l 13752 953 l 13777 964 l
 13801 976 l 13823 988 l 13845 1001 l 13865 1015 l 13883 1030 l
 13901 1045 l 13917 1061 l 13931 1077 l 13944 1095 l 13956 1113 l
 13967 1133 l 13977 1153 l 13985 1175 l 13993 1198 l 13999 1221 l
 14004 1246 l 14008 1271 l 14010 1297 l 14012 1324 l 14012 1351 l
 14010 1379 l 14008 1406 l 14004 1434 l 13999 1461 l 13992 1487 l
 13985 1513 l 13976 1538 l 13967 1562 l 13956 1585 l 13945 1607 l
 13932 1627 l 13919 1647 l 13905 1665 l 13890 1682 l 13874 1698 l
 13856 1713 l 13837 1728 l 13816 1741 l 13795 1754 l 13772 1765 l
 13748 1776 l 13723 1786 l 13697 1796 l 13670 1805 l 13643 1813 l
 13615 1821 l 13587 1829 l 13559 1836 l 13532 1843 l 13505 1850 l
 13478 1856 l 13453 1863 l 13428 1870 l 13405 1876 l 13383 1883 l
 13362 1890 l 13342 1898 l 13324 1906 l 13307 1915 l 13291 1925 l
 13276 1935 l 13262 1946 l 13249 1958 l 13237 1971 l 13226 1985 l
 13216 1999 l 13207 2014 l 13200 2030 l 13193 2046 l 13188 2063 l
 13184 2080 l 13181 2096 l 13179 2113 l 13179 2130 l 13179 2146 l
 13181 2162 l 13184 2177 l 13188 2192 l 13193 2206 l 13198 2219 l
 13205 2232 l 13213 2244 l 13221 2255 l 13234 2269 l 13248 2282 l
 13264 2295 l 13281 2307 l 13300 2318 l 13320 2330 l 13341 2341 l
 13362 2353 l 13384 2364 l 13405 2376 l 13426 2388 l 13446 2400 l
 13465 2412 l 13483 2425 l 13499 2438 l 13513 2452 l 13526 2467 l
 13537 2483 l 13544 2496 l 13550 2511 l 13556 2527 l 13560 2544 l
 13562 2562 l 13564 2581 l 13564 2601 l 13563 2621 l 13561 2642 l
 13558 2663 l 13553 2685 l 13548 2707 l 13541 2728 l 13533 2749 l
 13524 2769 l 13514 2789 l 13503 2808 l 13491 2826 l 13479 2843 l
 13466 2859 l 13453 2874 l 13439 2888 l 13422 2902 l 13404 2915 l
 13385 2928 l 13365 2940 l 13345 2952 l 13323 2963 l 13300 2974 l
 13277 2985 l 13253 2996 l 13230 3007 l 13207 3018 l 13184 3029 l
 13162 3040 l 13141 3051 l 13121 3062 l 13102 3074 l 13085 3085 l
 13069 3098 l 13055 3111 l 13042 3125 l 13032 3137 l 13023 3151 l
 13015 3165 l 13008 3179 l 13002 3195 l 12996 3211 l 12992 3228 l
 12989 3245 l 12987 3263 l 12986 3281 l 12986 3300 l 12987 3318 l
 12989 3336 l 12993 3354 l 12998 3371 l 13003 3388 l 13010 3404 l
 13018 3419 l 13026 3433 l 13036 3446 l 13047 3458 l 13058 3469 l
 13070 3479 l 13084 3488 l 13099 3496 l 13116 3503 l 13134 3510 l
 13154 3516 l 13174 3521 l 13196 3526 l 13219 3531 l 13243 3536 l
 13268 3541 l 13293 3546 l 13318 3551 l 13344 3557 l 13369 3564 l
 13393 3571 l 13417 3579 l 13440 3589 l 13462 3599 l 13483 3611 l
 13503 3624 l 13521 3638 l 13538 3654 l 13554 3673 l 13565 3687 l
 13575 3703 l 13585 3720 l 13594 3738 l 13602 3757 l 13609 3777 l
 13615 3799 l 13621 3822 l 13625 3845 l 13629 3870 l 13631 3895 l
 13632 3921 l 13631 3948 l 13630 3974 l 13627 4002 l 13622 4029 l
 13616 4056 l 13608 4083 l 13599 4110 l 13589 4136 l 13577 4162 l
 13563 4187 l 13548 4211 l 13532 4234 l 13514 4256 l 13495 4278 l
 13474 4298 l 13451 4317 l 13427 4335 l 13402 4353 l 13378 4367 l
 13352 4381 l 13325 4394 l 13296 4406 l 13266 4417 l 13235 4428 l
 13202 4439 l 13167 4448 l 13131 4457 l 13094 4465 l 13056 4472 l
 13016 4478 l 12976 4484 l 12935 4489 l 12893 4492 l 12850 4495 l
 12808 4497 l 12765 4498 l 12722 4498 l 12679 4497 l 12637 4495 l
 12595 4492 l 12554 4488 l 12513 4483 l 12474 4477 l 12435 4471 l
 12398 4464 l 12362 4456 l 12327 4447 l 12294 4437 l 12261 4426 l
 12230 4415 l 12200 4403 l 12172 4390 l 12141 4374 l 12111 4357 l
 12083 4339 l 12056 4319 l 12030 4297 l 12005 4273 l 11981 4248 l
 11957 4219 l 11934 4189 l 11911 4155 l 11888 4119 l 11865 4081 l
 11843 4040 l 11821 3996 l 11798 3951 l 11776 3904 l 11755 3856 l
 11734 3808 l 11715 3761 l 11697 3716 l 11680 3675 l 11666 3637 l
 11654 3605 l 11644 3578 l 11636 3557 l 11631 3542 l 11628 3533 l
 11626 3527 l 11625 3525 l s
% here ends figure;
pagefooter
showpage
%%Trailer
%EOF
