%!PS-Adobe-3.0 EPSF-3.0
%%Title: disk-anisotrop
%%Creator: GL2PS 1.4.3, (C) 1999-2020 C. Geuzaine
%%For: Gmsh
%%CreationDate: Wed Aug 17 21:46:40 2022
%%LanguageLevel: 3
%%DocumentData: Clean7Bit
%%Pages: 1
%%BoundingBox: 255 70 866 645
%%EndComments
%%BeginProlog
/gl2psdict 64 dict def gl2psdict begin
/tryPS3shading false def % set to false to force subdivision
/rThreshold 0.0666667 def % red component subdivision threshold
/gThreshold 0.05 def % green component subdivision threshold
/bThreshold 0.1 def % blue component subdivision threshold
/BD { bind def } bind def
/C  { setrgbcolor } BD
/G  { 0.082 mul exch 0.6094 mul add exch 0.3086 mul add neg 1.0 add setgray } BD
/W  { setlinewidth } BD
/LC  { setlinecap } BD
/LJ  { setlinejoin } BD
/FC { findfont exch /SH exch def SH scalefont setfont } BD
/SW { dup stringwidth pop } BD
/S  { FC moveto show } BD
/SBC{ FC moveto SW -2 div 0 rmoveto show } BD
/SBR{ FC moveto SW neg 0 rmoveto show } BD
/SCL{ FC moveto 0 SH -2 div rmoveto show } BD
/SCC{ FC moveto SW -2 div SH -2 div rmoveto show } BD
/SCR{ FC moveto SW neg SH -2 div rmoveto show } BD
/STL{ FC moveto 0 SH neg rmoveto show } BD
/STC{ FC moveto SW -2 div SH neg rmoveto show } BD
/STR{ FC moveto SW neg SH neg rmoveto show } BD
/FCT { FC translate 0 0 } BD
/SR  { gsave FCT moveto rotate show grestore } BD
/SBCR{ gsave FCT moveto rotate SW -2 div 0 rmoveto show grestore } BD
/SBRR{ gsave FCT moveto rotate SW neg 0 rmoveto show grestore } BD
/SCLR{ gsave FCT moveto rotate 0 SH -2 div rmoveto show grestore} BD
/SCCR{ gsave FCT moveto rotate SW -2 div SH -2 div rmoveto show grestore} BD
/SCRR{ gsave FCT moveto rotate SW neg SH -2 div rmoveto show grestore} BD
/STLR{ gsave FCT moveto rotate 0 SH neg rmoveto show grestore } BD
/STCR{ gsave FCT moveto rotate SW -2 div SH neg rmoveto show grestore } BD
/STRR{ gsave FCT moveto rotate SW neg SH neg rmoveto show grestore } BD
/P  { newpath 0.0 360.0 arc closepath fill } BD
/LS { newpath moveto } BD
/L  { lineto } BD
/LE { lineto stroke } BD
/T  { newpath moveto lineto lineto closepath fill } BD
/STshfill {
      /b1 exch def /g1 exch def /r1 exch def /y1 exch def /x1 exch def
      /b2 exch def /g2 exch def /r2 exch def /y2 exch def /x2 exch def
      /b3 exch def /g3 exch def /r3 exch def /y3 exch def /x3 exch def
      gsave << /ShadingType 4 /ColorSpace [/DeviceRGB]
      /DataSource [ 0 x1 y1 r1 g1 b1 0 x2 y2 r2 g2 b2 0 x3 y3 r3 g3 b3 ] >>
      shfill grestore } BD
/Tm { 3 -1 roll 8 -1 roll 13 -1 roll add add 3 div
      3 -1 roll 7 -1 roll 11 -1 roll add add 3 div
      3 -1 roll 6 -1 roll 9 -1 roll add add 3 div C T } BD
/STsplit {
      4 index 15 index add 0.5 mul
      4 index 15 index add 0.5 mul
      4 index 15 index add 0.5 mul
      4 index 15 index add 0.5 mul
      4 index 15 index add 0.5 mul
      5 copy 5 copy 25 15 roll
      9 index 30 index add 0.5 mul
      9 index 30 index add 0.5 mul
      9 index 30 index add 0.5 mul
      9 index 30 index add 0.5 mul
      9 index 30 index add 0.5 mul
      5 copy 5 copy 35 5 roll 25 5 roll 15 5 roll
      4 index 10 index add 0.5 mul
      4 index 10 index add 0.5 mul
      4 index 10 index add 0.5 mul
      4 index 10 index add 0.5 mul
      4 index 10 index add 0.5 mul
      5 copy 5 copy 40 5 roll 25 5 roll 15 5 roll 25 5 roll
      STnoshfill STnoshfill STnoshfill STnoshfill } BD
/STnoshfill {
      2 index 8 index sub abs rThreshold gt
      { STsplit }
      { 1 index 7 index sub abs gThreshold gt
        { STsplit }
        { dup 6 index sub abs bThreshold gt
          { STsplit }
          { 2 index 13 index sub abs rThreshold gt
            { STsplit }
            { 1 index 12 index sub abs gThreshold gt
              { STsplit }
              { dup 11 index sub abs bThreshold gt
                { STsplit }
                { 7 index 13 index sub abs rThreshold gt
                  { STsplit }
                  { 6 index 12 index sub abs gThreshold gt
                    { STsplit }
                    { 5 index 11 index sub abs bThreshold gt
                      { STsplit }
                      { Tm }
                      ifelse }
                    ifelse }
                  ifelse }
                ifelse }
              ifelse }
            ifelse }
          ifelse }
        ifelse }
      ifelse } BD
tryPS3shading
{ /shfill where
  { /ST { STshfill } BD }
  { /ST { STnoshfill } BD }
  ifelse }
{ /ST { STnoshfill } BD }
ifelse
end
%%EndProlog
%%BeginSetup
/DeviceRGB setcolorspace
gl2psdict begin
%%EndSetup
%%Page: 1 1
%%BeginPageSetup
%%EndPageSetup
mark
gsave
1.0 1.0 scale
0 0 0 C
(x) 854.818 103.714 15 /Helvetica S
(-1) 317.182 74.2142 15 /Helvetica S
(-0.5) 440.841 74.2142 15 /Helvetica S
(0.000124) 553 74.2142 15 /Helvetica S
(0.5) 702.659 74.2142 15 /Helvetica S
(1) 838.318 74.2142 15 /Helvetica S
(y) 323.682 634.786 15 /Helvetica S
(-1) 298.182 98.0476 15 /Helvetica S
(-0.5) 286.182 227.69 15 /Helvetica S
(2.8e-05) 262.182 357.333 15 /Helvetica S
(0.5) 291.182 486.976 15 /Helvetica S
(1) 303.182 616.619 15 /Helvetica S
1 W
323.682 103.714 LS
323.682 93.7143 LE
453.341 103.714 LS
453.341 93.7143 LE
583 103.714 LS
583 93.7143 LE
712.659 103.714 LS
712.659 93.7143 LE
842.318 103.714 LS
842.318 93.7143 LE
323.682 103.714 LS
313.682 103.714 LE
323.682 233.357 LS
313.682 233.357 LE
323.682 363 LS
313.682 363 LE
323.682 492.643 LS
313.682 492.643 LE
323.682 622.286 LS
313.682 622.286 LE
323.682 103.714 LS
842.318 103.714 LE
323.682 103.714 LS
323.682 622.286 LE
323.682 103.714 LS
323.682 103.714 LE
1 0.510338 0.0236323 C
746.396 348.544 LS
743.291 334.549 L
770.396 342.774 L
746.396 348.544 LE
763.192 362.575 LS
746.396 348.544 L
770.396 342.774 L
763.192 362.575 LE
740.226 363.522 LS
746.396 348.544 L
763.192 362.575 L
740.226 363.522 LE
743.291 334.549 LS
746.396 348.544 L
719.916 343.747 L
743.291 334.549 LE
719.916 343.747 LS
746.396 348.544 L
740.226 363.522 L
719.916 343.747 LE
756.164 320.173 LS
770.396 342.774 L
743.291 334.549 L
756.164 320.173 LE
723.443 326.917 LS
743.291 334.549 L
719.916 343.747 L
723.443 326.917 LE
756.164 320.173 LS
743.291 334.549 L
731.698 312.679 L
756.164 320.173 LE
731.698 312.679 LS
743.291 334.549 L
723.443 326.917 L
731.698 312.679 LE
778.433 325.902 LS
770.396 342.774 L
756.164 320.173 L
778.433 325.902 LE
769.739 304.447 LS
778.433 325.902 L
756.164 320.173 L
769.739 304.447 L
756.164 320.173 L
743.636 298.123 L
769.739 304.447 LE
743.636 298.123 LS
756.164 320.173 L
731.698 312.679 L
743.636 298.123 LE
715.415 297.911 LS
743.636 298.123 L
731.698 312.679 L
715.415 297.911 L
731.698 312.679 L
704.933 312.355 L
715.415 297.911 LE
704.933 312.355 LS
731.698 312.679 L
723.443 326.917 L
704.933 312.355 L
723.443 326.917 L
697.638 327.36 L
704.933 312.355 LE
697.638 327.36 LS
723.443 326.917 L
719.916 343.747 L
697.638 327.36 LE
715.512 358.331 LS
719.916 343.747 L
740.226 363.522 L
715.512 358.331 LE
697.638 327.36 LS
719.916 343.747 L
692.836 342.183 L
697.638 327.36 LE
692.836 342.183 LS
719.916 343.747 L
715.512 358.331 L
692.836 342.183 LE
779.361 356.381 LS
763.192 362.575 L
770.396 342.774 L
779.361 356.381 L
770.396 342.774 L
798.629 345.933 L
779.361 356.381 LE
798.629 345.933 LS
770.396 342.774 L
778.433 325.902 L
798.629 345.933 LE
798.889 363.498 LS
779.361 356.381 L
798.629 345.933 L
798.889 363.498 LE
763.192 362.575 LS
779.361 356.381 L
779.695 377.826 L
763.192 362.575 LE
779.695 377.826 LS
779.361 356.381 L
798.889 363.498 L
779.695 377.826 LE
740.226 363.522 LS
763.192 362.575 L
755.322 380.375 L
740.226 363.522 LE
755.322 380.375 LS
763.192 362.575 L
779.695 377.826 L
755.322 380.375 LE
715.512 358.331 LS
740.226 363.522 L
730.786 379.377 L
715.512 358.331 LE
730.786 379.377 LS
740.226 363.522 L
755.322 380.375 L
730.786 379.377 LE
706.438 369.738 LS
715.512 358.331 L
730.786 379.377 L
706.438 369.738 LE
692.836 342.183 LS
715.512 358.331 L
689.358 358.182 L
692.836 342.183 LE
689.358 358.182 LS
715.512 358.331 L
706.438 369.738 L
689.358 358.182 LE
706.689 384.289 LS
706.438 369.738 L
730.786 379.377 L
706.689 384.289 LE
689.358 358.182 LS
706.438 369.738 L
681.915 374.629 L
689.358 358.182 LE
681.915 374.629 LS
706.438 369.738 L
706.689 384.289 L
681.915 374.629 LE
667.959 357.738 LS
689.358 358.182 L
681.915 374.629 L
667.959 357.738 LE
692.836 342.183 LS
689.358 358.182 L
670.696 340.325 L
692.836 342.183 LE
670.696 340.325 LS
689.358 358.182 L
667.959 357.738 L
670.696 340.325 LE
697.638 327.36 LS
692.836 342.183 L
673.751 324.2 L
697.638 327.36 LE
673.751 324.2 LS
692.836 342.183 L
670.696 340.325 L
673.751 324.2 LE
704.933 312.355 LS
697.638 327.36 L
680.569 309.101 L
704.933 312.355 LE
680.569 309.101 LS
697.638 327.36 L
673.751 324.2 L
680.569 309.101 LE
715.415 297.911 LS
704.933 312.355 L
688.6 294.142 L
715.415 297.911 LE
688.6 294.142 LS
704.933 312.355 L
680.569 309.101 L
688.6 294.142 LE
719.882 281.739 LS
743.636 298.123 L
715.415 297.911 L
719.882 281.739 L
715.415 297.911 L
697.618 279.225 L
719.882 281.739 LE
697.618 279.225 LS
715.415 297.911 L
688.6 294.142 L
697.618 279.225 LE
796.888 327.959 LS
798.629 345.933 L
778.433 325.902 L
796.888 327.959 L
778.433 325.902 L
793.533 309.722 L
796.888 327.959 LE
793.533 309.722 LS
778.433 325.902 L
769.739 304.447 L
793.533 309.722 LE
740.557 283.056 LS
743.636 298.123 L
719.882 281.739 L
740.557 283.056 LE
769.739 304.447 LS
743.636 298.123 L
763.765 285.979 L
769.739 304.447 LE
763.765 285.979 LS
743.636 298.123 L
740.557 283.056 L
763.765 285.979 LE
793.533 309.722 LS
769.739 304.447 L
788.415 291.278 L
793.533 309.722 LE
788.415 291.278 LS
769.739 304.447 L
763.765 285.979 L
788.415 291.278 LE
707.385 264.293 LS
719.882 281.739 L
697.618 279.225 L
707.385 264.293 LE
740.557 283.056 LS
719.882 281.739 L
731.899 264.869 L
740.557 283.056 LE
731.899 264.869 LS
719.882 281.739 L
707.385 264.293 L
731.899 264.869 LE
763.765 285.979 LS
740.557 283.056 L
755.579 266.933 L
763.765 285.979 LE
755.579 266.933 LS
740.557 283.056 L
731.899 264.869 L
755.579 266.933 LE
788.415 291.278 LS
763.765 285.979 L
781.318 272.688 L
788.415 291.278 LE
781.318 272.688 LS
763.765 285.979 L
755.579 266.933 L
781.318 272.688 LE
718.225 247.38 LS
731.899 264.869 L
707.385 264.293 L
718.225 247.38 LE
755.579 266.933 LS
731.899 264.869 L
743.751 247.521 L
755.579 266.933 LE
743.751 247.521 LS
731.899 264.869 L
718.225 247.38 L
743.751 247.521 LE
781.318 272.688 LS
755.579 266.933 L
772.434 253.896 L
781.318 272.688 LE
772.434 253.896 LS
755.579 266.933 L
743.751 247.521 L
772.434 253.896 LE
758.363 235.752 LS
772.434 253.896 L
743.751 247.521 L
758.363 235.752 L
743.751 247.521 L
727.78 226.972 L
758.363 235.752 LE
727.78 226.972 LS
743.751 247.521 L
718.225 247.38 L
727.78 226.972 LE
701.534 234.545 LS
727.78 226.972 L
718.225 247.38 L
701.534 234.545 L
718.225 247.38 L
690.658 249.884 L
701.534 234.545 LE
690.658 249.884 LS
718.225 247.38 L
707.385 264.293 L
690.658 249.884 L
707.385 264.293 L
680.437 265.178 L
690.658 249.884 LE
680.437 265.178 LS
707.385 264.293 L
697.618 279.225 L
680.437 265.178 L
697.618 279.225 L
670.871 280.436 L
680.437 265.178 LE
670.871 280.436 LS
697.618 279.225 L
688.6 294.142 L
670.871 280.436 L
688.6 294.142 L
662.051 295.668 L
670.871 280.436 LE
662.051 295.668 LS
688.6 294.142 L
680.569 309.101 L
662.051 295.668 L
680.569 309.101 L
654.457 310.85 L
662.051 295.668 LE
654.457 310.85 LS
680.569 309.101 L
673.751 324.2 L
654.457 310.85 L
673.751 324.2 L
648.549 326.667 L
654.457 310.85 LE
648.549 326.667 LS
673.751 324.2 L
670.696 340.325 L
648.549 326.667 L
670.696 340.325 L
648.878 342.92 L
648.549 326.667 LE
648.878 342.92 LS
670.696 340.325 L
667.959 357.738 L
648.878 342.92 LE
727.654 393.626 LS
706.689 384.289 L
730.786 379.377 L
727.654 393.626 L
730.786 379.377 L
748.543 397.542 L
727.654 393.626 LE
748.543 397.542 LS
730.786 379.377 L
755.322 380.375 L
748.543 397.542 L
755.322 380.375 L
772.854 396.083 L
748.543 397.542 LE
772.854 396.083 LS
755.322 380.375 L
779.695 377.826 L
772.854 396.083 LE
488.562 589.372 LS
480.466 579.948 L
505.474 589.803 L
488.562 589.372 LE
511 598.265 LS
488.562 589.372 L
505.474 589.803 L
511 598.265 LE
485.882 595.51 LS
488.562 589.372 L
511 598.265 L
485.882 595.51 LE
480.466 579.948 LS
488.562 589.372 L
466.46 585.146 L
480.466 579.948 LE
466.46 585.146 LS
488.562 589.372 L
485.882 595.51 L
466.46 585.146 LE
480.466 579.948 LS
466.46 585.146 L
450.895 573.5 L
480.466 579.948 LE
462.565 567.073 LS
480.466 579.948 L
450.895 573.5 L
462.565 567.073 LE
488.275 574.018 LS
480.466 579.948 L
462.565 567.073 L
488.275 574.018 LE
505.474 589.803 LS
480.466 579.948 L
510.656 584.38 L
505.474 589.803 LE
510.656 584.38 LS
480.466 579.948 L
488.275 574.018 L
510.656 584.38 LE
511 598.265 LS
505.474 589.803 L
531.864 598.485 L
511 598.265 LE
531.864 598.485 LS
505.474 589.803 L
510.656 584.38 L
531.864 598.485 LE
509.83 605.529 LS
485.882 595.51 L
511 598.265 L
509.83 605.529 L
511 598.265 L
534.247 609.631 L
509.83 605.529 LE
534.247 609.631 LS
511 598.265 L
531.864 598.485 L
534.247 609.631 LE
534.22 589.601 LS
531.864 598.485 L
510.656 584.38 L
534.22 589.601 LE
554.347 600.839 LS
531.864 598.485 L
534.22 589.601 L
554.347 600.839 LE
534.247 609.631 LS
531.864 598.485 L
554.717 611.542 L
534.247 609.631 LE
554.717 611.542 LS
531.864 598.485 L
554.347 600.839 L
554.717 611.542 LE
691.351 392.171 LS
681.915 374.629 L
706.689 384.289 L
691.351 392.171 L
706.689 384.289 L
716.615 403.868 L
691.351 392.171 LE
716.615 403.868 LS
706.689 384.289 L
727.654 393.626 L
716.615 403.868 L
727.654 393.626 L
741.813 413.309 L
716.615 403.868 LE
741.813 413.309 LS
727.654 393.626 L
748.543 397.542 L
741.813 413.309 L
748.543 397.542 L
769.013 411.949 L
741.813 413.309 LE
769.013 411.949 LS
748.543 397.542 L
772.854 396.083 L
769.013 411.949 LE
697.133 409.612 LS
691.351 392.171 L
716.615 403.868 L
697.133 409.612 L
716.615 403.868 L
718.205 421.913 L
697.133 409.612 LE
718.205 421.913 LS
716.615 403.868 L
741.813 413.309 L
718.205 421.913 LE
739.163 427.224 LS
718.205 421.913 L
741.813 413.309 L
739.163 427.224 L
741.813 413.309 L
764.122 427.323 L
739.163 427.224 LE
764.122 427.323 LS
741.813 413.309 L
769.013 411.949 L
764.122 427.323 LE
699.999 426.576 LS
697.133 409.612 L
718.205 421.913 L
699.999 426.576 L
718.205 421.913 L
727.778 440.508 L
699.999 426.576 LE
727.778 440.508 LS
718.205 421.913 L
739.163 427.224 L
727.778 440.508 L
739.163 427.224 L
758.267 442.163 L
727.778 440.508 LE
758.267 442.163 LS
739.163 427.224 L
764.122 427.323 L
758.267 442.163 LE
751.55 456.438 LS
727.778 440.508 L
758.267 442.163 L
751.55 456.438 LE
723.999 455.526 LS
727.778 440.508 L
751.55 456.438 L
723.999 455.526 LE
699.999 426.576 LS
727.778 440.508 L
700.513 442.88 L
699.999 426.576 LE
700.513 442.88 LS
727.778 440.508 L
723.999 455.526 L
700.513 442.88 LE
744.131 470.001 LS
723.999 455.526 L
751.55 456.438 L
744.131 470.001 LE
718.862 470.097 LS
723.999 455.526 L
744.131 470.001 L
718.862 470.097 LE
700.513 442.88 LS
723.999 455.526 L
699.099 458.43 L
700.513 442.88 LE
699.099 458.43 LS
723.999 455.526 L
718.862 470.097 L
699.099 458.43 LE
574.214 611.709 LS
554.717 611.542 L
554.347 600.839 L
574.214 611.709 LE
573.527 600.383 LS
574.214 611.709 L
554.347 600.839 L
573.527 600.383 L
554.347 600.839 L
553.771 590.354 L
573.527 600.383 LE
553.771 590.354 LS
554.347 600.839 L
534.22 589.601 L
553.771 590.354 LE
592.713 610.392 LS
574.214 611.709 L
573.527 600.383 L
592.713 610.392 LE
590.605 598.123 LS
592.713 610.392 L
573.527 600.383 L
590.605 598.123 L
573.527 600.383 L
570.479 588.666 L
590.605 598.123 LE
570.479 588.666 LS
573.527 600.383 L
553.771 590.354 L
570.479 588.666 LE
610.306 607.761 LS
592.713 610.392 L
590.605 598.123 L
610.306 607.761 LE
606.495 594.541 LS
610.306 607.761 L
590.605 598.123 L
606.495 594.541 L
590.605 598.123 L
585.362 585.395 L
606.495 594.541 LE
585.362 585.395 LS
590.605 598.123 L
570.479 588.666 L
585.362 585.395 LE
627.279 604.069 LS
610.306 607.761 L
606.495 594.541 L
627.279 604.069 LE
621.41 589.853 LS
627.279 604.069 L
606.495 594.541 L
621.41 589.853 L
606.495 594.541 L
598.972 580.911 L
621.41 589.853 LE
598.972 580.911 LS
606.495 594.541 L
585.362 585.395 L
598.972 580.911 LE
643.621 599.34 LS
627.279 604.069 L
621.41 589.853 L
643.621 599.34 LE
635.552 584.161 LS
643.621 599.34 L
621.41 589.853 L
635.552 584.161 L
621.41 589.853 L
611.609 575.398 L
635.552 584.161 LE
611.609 575.398 LS
621.41 589.853 L
598.972 580.911 L
611.609 575.398 LE
659.368 593.627 LS
643.621 599.34 L
635.552 584.161 L
659.368 593.627 LE
648.902 577.543 LS
659.368 593.627 L
635.552 584.161 L
648.902 577.543 L
635.552 584.161 L
623.438 568.952 L
648.902 577.543 LE
623.438 568.952 LS
635.552 584.161 L
611.609 575.398 L
623.438 568.952 LE
674.477 586.931 LS
659.368 593.627 L
648.902 577.543 L
674.477 586.931 LE
661.61 570.051 LS
674.477 586.931 L
648.902 577.543 L
661.61 570.051 L
648.902 577.543 L
634.547 561.628 L
661.61 570.051 LE
634.547 561.628 LS
648.902 577.543 L
623.438 568.952 L
634.547 561.628 LE
689.159 579.394 LS
674.477 586.931 L
661.61 570.051 L
689.159 579.394 LE
673.825 561.703 LS
689.159 579.394 L
661.61 570.051 L
673.825 561.703 L
661.61 570.051 L
644.973 553.457 L
673.825 561.703 LE
644.973 553.457 LS
661.61 570.051 L
634.547 561.628 L
644.973 553.457 LE
696.076 473.184 LS
699.099 458.43 L
718.862 470.097 L
696.076 473.184 LE
736.223 482.82 LS
718.862 470.097 L
744.131 470.001 L
736.223 482.82 LE
696.076 473.184 LS
718.862 470.097 L
712.837 484.49 L
696.076 473.184 LE
712.837 484.49 LS
718.862 470.097 L
736.223 482.82 L
712.837 484.49 LE
797.701 380.743 LS
779.695 377.826 L
798.889 363.498 L
797.701 380.743 LE
772.854 396.083 LS
779.695 377.826 L
795.264 397.705 L
772.854 396.083 LE
795.264 397.705 LS
779.695 377.826 L
797.701 380.743 L
795.264 397.705 LE
769.013 411.949 LS
772.854 396.083 L
791.655 414.19 L
769.013 411.949 LE
791.655 414.19 LS
772.854 396.083 L
795.264 397.705 L
791.655 414.19 LE
764.122 427.323 LS
769.013 411.949 L
786.931 430.161 L
764.122 427.323 LE
786.931 430.161 LS
769.013 411.949 L
791.655 414.19 L
786.931 430.161 LE
758.267 442.163 LS
764.122 427.323 L
781.161 445.586 L
758.267 442.163 LE
781.161 445.586 LS
764.122 427.323 L
786.931 430.161 L
781.161 445.586 LE
751.55 456.438 LS
758.267 442.163 L
774.413 460.434 L
751.55 456.438 LE
774.413 460.434 LS
758.267 442.163 L
781.161 445.586 L
774.413 460.434 LE
744.131 470.001 LS
751.55 456.438 L
766.75 474.679 L
744.131 470.001 LE
766.75 474.679 LS
751.55 456.438 L
774.413 460.434 L
766.75 474.679 LE
736.223 482.82 LS
744.131 470.001 L
758.214 488.302 L
736.223 482.82 LE
758.214 488.302 LS
744.131 470.001 L
766.75 474.679 L
758.214 488.302 LE
691.691 487.121 LS
696.076 473.184 L
712.837 484.49 L
691.691 487.121 LE
728.318 494.978 LS
712.837 484.49 L
736.223 482.82 L
728.318 494.978 LE
691.691 487.121 LS
712.837 484.49 L
712.855 500.513 L
691.691 487.121 LE
712.855 500.513 LS
712.837 484.49 L
728.318 494.978 L
712.855 500.513 LE
728.318 494.978 LS
736.223 482.82 L
748.833 501.275 L
728.318 494.978 LE
748.833 501.275 LS
736.223 482.82 L
758.214 488.302 L
748.833 501.275 LE
712.855 500.513 LS
728.318 494.978 L
738.618 513.625 L
712.855 500.513 LE
738.618 513.625 LS
728.318 494.978 L
748.833 501.275 L
738.618 513.625 LE
708.312 512.609 LS
712.855 500.513 L
738.618 513.625 L
708.312 512.609 LE
691.691 487.121 LS
712.855 500.513 L
686.133 500.234 L
691.691 487.121 LE
686.133 500.234 LS
712.855 500.513 L
708.312 512.609 L
686.133 500.234 LE
727.744 525.264 LS
708.312 512.609 L
738.618 513.625 L
727.744 525.264 LE
699.187 524.669 LS
708.312 512.609 L
727.744 525.264 L
699.187 524.669 LE
686.133 500.234 LS
708.312 512.609 L
679.553 512.522 L
686.133 500.234 LE
679.553 512.522 LS
708.312 512.609 L
699.187 524.669 L
679.553 512.522 LE
716.224 536.17 LS
699.187 524.669 L
727.744 525.264 L
716.224 536.17 LE
689.235 536.314 LS
699.187 524.669 L
716.224 536.17 L
689.235 536.314 LE
679.553 512.522 LS
699.187 524.669 L
672.068 523.987 L
679.553 512.522 LE
672.068 523.987 LS
699.187 524.669 L
689.235 536.314 L
672.068 523.987 LE
663.768 534.631 LS
672.068 523.987 L
689.235 536.314 L
663.768 534.631 LE
704.086 546.328 LS
689.235 536.314 L
716.224 536.17 L
704.086 546.328 LE
663.768 534.631 LS
689.235 536.314 L
678.965 547.985 L
663.768 534.631 LE
678.965 547.985 LS
689.235 536.314 L
704.086 546.328 L
678.965 547.985 LE
654.721 544.455 LS
663.768 534.631 L
678.965 547.985 L
654.721 544.455 LE
691.362 555.724 LS
678.965 547.985 L
704.086 546.328 L
691.362 555.724 LE
654.721 544.455 LS
678.965 547.985 L
673.825 561.703 L
654.721 544.455 LE
673.825 561.703 LS
678.965 547.985 L
691.362 555.724 L
673.825 561.703 LE
644.973 553.457 LS
654.721 544.455 L
673.825 561.703 L
644.973 553.457 LE
689.159 579.394 LS
673.825 561.703 L
703.286 570.971 L
689.159 579.394 LE
703.286 570.971 LS
673.825 561.703 L
691.362 555.724 L
703.286 570.971 L
691.362 555.724 L
716.837 561.682 L
703.286 570.971 LE
716.837 561.682 LS
691.362 555.724 L
704.086 546.328 L
716.837 561.682 L
704.086 546.328 L
729.784 551.543 L
716.837 561.682 LE
729.784 551.543 LS
704.086 546.328 L
716.224 536.17 L
729.784 551.543 L
716.224 536.17 L
742.092 540.566 L
729.784 551.543 LE
742.092 540.566 LS
716.224 536.17 L
727.744 525.264 L
742.092 540.566 L
727.744 525.264 L
753.721 528.768 L
742.092 540.566 LE
753.721 528.768 LS
727.744 525.264 L
738.618 513.625 L
753.721 528.768 L
738.618 513.625 L
764.627 516.163 L
753.721 528.768 LE
764.627 516.163 LS
738.618 513.625 L
748.833 501.275 L
764.627 516.163 L
748.833 501.275 L
774.769 502.769 L
764.627 516.163 LE
774.769 502.769 LS
748.833 501.275 L
758.214 488.302 L
774.769 502.769 L
758.214 488.302 L
784.125 488.614 L
774.769 502.769 LE
784.125 488.614 LS
758.214 488.302 L
766.75 474.679 L
784.125 488.614 L
766.75 474.679 L
792.491 473.774 L
784.125 488.614 LE
792.491 473.774 LS
766.75 474.679 L
774.413 460.434 L
792.491 473.774 L
774.413 460.434 L
799.901 458.239 L
792.491 473.774 LE
799.901 458.239 LS
774.413 460.434 L
781.161 445.586 L
799.901 458.239 L
781.161 445.586 L
806.289 442.042 L
799.901 458.239 LE
806.289 442.042 LS
781.161 445.586 L
786.931 430.161 L
806.289 442.042 L
786.931 430.161 L
811.587 425.222 L
806.289 442.042 LE
811.587 425.222 LS
786.931 430.161 L
791.655 414.19 L
811.587 425.222 L
791.655 414.19 L
815.719 407.823 L
811.587 425.222 LE
815.719 407.823 LS
791.655 414.19 L
795.264 397.705 L
815.719 407.823 L
795.264 397.705 L
818.609 389.893 L
815.719 407.823 LE
818.609 389.893 LS
795.264 397.705 L
797.701 380.743 L
818.609 389.893 L
797.701 380.743 L
820.178 371.49 L
818.609 389.893 LE
820.178 371.49 LS
797.701 380.743 L
798.889 363.498 L
820.178 371.49 L
798.889 363.498 L
820.371 352.678 L
820.178 371.49 LE
820.371 352.678 LS
798.889 363.498 L
798.629 345.933 L
820.371 352.678 L
798.629 345.933 L
819.067 333.679 L
820.371 352.678 LE
819.067 333.679 LS
798.629 345.933 L
796.888 327.959 L
819.067 333.679 L
796.888 327.959 L
816.205 314.487 L
819.067 333.679 LE
816.205 314.487 LS
796.888 327.959 L
793.533 309.722 L
816.205 314.487 L
793.533 309.722 L
811.7 295.213 L
816.205 314.487 LE
811.7 295.213 LS
793.533 309.722 L
788.415 291.278 L
811.7 295.213 L
788.415 291.278 L
805.467 275.983 L
811.7 295.213 LE
805.467 275.983 LS
788.415 291.278 L
781.318 272.688 L
805.467 275.983 L
781.318 272.688 L
797.421 256.94 L
805.467 275.983 LE
797.421 256.94 LS
781.318 272.688 L
772.434 253.896 L
797.421 256.94 L
772.434 253.896 L
787.48 238.246 L
797.421 256.94 LE
787.48 238.246 LS
772.434 253.896 L
758.363 235.752 L
787.48 238.246 LE
749.571 219.569 LS
758.363 235.752 L
727.78 226.972 L
749.571 219.569 LE
787.48 238.246 LS
758.363 235.752 L
775.566 220.084 L
787.48 238.246 LE
775.566 220.084 LS
758.363 235.752 L
749.571 219.569 L
775.566 220.084 LE
712.816 219.161 LS
727.78 226.972 L
701.534 234.545 L
712.816 219.161 LE
749.571 219.569 LS
727.78 226.972 L
730.003 203.414 L
749.571 219.569 LE
730.003 203.414 LS
727.78 226.972 L
712.816 219.161 L
730.003 203.414 LE
775.566 220.084 LS
749.571 219.569 L
761.619 202.64 L
775.566 220.084 LE
761.619 202.64 LS
749.571 219.569 L
730.003 203.414 L
761.619 202.64 LE
745.847 185.691 LS
761.619 202.64 L
730.003 203.414 L
745.847 185.691 LE
714.586 187.194 LS
745.847 185.691 L
730.003 203.414 L
714.586 187.194 L
730.003 203.414 L
697.566 202.969 L
714.586 187.194 LE
697.566 202.969 LS
730.003 203.414 L
712.816 219.161 L
697.566 202.969 LE
727.972 170.412 LS
745.847 185.691 L
714.586 187.194 L
727.972 170.412 LE
698.784 168.751 LS
727.972 170.412 L
714.586 187.194 L
698.784 168.751 L
714.586 187.194 L
683.791 185.296 L
698.784 168.751 LE
683.791 185.296 LS
714.586 187.194 L
697.566 202.969 L
683.791 185.296 LE
697.566 202.969 LS
712.816 219.161 L
685.758 218.732 L
697.566 202.969 LE
685.758 218.732 LS
712.816 219.161 L
701.534 234.545 L
685.758 218.732 LE
683.791 185.296 LS
697.566 202.969 L
670.88 201.736 L
683.791 185.296 LE
670.88 201.736 LS
697.566 202.969 L
685.758 218.732 L
670.88 201.736 LE
685.758 218.732 LS
701.534 234.545 L
674.622 234.294 L
685.758 218.732 LE
674.622 234.294 LS
701.534 234.545 L
690.658 249.884 L
674.622 234.294 LE
670.88 201.736 LS
685.758 218.732 L
658.854 217.466 L
670.88 201.736 LE
658.854 217.466 LS
685.758 218.732 L
674.622 234.294 L
658.854 217.466 LE
674.622 234.294 LS
690.658 249.884 L
663.995 249.959 L
674.622 234.294 LE
663.995 249.959 LS
690.658 249.884 L
680.437 265.178 L
663.995 249.959 LE
658.854 217.466 LS
674.622 234.294 L
648.047 233.138 L
658.854 217.466 LE
648.047 233.138 LS
674.622 234.294 L
663.995 249.959 L
648.047 233.138 LE
663.995 249.959 LS
680.437 265.178 L
653.945 265.62 L
663.995 249.959 LE
653.945 265.62 LS
680.437 265.178 L
670.871 280.436 L
653.945 265.62 LE
648.047 233.138 LS
663.995 249.959 L
637.898 248.79 L
648.047 233.138 LE
637.898 248.79 LS
663.995 249.959 L
653.945 265.62 L
637.898 248.79 LE
653.945 265.62 LS
670.871 280.436 L
644.645 281.274 L
653.945 265.62 LE
644.645 281.274 LS
670.871 280.436 L
662.051 295.668 L
644.645 281.274 LE
637.898 248.79 LS
653.945 265.62 L
628.686 264.419 L
637.898 248.79 LE
628.686 264.419 LS
653.945 265.62 L
644.645 281.274 L
628.686 264.419 LE
644.645 281.274 LS
662.051 295.668 L
636.05 296.953 L
644.645 281.274 LE
636.05 296.953 LS
662.051 295.668 L
654.457 310.85 L
636.05 296.953 LE
628.686 264.419 LS
644.645 281.274 L
618.864 279.786 L
628.686 264.419 LE
618.864 279.786 LS
644.645 281.274 L
636.05 296.953 L
618.864 279.786 LE
636.05 296.953 LS
654.457 310.85 L
629.824 313.648 L
636.05 296.953 LE
629.824 313.648 LS
654.457 310.85 L
648.549 326.667 L
629.824 313.648 LE
618.864 279.786 LS
636.05 296.953 L
611.494 294.902 L
618.864 279.786 LE
611.494 294.902 LS
636.05 296.953 L
629.824 313.648 L
611.494 294.902 LE
629.824 313.648 LS
648.549 326.667 L
625.447 332.25 L
629.824 313.648 LE
625.447 332.25 LS
648.549 326.667 L
648.878 342.92 L
625.447 332.25 LE
608.184 311.998 LS
611.494 294.902 L
629.824 313.648 L
608.184 311.998 L
629.824 313.648 L
625.447 332.25 L
608.184 311.998 LE
600.352 327.128 LS
608.184 311.998 L
625.447 332.25 L
600.352 327.128 LE
584.908 310.054 LS
608.184 311.998 L
600.352 327.128 L
584.908 310.054 LE
611.494 294.902 LS
608.184 311.998 L
587.631 292.43 L
611.494 294.902 LE
587.631 292.43 LS
608.184 311.998 L
584.908 310.054 L
587.631 292.43 LE
618.864 279.786 LS
611.494 294.902 L
594.397 277.002 L
618.864 279.786 LE
594.397 277.002 LS
611.494 294.902 L
587.631 292.43 L
594.397 277.002 LE
628.686 264.419 LS
618.864 279.786 L
604.257 261.592 L
628.686 264.419 LE
604.257 261.592 LS
618.864 279.786 L
594.397 277.002 L
604.257 261.592 LE
637.898 248.79 LS
628.686 264.419 L
613.144 245.688 L
637.898 248.79 LE
613.144 245.688 LS
628.686 264.419 L
604.257 261.592 L
613.144 245.688 LE
648.047 233.138 LS
637.898 248.79 L
622.948 229.877 L
648.047 233.138 LE
622.948 229.877 LS
637.898 248.79 L
613.144 245.688 L
622.948 229.877 LE
658.854 217.466 LS
648.047 233.138 L
633.297 214.179 L
658.854 217.466 LE
633.297 214.179 LS
648.047 233.138 L
622.948 229.877 L
633.297 214.179 LE
670.88 201.736 LS
658.854 217.466 L
644.761 198.88 L
670.88 201.736 LE
644.761 198.88 LS
658.854 217.466 L
633.297 214.179 L
644.761 198.88 LE
683.791 185.296 LS
670.88 201.736 L
657.344 183.67 L
683.791 185.296 LE
657.344 183.67 LS
670.88 201.736 L
644.761 198.88 L
657.344 183.67 LE
698.784 168.751 LS
683.791 185.296 L
672.717 165.939 L
698.784 168.751 LE
672.717 165.939 LS
683.791 185.296 L
657.344 183.67 L
672.717 165.939 LE
708.507 156.929 LS
727.972 170.412 L
698.784 168.751 L
708.507 156.929 L
698.784 168.751 L
687.701 145.465 L
708.507 156.929 LE
687.701 145.465 LS
698.784 168.751 L
672.717 165.939 L
687.701 145.465 LE
659.27 150.183 LS
687.701 145.465 L
672.717 165.939 L
659.27 150.183 L
672.717 165.939 L
644.55 165.631 L
659.27 150.183 LE
644.55 165.631 LS
672.717 165.939 L
657.344 183.67 L
644.55 165.631 L
657.344 183.67 L
630.613 181.765 L
644.55 165.631 LE
630.613 181.765 LS
657.344 183.67 L
644.761 198.88 L
630.613 181.765 L
644.761 198.88 L
617.754 197.503 L
630.613 181.765 LE
617.754 197.503 LS
644.761 198.88 L
633.297 214.179 L
617.754 197.503 L
633.297 214.179 L
606.617 213.304 L
617.754 197.503 LE
606.617 213.304 LS
633.297 214.179 L
622.948 229.877 L
606.617 213.304 L
622.948 229.877 L
596.655 229.108 L
606.617 213.304 LE
596.655 229.108 LS
622.948 229.877 L
613.144 245.688 L
596.655 229.108 L
613.144 245.688 L
588.182 244.966 L
596.655 229.108 LE
588.182 244.966 LS
613.144 245.688 L
604.257 261.592 L
588.182 244.966 L
604.257 261.592 L
579.532 260.806 L
588.182 244.966 LE
579.532 260.806 LS
604.257 261.592 L
594.397 277.002 L
579.532 260.806 L
594.397 277.002 L
568.043 276.189 L
579.532 260.806 LE
568.043 276.189 LS
594.397 277.002 L
587.631 292.43 L
568.043 276.189 L
587.631 292.43 L
564.029 291.747 L
568.043 276.189 LE
564.029 291.747 LS
587.631 292.43 L
584.908 310.054 L
564.029 291.747 LE
566.603 308.019 LS
564.029 291.747 L
584.908 310.054 L
566.603 308.019 L
584.908 310.054 L
576.218 327.14 L
566.603 308.019 LE
576.218 327.14 LS
584.908 310.054 L
600.352 327.128 L
576.218 327.14 LE
551.209 315.556 LS
566.603 308.019 L
576.218 327.14 L
551.209 315.556 LE
564.029 291.747 LS
566.603 308.019 L
542.351 293.516 L
564.029 291.747 LE
542.351 293.516 LS
566.603 308.019 L
551.209 315.556 L
542.351 293.516 LE
568.043 276.189 LS
564.029 291.747 L
542.841 275.732 L
568.043 276.189 LE
542.841 275.732 LS
564.029 291.747 L
542.351 293.516 L
542.841 275.732 LE
579.532 260.806 LS
568.043 276.189 L
555.366 258.464 L
579.532 260.806 LE
555.366 258.464 LS
568.043 276.189 L
542.841 275.732 L
555.366 258.464 LE
528.113 303.946 LS
542.351 293.516 L
551.209 315.556 L
528.113 303.946 LE
519.885 286.575 LS
542.351 293.516 L
528.113 303.946 L
519.885 286.575 LE
542.841 275.732 LS
542.351 293.516 L
522.201 273.046 L
542.841 275.732 LE
522.201 273.046 LS
542.351 293.516 L
519.885 286.575 L
522.201 273.046 LE
555.366 258.464 LS
542.841 275.732 L
531.214 257.064 L
555.366 258.464 LE
531.214 257.064 LS
542.841 275.732 L
522.201 273.046 L
531.214 257.064 LE
504.602 293.933 LS
519.885 286.575 L
528.113 303.946 L
504.602 293.933 LE
522.201 273.046 LS
519.885 286.575 L
496.943 272.197 L
522.201 273.046 LE
496.943 272.197 LS
519.885 286.575 L
504.602 293.933 L
496.943 272.197 LE
531.214 257.064 LS
522.201 273.046 L
505.812 256.105 L
531.214 257.064 LE
505.812 256.105 LS
522.201 273.046 L
496.943 272.197 L
505.812 256.105 LE
588.182 244.966 LS
579.532 260.806 L
563.921 242.308 L
588.182 244.966 LE
563.921 242.308 LS
579.532 260.806 L
555.366 258.464 L
563.921 242.308 L
555.366 258.464 L
539.876 240.237 L
563.921 242.308 LE
539.876 240.237 LS
555.366 258.464 L
531.214 257.064 L
539.876 240.237 L
531.214 257.064 L
516.229 240.631 L
539.876 240.237 LE
516.229 240.631 LS
531.214 257.064 L
505.812 256.105 L
516.229 240.631 LE
596.655 229.108 LS
588.182 244.966 L
572.06 226.262 L
596.655 229.108 LE
572.06 226.262 LS
588.182 244.966 L
563.921 242.308 L
572.06 226.262 LE
606.617 213.304 LS
596.655 229.108 L
581.415 210.114 L
606.617 213.304 LE
581.415 210.114 LS
596.655 229.108 L
572.06 226.262 L
581.415 210.114 LE
617.754 197.503 LS
606.617 213.304 L
592.098 194.212 L
617.754 197.503 LE
592.098 194.212 LS
606.617 213.304 L
581.415 210.114 L
592.098 194.212 LE
630.613 181.765 LS
617.754 197.503 L
604.884 178.532 L
630.613 181.765 LE
604.884 178.532 LS
617.754 197.503 L
592.098 194.212 L
604.884 178.532 LE
644.55 165.631 LS
630.613 181.765 L
618.867 162.349 L
644.55 165.631 LE
618.867 162.349 LS
630.613 181.765 L
604.884 178.532 L
618.867 162.349 LE
572.06 226.262 LS
563.921 242.308 L
547.553 223.698 L
572.06 226.262 LE
547.553 223.698 LS
563.921 242.308 L
539.876 240.237 L
547.553 223.698 LE
581.415 210.114 LS
572.06 226.262 L
556.576 207.213 L
581.415 210.114 LE
556.576 207.213 LS
572.06 226.262 L
547.553 223.698 L
556.576 207.213 LE
592.098 194.212 LS
581.415 210.114 L
566.538 190.899 L
592.098 194.212 LE
566.538 190.899 LS
581.415 210.114 L
556.576 207.213 L
566.538 190.899 LE
604.884 178.532 LS
592.098 194.212 L
579.31 175.539 L
604.884 178.532 LE
579.31 175.539 LS
592.098 194.212 L
566.538 190.899 L
579.31 175.539 LE
618.867 162.349 LS
604.884 178.532 L
593.704 159.396 L
618.867 162.349 LE
593.704 159.396 LS
604.884 178.532 L
579.31 175.539 L
593.704 159.396 LE
547.553 223.698 LS
539.876 240.237 L
523.221 222.026 L
547.553 223.698 LE
523.221 222.026 LS
539.876 240.237 L
516.229 240.631 L
523.221 222.026 LE
556.576 207.213 LS
547.553 223.698 L
531.971 204.858 L
556.576 207.213 LE
531.971 204.858 LS
547.553 223.698 L
523.221 222.026 L
531.971 204.858 LE
566.538 190.899 LS
556.576 207.213 L
541.48 188.036 L
566.538 190.899 LE
541.48 188.036 LS
556.576 207.213 L
531.971 204.858 L
541.48 188.036 LE
579.31 175.539 LS
566.538 190.899 L
552.533 171.444 L
579.31 175.539 LE
552.533 171.444 LS
566.538 190.899 L
541.48 188.036 L
552.533 171.444 LE
593.704 159.396 LS
579.31 175.539 L
566.845 158.062 L
593.704 159.396 LE
566.845 158.062 LS
579.31 175.539 L
552.533 171.444 L
566.845 158.062 LE
659.27 150.183 LS
644.55 165.631 L
631.97 145.729 L
659.27 150.183 LE
631.97 145.729 LS
644.55 165.631 L
618.867 162.349 L
631.97 145.729 L
618.867 162.349 L
608.268 142.185 L
631.97 145.729 LE
608.268 142.185 LS
618.867 162.349 L
593.704 159.396 L
608.268 142.185 L
593.704 159.396 L
583.078 141.692 L
608.268 142.185 LE
583.078 141.692 LS
593.704 159.396 L
566.845 158.062 L
583.078 141.692 LE
665.825 136.19 LS
687.701 145.465 L
659.27 150.183 L
665.825 136.19 L
659.27 150.183 L
643.172 129.216 L
665.825 136.19 LE
643.172 129.216 LS
659.27 150.183 L
631.97 145.729 L
643.172 129.216 L
631.97 145.729 L
619.824 124.275 L
643.172 129.216 LE
619.824 124.275 LS
631.97 145.729 L
608.268 142.185 L
619.824 124.275 L
608.268 142.185 L
596.678 122.255 L
619.824 124.275 LE
596.678 122.255 LS
608.268 142.185 L
583.078 141.692 L
596.678 122.255 LE
573.63 122.328 LS
596.678 122.255 L
583.078 141.692 L
573.63 122.328 L
583.078 141.692 L
556.794 139.25 L
573.63 122.328 LE
556.794 139.25 LS
583.078 141.692 L
566.845 158.062 L
556.794 139.25 L
566.845 158.062 L
539.778 151.512 L
556.794 139.25 LE
539.778 151.512 LS
566.845 158.062 L
552.533 171.444 L
539.778 151.512 LE
550.981 124.614 LS
573.63 122.328 L
556.794 139.25 L
550.981 124.614 L
556.794 139.25 L
528.99 128.986 L
550.981 124.614 LE
528.99 128.986 LS
556.794 139.25 L
539.778 151.512 L
528.99 128.986 LE
516.2 149.559 LS
528.99 128.986 L
539.778 151.512 L
516.2 149.559 L
539.778 151.512 L
527.286 169.831 L
516.2 149.559 LE
527.286 169.831 LS
539.778 151.512 L
552.533 171.444 L
527.286 169.831 L
552.533 171.444 L
541.48 188.036 L
527.286 169.831 L
541.48 188.036 L
515.331 186.571 L
527.286 169.831 LE
515.331 186.571 LS
541.48 188.036 L
531.971 204.858 L
515.331 186.571 LE
516.2 149.559 LS
527.286 169.831 L
501.734 166.055 L
516.2 149.559 LE
501.734 166.055 LS
527.286 169.831 L
515.331 186.571 L
501.734 166.055 LE
507.876 135.289 LS
528.99 128.986 L
516.2 149.559 L
507.876 135.289 L
516.2 149.559 L
487.813 143.345 L
507.876 135.289 LE
487.813 143.345 LS
516.2 149.559 L
501.734 166.055 L
487.813 143.345 LE
479.62 165.95 LS
487.813 143.345 L
501.734 166.055 L
479.62 165.95 L
501.734 166.055 L
489.505 184.883 L
479.62 165.95 LE
489.505 184.883 LS
501.734 166.055 L
515.331 186.571 L
489.505 184.883 L
515.331 186.571 L
506.574 203.614 L
489.505 184.883 LE
506.574 203.614 LS
515.331 186.571 L
531.971 204.858 L
506.574 203.614 L
531.971 204.858 L
523.221 222.026 L
506.574 203.614 L
523.221 222.026 L
500.678 222.696 L
506.574 203.614 LE
500.678 222.696 LS
523.221 222.026 L
516.229 240.631 L
500.678 222.696 LE
489.505 184.883 LS
506.574 203.614 L
482.758 202.331 L
489.505 184.883 LE
482.758 202.331 LS
506.574 203.614 L
500.678 222.696 L
482.758 202.331 LE
479.62 165.95 LS
489.505 184.883 L
462.896 181.179 L
479.62 165.95 LE
462.896 181.179 LS
489.505 184.883 L
482.758 202.331 L
462.896 181.179 LE
461.156 204.705 LS
462.896 181.179 L
482.758 202.331 L
461.156 204.705 L
482.758 202.331 L
474.958 221.772 L
461.156 204.705 LE
474.958 221.772 LS
482.758 202.331 L
500.678 222.696 L
474.958 221.772 L
500.678 222.696 L
490.834 237.885 L
474.958 221.772 LE
490.834 237.885 LS
500.678 222.696 L
516.229 240.631 L
490.834 237.885 L
516.229 240.631 L
505.812 256.105 L
490.834 237.885 L
505.812 256.105 L
480.682 253.085 L
490.834 237.885 LE
480.682 253.085 LS
505.812 256.105 L
496.943 272.197 L
480.682 253.085 LE
485.795 283.152 LS
496.943 272.197 L
504.602 293.933 L
485.795 283.152 LE
480.682 253.085 LS
496.943 272.197 L
470.121 266.922 L
480.682 253.085 LE
470.121 266.922 LS
496.943 272.197 L
485.795 283.152 L
470.121 266.922 LE
463.874 282.867 LS
470.121 266.922 L
485.795 283.152 L
463.874 282.867 L
485.795 283.152 L
485.154 301.99 L
463.874 282.867 LE
485.154 301.99 LS
485.795 283.152 L
504.602 293.933 L
485.154 301.99 L
504.602 293.933 L
507.461 311.425 L
485.154 301.99 LE
507.461 311.425 LS
504.602 293.933 L
528.113 303.946 L
507.461 311.425 LE
474.958 221.772 LS
490.834 237.885 L
464.757 237.072 L
474.958 221.772 LE
464.757 237.072 LS
490.834 237.885 L
480.682 253.085 L
464.757 237.072 L
480.682 253.085 L
453.812 250.72 L
464.757 237.072 LE
453.812 250.72 LS
480.682 253.085 L
470.121 266.922 L
453.812 250.72 L
470.121 266.922 L
444.069 265.038 L
453.812 250.72 LE
444.069 265.038 LS
470.121 266.922 L
463.874 282.867 L
444.069 265.038 LE
455.653 295.795 LS
463.874 282.867 L
485.154 301.99 L
455.653 295.795 LE
444.069 265.038 LS
463.874 282.867 L
435.633 279.791 L
444.069 265.038 LE
435.633 279.791 LS
463.874 282.867 L
455.653 295.795 L
435.633 279.791 LE
428.336 294.863 LS
435.633 279.791 L
455.653 295.795 L
428.336 294.863 LE
469.101 311.543 LS
455.653 295.795 L
485.154 301.99 L
469.101 311.543 LE
428.336 294.863 LS
455.653 295.795 L
449.093 312.34 L
428.336 294.863 LE
449.093 312.34 LS
455.653 295.795 L
469.101 311.543 L
449.093 312.34 LE
469.101 311.543 LS
485.154 301.99 L
488.282 320.318 L
469.101 311.543 LE
488.282 320.318 LS
485.154 301.99 L
507.461 311.425 L
488.282 320.318 LE
449.093 312.34 LS
469.101 311.543 L
470.94 330.507 L
449.093 312.34 LE
470.94 330.507 LS
469.101 311.543 L
488.282 320.318 L
470.94 330.507 LE
442.145 326.174 LS
449.093 312.34 L
470.94 330.507 L
442.145 326.174 LE
428.336 294.863 LS
449.093 312.34 L
422.053 309.64 L
428.336 294.863 LE
422.053 309.64 LS
449.093 312.34 L
442.145 326.174 L
422.053 309.64 LE
461.156 204.705 LS
474.958 221.772 L
448.963 222.167 L
461.156 204.705 LE
448.963 222.167 LS
474.958 221.772 L
464.757 237.072 L
448.963 222.167 LE
417.159 323.98 LS
422.053 309.64 L
442.145 326.174 L
417.159 323.98 LE
455.783 341.874 LS
442.145 326.174 L
470.94 330.507 L
455.783 341.874 LE
417.159 323.98 LS
442.145 326.174 L
426.305 338.517 L
417.159 323.98 LE
426.305 338.517 LS
442.145 326.174 L
455.783 341.874 L
426.305 338.517 LE
448.963 222.167 LS
464.757 237.072 L
437.309 236.011 L
448.963 222.167 LE
437.309 236.011 LS
464.757 237.072 L
453.812 250.72 L
437.309 236.011 L
453.812 250.72 L
426.936 250.621 L
437.309 236.011 LE
426.936 250.621 LS
453.812 250.72 L
444.069 265.038 L
426.936 250.621 L
444.069 265.038 L
417.852 265.894 L
426.936 250.621 LE
417.852 265.894 LS
444.069 265.038 L
435.633 279.791 L
417.852 265.894 L
435.633 279.791 L
410.09 281.755 L
417.852 265.894 LE
410.09 281.755 LS
435.633 279.791 L
428.336 294.863 L
410.09 281.755 L
428.336 294.863 L
403.38 298.024 L
410.09 281.755 LE
403.38 298.024 LS
428.336 294.863 L
422.053 309.64 L
403.38 298.024 L
422.053 309.64 L
398.018 314.793 L
403.38 298.024 LE
398.018 314.793 LS
422.053 309.64 L
417.159 323.98 L
398.018 314.793 L
417.159 323.98 L
396.707 332.86 L
398.018 314.793 LE
396.707 332.86 LS
417.159 323.98 L
426.305 338.517 L
396.707 332.86 LE
417.108 352.496 LS
396.707 332.86 L
426.305 338.517 L
417.108 352.496 L
426.305 338.517 L
442.771 353.994 L
417.108 352.496 LE
442.771 353.994 LS
426.305 338.517 L
455.783 341.874 L
442.771 353.994 LE
447.807 193.151 LS
462.896 181.179 L
461.156 204.705 L
447.807 193.151 L
461.156 204.705 L
434.008 206.16 L
447.807 193.151 LE
434.008 206.16 LS
461.156 204.705 L
448.963 222.167 L
434.008 206.16 L
448.963 222.167 L
421.535 220.036 L
434.008 206.16 LE
421.535 220.036 LS
448.963 222.167 L
437.309 236.011 L
421.535 220.036 L
437.309 236.011 L
410.396 234.641 L
421.535 220.036 LE
410.396 234.641 LS
437.309 236.011 L
426.936 250.621 L
410.396 234.641 L
426.936 250.621 L
400.594 249.849 L
410.396 234.641 LE
400.594 249.849 LS
426.936 250.621 L
417.852 265.894 L
400.594 249.849 L
417.852 265.894 L
392.125 265.544 L
400.594 249.849 LE
392.125 265.544 LS
417.852 265.894 L
410.09 281.755 L
392.125 265.544 L
410.09 281.755 L
385.025 281.632 L
392.125 265.544 LE
385.025 281.632 LS
410.09 281.755 L
403.38 298.024 L
385.025 281.632 L
403.38 298.024 L
379.105 298.072 L
385.025 281.632 LE
379.105 298.072 LS
403.38 298.024 L
398.018 314.793 L
379.105 298.072 L
398.018 314.793 L
374.436 314.717 L
379.105 298.072 LE
374.436 314.717 LS
398.018 314.793 L
396.707 332.86 L
374.436 314.717 LE
393.152 347.694 LS
396.707 332.86 L
417.108 352.496 L
393.152 347.694 LE
374.436 314.717 LS
396.707 332.86 L
370.976 331.486 L
374.436 314.717 LE
370.976 331.486 LS
396.707 332.86 L
393.152 347.694 L
370.976 331.486 LE
431.521 366.603 LS
417.108 352.496 L
442.771 353.994 L
431.521 366.603 LE
393.152 347.694 LS
417.108 352.496 L
408.518 367.327 L
393.152 347.694 LE
408.518 367.327 LS
417.108 352.496 L
431.521 366.603 L
408.518 367.327 LE
389.681 361.567 LS
393.152 347.694 L
408.518 367.327 L
389.681 361.567 LE
370.976 331.486 LS
393.152 347.694 L
368.657 348.301 L
370.976 331.486 LE
368.657 348.301 LS
393.152 347.694 L
389.681 361.567 L
368.657 348.301 LE
468.934 152.968 LS
487.813 143.345 L
479.62 165.95 L
468.934 152.968 L
479.62 165.95 L
451.341 163.973 L
468.934 152.968 LE
451.341 163.973 LS
479.62 165.95 L
462.896 181.179 L
451.341 163.973 L
462.896 181.179 L
435.139 176.203 L
451.341 163.973 LE
435.139 176.203 LS
462.896 181.179 L
447.807 193.151 L
435.139 176.203 L
447.807 193.151 L
420.2 189.539 L
435.139 176.203 LE
420.2 189.539 LS
447.807 193.151 L
434.008 206.16 L
420.2 189.539 L
434.008 206.16 L
406.665 203.775 L
420.2 189.539 LE
406.665 203.775 LS
434.008 206.16 L
421.535 220.036 L
406.665 203.775 L
421.535 220.036 L
394.539 218.765 L
406.665 203.775 LE
394.539 218.765 LS
421.535 220.036 L
410.396 234.641 L
394.539 218.765 L
410.396 234.641 L
383.814 234.377 L
394.539 218.765 LE
383.814 234.377 LS
410.396 234.641 L
400.594 249.849 L
383.814 234.377 L
400.594 249.849 L
374.475 250.489 L
383.814 234.377 LE
374.475 250.489 LS
400.594 249.849 L
392.125 265.544 L
374.475 250.489 L
392.125 265.544 L
366.499 266.986 L
374.475 250.489 LE
366.499 266.986 LS
392.125 265.544 L
385.025 281.632 L
366.499 266.986 L
385.025 281.632 L
359.858 283.768 L
366.499 266.986 LE
359.858 283.768 LS
385.025 281.632 L
379.105 298.072 L
359.858 283.768 L
379.105 298.072 L
354.52 300.737 L
359.858 283.768 LE
354.52 300.737 LS
379.105 298.072 L
374.436 314.717 L
354.52 300.737 L
374.436 314.717 L
350.449 317.806 L
354.52 300.737 LE
350.449 317.806 LS
374.436 314.717 L
370.976 331.486 L
350.449 317.806 L
370.976 331.486 L
347.607 334.888 L
350.449 317.806 LE
347.607 334.888 LS
370.976 331.486 L
368.657 348.301 L
347.607 334.888 LE
421.922 379.557 LS
408.518 367.327 L
431.521 366.603 L
421.922 379.557 LE
389.681 361.567 LS
408.518 367.327 L
392.487 378.227 L
389.681 361.567 LE
392.487 378.227 LS
408.518 367.327 L
421.922 379.557 L
392.487 378.227 LE
368.657 348.301 LS
389.681 361.567 L
367.077 365.21 L
368.657 348.301 LE
367.077 365.21 LS
389.681 361.567 L
392.487 378.227 L
367.077 365.21 LE
347.607 334.888 LS
368.657 348.301 L
345.952 351.904 L
347.607 334.888 LE
345.952 351.904 LS
368.657 348.301 L
367.077 365.21 L
345.952 351.904 LE
413.876 392.723 LS
392.487 378.227 L
421.922 379.557 L
413.876 392.723 LE
387.675 392.042 LS
392.487 378.227 L
413.876 392.723 L
387.675 392.042 LE
367.077 365.21 LS
392.487 378.227 L
366.24 381.892 L
367.077 365.21 LE
366.24 381.892 LS
392.487 378.227 L
387.675 392.042 L
366.24 381.892 LE
345.952 351.904 LS
367.077 365.21 L
345.434 368.774 L
345.952 351.904 LE
345.434 368.774 LS
367.077 365.21 L
366.24 381.892 L
345.434 368.774 LE
484.855 603.069 LS
485.882 595.51 L
509.83 605.529 L
484.855 603.069 LE
466.46 585.146 LS
485.882 595.51 L
462.656 592.749 L
466.46 585.146 LE
462.656 592.749 LS
485.882 595.51 L
484.855 603.069 L
462.656 592.749 LE
450.895 573.5 LS
466.46 585.146 L
443.324 581.538 L
450.895 573.5 LE
443.324 581.538 LS
466.46 585.146 L
462.656 592.749 L
443.324 581.538 LE
436.668 561.888 LS
462.565 567.073 L
450.895 573.5 L
436.668 561.888 L
450.895 573.5 L
426.39 569.744 L
436.668 561.888 LE
426.39 569.744 LS
450.895 573.5 L
443.324 581.538 L
426.39 569.744 LE
345.994 385.418 LS
345.434 368.774 L
366.24 381.892 L
345.994 385.418 L
366.24 381.892 L
365.313 398.757 L
345.994 385.418 LE
365.313 398.757 LS
366.24 381.892 L
387.675 392.042 L
365.313 398.757 LE
383.814 404.667 LS
365.313 398.757 L
387.675 392.042 L
383.814 404.667 L
387.675 392.042 L
407.717 406.223 L
383.814 404.667 LE
407.717 406.223 LS
387.675 392.042 L
413.876 392.723 L
407.717 406.223 LE
347.552 401.754 LS
345.994 385.418 L
365.313 398.757 L
347.552 401.754 L
365.313 398.757 L
374.761 416.547 L
347.552 401.754 LE
374.761 416.547 LS
365.313 398.757 L
383.814 404.667 L
374.761 416.547 L
383.814 404.667 L
402.459 419.45 L
374.761 416.547 LE
402.459 419.45 LS
383.814 404.667 L
407.717 406.223 L
402.459 419.45 LE
509.299 611.66 LS
484.855 603.069 L
509.83 605.529 L
509.299 611.66 L
509.83 605.529 L
533.647 617.61 L
509.299 611.66 LE
533.647 617.61 LS
509.83 605.529 L
534.247 609.631 L
533.647 617.61 L
534.247 609.631 L
556.401 620.979 L
533.647 617.61 LE
556.401 620.979 LS
534.247 609.631 L
554.717 611.542 L
556.401 620.979 L
554.717 611.542 L
577.499 622.286 L
556.401 620.979 LE
577.499 622.286 LS
554.717 611.542 L
574.214 611.709 L
577.499 622.286 L
574.214 611.709 L
597.276 621.948 L
577.499 622.286 LE
597.276 621.948 LS
574.214 611.709 L
592.713 610.392 L
597.276 621.948 L
592.713 610.392 L
616.029 620.228 L
597.276 621.948 LE
616.029 620.228 LS
592.713 610.392 L
610.306 607.761 L
616.029 620.228 L
610.306 607.761 L
633.963 617.281 L
616.029 620.228 LE
633.963 617.281 LS
610.306 607.761 L
627.279 604.069 L
633.963 617.281 L
627.279 604.069 L
651.206 613.205 L
633.963 617.281 LE
651.206 613.205 LS
627.279 604.069 L
643.621 599.34 L
651.206 613.205 L
643.621 599.34 L
667.833 608.066 L
651.206 613.205 LE
667.833 608.066 LS
643.621 599.34 L
659.368 593.627 L
667.833 608.066 L
659.368 593.627 L
683.884 601.904 L
667.833 608.066 LE
683.884 601.904 LS
659.368 593.627 L
674.477 586.931 L
683.884 601.904 L
674.477 586.931 L
699.373 594.753 L
683.884 601.904 LE
699.373 594.753 LS
674.477 586.931 L
689.159 579.394 L
699.373 594.753 L
689.159 579.394 L
714.297 586.634 L
699.373 594.753 LE
714.297 586.634 LS
689.159 579.394 L
703.286 570.971 L
714.297 586.634 LE
411.354 557.444 LS
436.668 561.888 L
426.39 569.744 L
411.354 557.444 LE
423.173 549.451 LS
436.668 561.888 L
411.354 557.444 L
423.173 549.451 LE
462.565 567.073 LS
436.668 561.888 L
448.329 555.065 L
462.565 567.073 LE
448.329 555.065 LS
436.668 561.888 L
423.173 549.451 L
448.329 555.065 LE
349.993 417.562 LS
347.552 401.754 L
374.761 416.547 L
349.993 417.562 LE
374.439 430.977 LS
349.993 417.562 L
374.761 416.547 L
374.439 430.977 L
374.761 416.547 L
398.264 432.739 L
374.439 430.977 LE
398.264 432.739 LS
374.761 416.547 L
402.459 419.45 L
398.264 432.739 LE
714.297 586.634 LS
703.286 570.971 L
728.64 577.567 L
714.297 586.634 LE
728.64 577.567 LS
703.286 570.971 L
716.837 561.682 L
728.64 577.567 L
716.837 561.682 L
742.376 567.57 L
728.64 577.567 LE
742.376 567.57 LS
716.837 561.682 L
729.784 551.543 L
742.376 567.57 LE
353.078 432.678 LS
349.993 417.562 L
374.439 430.977 L
353.078 432.678 LE
374.869 445.529 LS
353.078 432.678 L
374.439 430.977 L
374.869 445.529 L
374.439 430.977 L
395.458 446.002 L
374.869 445.529 LE
395.458 446.002 LS
374.439 430.977 L
398.264 432.739 L
395.458 446.002 LE
742.376 567.57 LS
729.784 551.543 L
755.47 556.657 L
742.376 567.57 LE
755.47 556.657 LS
729.784 551.543 L
742.092 540.566 L
755.47 556.657 L
742.092 540.566 L
767.88 544.845 L
755.47 556.657 LE
767.88 544.845 LS
742.092 540.566 L
753.721 528.768 L
767.88 544.845 L
753.721 528.768 L
779.561 532.149 L
767.88 544.845 LE
779.561 532.149 LS
753.721 528.768 L
764.627 516.163 L
779.561 532.149 L
764.627 516.163 L
790.459 518.589 L
779.561 532.149 LE
790.459 518.589 LS
764.627 516.163 L
774.769 502.769 L
790.459 518.589 L
774.769 502.769 L
800.517 504.184 L
790.459 518.589 LE
800.517 504.184 LS
774.769 502.769 L
784.125 488.614 L
800.517 504.184 L
784.125 488.614 L
809.673 488.959 L
800.517 504.184 LE
809.673 488.959 LS
784.125 488.614 L
792.491 473.774 L
809.673 488.959 L
792.491 473.774 L
817.86 472.94 L
809.673 488.959 LE
817.86 472.94 LS
792.491 473.774 L
799.901 458.239 L
817.86 472.94 L
799.901 458.239 L
825.007 456.159 L
817.86 472.94 LE
825.007 456.159 LS
799.901 458.239 L
806.289 442.042 L
825.007 456.159 L
806.289 442.042 L
831.037 438.653 L
825.007 456.159 LE
831.037 438.653 LS
806.289 442.042 L
811.587 425.222 L
831.037 438.653 L
811.587 425.222 L
835.87 420.466 L
831.037 438.653 LE
835.87 420.466 LS
811.587 425.222 L
815.719 407.823 L
835.87 420.466 L
815.719 407.823 L
839.421 401.651 L
835.87 420.466 LE
839.421 401.651 LS
815.719 407.823 L
818.609 389.893 L
839.421 401.651 L
818.609 389.893 L
841.601 382.266 L
839.421 401.651 LE
841.601 382.266 LS
818.609 389.893 L
820.178 371.49 L
841.601 382.266 L
820.178 371.49 L
842.318 362.386 L
841.601 382.266 LE
842.318 362.386 LS
820.178 371.49 L
820.371 352.678 L
842.318 362.386 L
820.371 352.678 L
841.475 342.094 L
842.318 362.386 LE
841.475 342.094 LS
820.371 352.678 L
819.067 333.679 L
841.475 342.094 L
819.067 333.679 L
838.976 321.491 L
841.475 342.094 LE
838.976 321.491 LS
819.067 333.679 L
816.205 314.487 L
838.976 321.491 L
816.205 314.487 L
834.725 300.696 L
838.976 321.491 LE
834.725 300.696 LS
816.205 314.487 L
811.7 295.213 L
834.725 300.696 L
811.7 295.213 L
828.629 279.845 L
834.725 300.696 LE
828.629 279.845 LS
811.7 295.213 L
805.467 275.983 L
828.629 279.845 L
805.467 275.983 L
820.601 259.101 L
828.629 279.845 LE
820.601 259.101 LS
805.467 275.983 L
797.421 256.94 L
820.601 259.101 L
797.421 256.94 L
810.568 238.651 L
820.601 259.101 LE
810.568 238.651 LS
797.421 256.94 L
787.48 238.246 L
810.568 238.651 L
787.48 238.246 L
798.479 218.709 L
810.568 238.651 LE
798.479 218.709 LS
787.48 238.246 L
775.566 220.084 L
798.479 218.709 L
775.566 220.084 L
784.308 199.515 L
798.479 218.709 LE
784.308 199.515 LS
775.566 220.084 L
761.619 202.64 L
784.308 199.515 L
761.619 202.64 L
768.07 181.334 L
784.308 199.515 LE
768.07 181.334 LS
761.619 202.64 L
745.847 185.691 L
768.07 181.334 L
745.847 185.691 L
748.644 163.458 L
768.07 181.334 LE
748.644 163.458 LS
745.847 185.691 L
727.972 170.412 L
748.644 163.458 L
727.972 170.412 L
727.22 147.461 L
748.644 163.458 LE
727.22 147.461 LS
727.972 170.412 L
708.507 156.929 L
727.22 147.461 L
708.507 156.929 L
704.144 133.691 L
727.22 147.461 LE
704.144 133.691 LS
708.507 156.929 L
687.701 145.465 L
704.144 133.691 L
687.701 145.465 L
679.805 122.399 L
704.144 133.691 LE
679.805 122.399 LS
687.701 145.465 L
665.825 136.19 L
679.805 122.399 L
665.825 136.19 L
654.609 113.733 L
679.805 122.399 LE
654.609 113.733 LS
665.825 136.19 L
643.172 129.216 L
654.609 113.733 L
643.172 129.216 L
628.943 107.75 L
654.609 113.733 LE
628.943 107.75 LS
643.172 129.216 L
619.824 124.275 L
628.943 107.75 L
619.824 124.275 L
602.223 104.358 L
628.943 107.75 LE
602.223 104.358 LS
619.824 124.275 L
596.678 122.255 L
602.223 104.358 L
596.678 122.255 L
576.849 103.714 L
602.223 104.358 LE
576.849 103.714 LS
596.678 122.255 L
573.63 122.328 L
576.849 103.714 L
573.63 122.328 L
551.922 105.507 L
576.849 103.714 LE
551.922 105.507 LS
573.63 122.328 L
550.981 124.614 L
551.922 105.507 L
550.981 124.614 L
527.733 109.592 L
551.922 105.507 LE
527.733 109.592 LS
550.981 124.614 L
528.99 128.986 L
527.733 109.592 L
528.99 128.986 L
504.521 115.791 L
527.733 109.592 LE
504.521 115.791 LS
528.99 128.986 L
507.876 135.289 L
504.521 115.791 L
507.876 135.289 L
482.473 123.904 L
504.521 115.791 LE
482.473 123.904 LS
507.876 135.289 L
487.813 143.345 L
482.473 123.904 L
487.813 143.345 L
461.728 133.725 L
482.473 123.904 LE
461.728 133.725 LS
487.813 143.345 L
468.934 152.968 L
461.728 133.725 L
468.934 152.968 L
442.386 145.049 L
461.728 133.725 LE
442.386 145.049 LS
468.934 152.968 L
451.341 163.973 L
442.386 145.049 L
451.341 163.973 L
424.509 157.679 L
442.386 145.049 LE
424.509 157.679 LS
451.341 163.973 L
435.139 176.203 L
424.509 157.679 L
435.139 176.203 L
408.134 171.431 L
424.509 157.679 LE
408.134 171.431 LS
435.139 176.203 L
420.2 189.539 L
408.134 171.431 L
420.2 189.539 L
393.274 186.134 L
408.134 171.431 LE
393.274 186.134 LS
420.2 189.539 L
406.665 203.775 L
393.274 186.134 L
406.665 203.775 L
379.93 201.629 L
393.274 186.134 LE
379.93 201.629 LS
406.665 203.775 L
394.539 218.765 L
379.93 201.629 L
394.539 218.765 L
368.085 217.776 L
379.93 201.629 LE
368.085 217.776 LS
394.539 218.765 L
383.814 234.377 L
368.085 217.776 L
383.814 234.377 L
357.717 234.443 L
368.085 217.776 LE
357.717 234.443 LS
383.814 234.377 L
374.475 250.489 L
357.717 234.443 L
374.475 250.489 L
348.798 251.515 L
357.717 234.443 LE
348.798 251.515 LS
374.475 250.489 L
366.499 266.986 L
348.798 251.515 L
366.499 266.986 L
341.293 268.886 L
348.798 251.515 LE
341.293 268.886 LS
366.499 266.986 L
359.858 283.768 L
341.293 268.886 L
359.858 283.768 L
335.167 286.46 L
341.293 268.886 LE
335.167 286.46 LS
359.858 283.768 L
354.52 300.737 L
335.167 286.46 L
354.52 300.737 L
330.381 304.151 L
335.167 286.46 LE
330.381 304.151 LS
354.52 300.737 L
350.449 317.806 L
330.381 304.151 L
350.449 317.806 L
326.897 321.88 L
330.381 304.151 LE
326.897 321.88 LS
350.449 317.806 L
347.607 334.888 L
326.897 321.88 L
347.607 334.888 L
324.676 339.578 L
326.897 321.88 LE
324.676 339.578 LS
347.607 334.888 L
345.952 351.904 L
324.676 339.578 L
345.952 351.904 L
323.682 357.181 L
324.676 339.578 LE
323.682 357.181 LS
345.952 351.904 L
345.434 368.774 L
323.682 357.181 L
345.434 368.774 L
323.878 374.63 L
323.682 357.181 LE
323.878 374.63 LS
345.434 368.774 L
345.994 385.418 L
323.878 374.63 L
345.994 385.418 L
325.23 391.873 L
323.878 374.63 LE
325.23 391.873 LS
345.994 385.418 L
347.552 401.754 L
325.23 391.873 LE
397.868 544.654 LS
423.173 549.451 L
411.354 557.444 L
397.868 544.654 LE
412.045 536.762 LS
423.173 549.451 L
397.868 544.654 L
412.045 536.762 LE
448.329 555.065 LS
423.173 549.451 L
438.071 543.281 L
448.329 555.065 LE
438.071 543.281 LS
423.173 549.451 L
412.045 536.762 L
438.071 543.281 LE
385.711 531.375 LS
412.045 536.762 L
397.868 544.654 L
385.711 531.375 LE
402.646 523.514 LS
412.045 536.762 L
385.711 531.375 L
402.646 523.514 LE
438.071 543.281 LS
412.045 536.762 L
430.344 531.586 L
438.071 543.281 LE
430.344 531.586 LS
412.045 536.762 L
402.646 523.514 L
430.344 531.586 LE
325.23 391.873 LS
347.552 401.754 L
327.706 408.863 L
325.23 391.873 LE
327.706 408.863 LS
347.552 401.754 L
349.993 417.562 L
327.706 408.863 LE
355.528 446.713 LS
353.078 432.678 L
374.869 445.529 L
355.528 446.713 LE
393.951 459.164 LS
374.869 445.529 L
395.458 446.002 L
393.951 459.164 LE
355.528 446.713 LS
374.869 445.529 L
369.173 458.257 L
355.528 446.713 LE
369.173 458.257 LS
374.869 445.529 L
393.951 459.164 L
369.173 458.257 LE
327.706 408.863 LS
349.993 417.562 L
331.276 425.556 L
327.706 408.863 LE
331.276 425.556 LS
349.993 417.562 L
353.078 432.678 L
331.276 425.556 L
353.078 432.678 L
335.917 441.914 L
331.276 425.556 LE
335.917 441.914 LS
353.078 432.678 L
355.528 446.713 L
335.917 441.914 L
355.528 446.713 L
341.607 457.902 L
335.917 441.914 LE
341.607 457.902 LS
355.528 446.713 L
369.173 458.257 L
341.607 457.902 LE
369.395 469.767 LS
341.607 457.902 L
369.173 458.257 L
369.395 469.767 L
369.173 458.257 L
393.724 472.188 L
369.395 469.767 LE
393.724 472.188 LS
369.173 458.257 L
393.951 459.164 L
393.724 472.188 LE
348.334 473.49 LS
341.607 457.902 L
369.395 469.767 L
348.334 473.49 LE
371.377 481.242 LS
348.334 473.49 L
369.395 469.767 L
371.377 481.242 L
369.395 469.767 L
394.793 485.051 L
371.377 481.242 LE
394.793 485.051 LS
369.395 469.767 L
393.724 472.188 L
394.793 485.051 LE
380.703 495.291 LS
371.377 481.242 L
394.793 485.051 L
380.703 495.291 LE
348.334 473.49 LS
371.377 481.242 L
356.092 488.651 L
348.334 473.49 LE
356.092 488.651 LS
371.377 481.242 L
380.703 495.291 L
356.092 488.651 LE
364.888 503.363 LS
356.092 488.651 L
380.703 495.291 L
364.888 503.363 LE
387.13 508.86 LS
364.888 503.363 L
380.703 495.291 L
387.13 508.86 LE
397.205 497.743 LS
380.703 495.291 L
394.793 485.051 L
397.205 497.743 LE
387.13 508.86 LS
380.703 495.291 L
401.049 510.271 L
387.13 508.86 LE
401.049 510.271 LS
380.703 495.291 L
397.205 497.743 L
401.049 510.271 LE
374.745 517.609 LS
364.888 503.363 L
387.13 508.86 L
374.745 517.609 L
387.13 508.86 L
402.646 523.514 L
374.745 517.609 LE
402.646 523.514 LS
387.13 508.86 L
401.049 510.271 L
402.646 523.514 LE
374.745 517.609 LS
402.646 523.514 L
385.711 531.375 L
374.745 517.609 LE
430.344 531.586 LS
402.646 523.514 L
424.519 519.836 L
430.344 531.586 LE
424.519 519.836 LS
402.646 523.514 L
401.049 510.271 L
424.519 519.836 L
401.049 510.271 L
420.248 507.975 L
424.519 519.836 LE
420.248 507.975 LS
401.049 510.271 L
397.205 497.743 L
420.248 507.975 L
397.205 497.743 L
417.339 495.973 L
420.248 507.975 LE
417.339 495.973 LS
397.205 497.743 L
394.793 485.051 L
417.339 495.973 L
394.793 485.051 L
415.682 483.815 L
417.339 495.973 LE
415.682 483.815 LS
394.793 485.051 L
393.724 472.188 L
415.682 483.815 L
393.724 472.188 L
415.223 471.502 L
415.682 483.815 LE
415.223 471.502 LS
393.724 472.188 L
393.951 459.164 L
415.223 471.502 L
393.951 459.164 L
415.939 459.04 L
415.223 471.502 LE
415.939 459.04 LS
393.951 459.164 L
395.458 446.002 L
415.939 459.04 L
395.458 446.002 L
417.836 446.45 L
415.939 459.04 LE
417.836 446.45 LS
395.458 446.002 L
398.264 432.739 L
417.836 446.45 L
398.264 432.739 L
420.939 433.758 L
417.836 446.45 LE
420.939 433.758 LS
398.264 432.739 L
402.459 419.45 L
420.939 433.758 L
402.459 419.45 L
425.73 421.076 L
420.939 433.758 LE
425.73 421.076 LS
402.459 419.45 L
407.717 406.223 L
425.73 421.076 L
407.717 406.223 L
430.726 408.158 L
425.73 421.076 LE
430.726 408.158 LS
407.717 406.223 L
413.876 392.723 L
430.726 408.158 L
413.876 392.723 L
437.336 395.7 L
430.726 408.158 LE
437.336 395.7 LS
413.876 392.723 L
421.922 379.557 L
437.336 395.7 L
421.922 379.557 L
445.343 383.415 L
437.336 395.7 LE
445.343 383.415 LS
421.922 379.557 L
431.521 366.603 L
445.343 383.415 L
431.521 366.603 L
454.731 371.438 L
445.343 383.415 LE
454.731 371.438 LS
431.521 366.603 L
442.771 353.994 L
454.731 371.438 L
442.771 353.994 L
465.567 359.872 L
454.731 371.438 LE
465.567 359.872 LS
442.771 353.994 L
455.783 341.874 L
465.567 359.872 L
455.783 341.874 L
478.163 348.838 L
465.567 359.872 LE
478.163 348.838 LS
455.783 341.874 L
470.94 330.507 L
478.163 348.838 L
470.94 330.507 L
492.726 338.687 L
478.163 348.838 LE
492.726 338.687 LS
470.94 330.507 L
488.282 320.318 L
492.726 338.687 L
488.282 320.318 L
509.619 329.509 L
492.726 338.687 LE
509.619 329.509 LS
488.282 320.318 L
507.461 311.425 L
509.619 329.509 L
507.461 311.425 L
528.923 321.449 L
509.619 329.509 LE
528.923 321.449 LS
507.461 311.425 L
528.113 303.946 L
528.923 321.449 L
528.113 303.946 L
551.209 315.556 L
528.923 321.449 L
551.209 315.556 L
554.267 330.994 L
528.923 321.449 LE
554.267 330.994 LS
551.209 315.556 L
576.218 327.14 L
554.267 330.994 LE
509.619 329.509 LS
528.923 321.449 L
534.761 337.517 L
509.619 329.509 LE
534.761 337.517 LS
528.923 321.449 L
554.267 330.994 L
534.761 337.517 LE
488.275 574.018 LS
462.565 567.073 L
473.348 563.023 L
488.275 574.018 LE
473.348 563.023 LS
462.565 567.073 L
448.329 555.065 L
473.348 563.023 L
448.329 555.065 L
462.485 551.897 L
473.348 563.023 LE
462.485 551.897 LS
448.329 555.065 L
438.071 543.281 L
462.485 551.897 L
438.071 543.281 L
454.287 540.729 L
462.485 551.897 LE
454.287 540.729 LS
438.071 543.281 L
430.344 531.586 L
454.287 540.729 L
430.344 531.586 L
448.032 529.487 L
454.287 540.729 LE
448.032 529.487 LS
430.344 531.586 L
424.519 519.836 L
448.032 529.487 L
424.519 519.836 L
443.332 518.139 L
448.032 529.487 LE
443.332 518.139 LS
424.519 519.836 L
420.248 507.975 L
443.332 518.139 L
420.248 507.975 L
439.97 506.664 L
443.332 518.139 LE
439.97 506.664 LS
420.248 507.975 L
417.339 495.973 L
439.97 506.664 L
417.339 495.973 L
437.816 495.052 L
439.97 506.664 LE
437.816 495.052 LS
417.339 495.973 L
415.682 483.815 L
437.816 495.052 L
415.682 483.815 L
436.799 483.305 L
437.816 495.052 LE
436.799 483.305 LS
415.682 483.815 L
415.223 471.502 L
436.799 483.305 L
415.223 471.502 L
436.883 471.43 L
436.799 483.305 LE
436.883 471.43 LS
415.223 471.502 L
415.939 459.04 L
436.883 471.43 L
415.939 459.04 L
438.057 459.444 L
436.883 471.43 LE
438.057 459.444 LS
415.939 459.04 L
417.836 446.45 L
438.057 459.444 L
417.836 446.45 L
440.33 447.37 L
438.057 459.444 LE
440.33 447.37 LS
417.836 446.45 L
420.939 433.758 L
440.33 447.37 L
420.939 433.758 L
443.729 435.239 L
440.33 447.37 LE
443.729 435.239 LS
420.939 433.758 L
425.73 421.076 L
443.729 435.239 L
425.73 421.076 L
448.609 422.357 L
443.729 435.239 LE
448.609 422.357 LS
425.73 421.076 L
430.726 408.158 L
448.609 422.357 LE
492.726 338.687 LS
509.619 329.509 L
517.594 345.877 L
492.726 338.687 LE
517.594 345.877 LS
509.619 329.509 L
534.761 337.517 L
517.594 345.877 LE
448.609 422.357 LS
430.726 408.158 L
454.45 410.291 L
448.609 422.357 LE
454.45 410.291 LS
430.726 408.158 L
437.336 395.7 L
454.45 410.291 L
437.336 395.7 L
461.496 398.458 L
454.45 410.291 LE
461.496 398.458 LS
437.336 395.7 L
445.343 383.415 L
461.496 398.458 L
445.343 383.415 L
469.771 386.961 L
461.496 398.458 LE
469.771 386.961 LS
445.343 383.415 L
454.731 371.438 L
469.771 386.961 L
454.731 371.438 L
479.316 375.902 L
469.771 386.961 LE
479.316 375.902 LS
454.731 371.438 L
465.567 359.872 L
479.316 375.902 L
465.567 359.872 L
490.2 365.384 L
479.316 375.902 LE
490.2 365.384 LS
465.567 359.872 L
478.163 348.838 L
490.2 365.384 L
478.163 348.838 L
502.543 355.526 L
490.2 365.384 LE
502.543 355.526 LS
478.163 348.838 L
492.726 338.687 L
502.543 355.526 L
492.726 338.687 L
517.594 345.877 L
502.543 355.526 LE
grestore
showpage
cleartomark
%%PageTrailer
%%Trailer
end
%%EOF
