%!PS-Adobe-3.0 EPSF-3.0
%%Title:                     maniFEM
%%BoundingBox:  0 0  520   450
%%EndComments
%%BeginSetup
<< /PageSize [520 450] >> setpagedevice
%%EndSetup

gsave
260 225 translate
250 dup scale

gsave 0.006 setlinewidth

1 0.95 0.8 setrgbcolor
0.5 0.86 moveto 1 0 lineto 0.5 -0.86 lineto -0.5 -0.86 lineto -1 0 lineto -0.5 0.86 lineto
closepath fill

1 setgray
0 0.602 moveto 0.5 0.86 0.56 210 272 arc
1 0 0.56 150 212 arc
0.5 -0.86 0.56 90 152 arc
-0.5 -0.86 0.56 30 92 arc
-1 0 0.56 -30 32 arc
-0.5 0.86 0.56 -90 -28 arc closepath fill

0 setgray
0.495665 0.297677 moveto
0.525 0.301 lineto stroke
0.457209 0.299291 moveto
0.495665 0.297677 lineto stroke
0.413171 0.304404 moveto
0.457209 0.299291 lineto stroke
0.354687 0.31676 moveto
0.413171 0.304404 lineto stroke
0.287772 0.339246 moveto
0.354687 0.31676 lineto stroke
0.215705 0.374817 moveto
0.287772 0.339246 lineto stroke
0.156551 0.414726 moveto
0.215705 0.374817 lineto stroke
0.109628 0.455234 moveto
0.156551 0.414726 lineto stroke
0.0734813 0.49352 moveto
0.109628 0.455234 lineto stroke
0.0463988 0.527627 moveto
0.0734813 0.49352 lineto stroke
0.0265739 0.55653 moveto
0.0463988 0.527627 lineto stroke
0.0120555 0.580472 moveto
0.0265739 0.55653 lineto stroke
0 0.602 moveto
0.0120555 0.580472 lineto stroke
-0.0146749 0.575948 moveto
0 0.602 lineto stroke
-0.0354413 0.543123 moveto
-0.0146749 0.575948 lineto stroke
-0.0620426 0.507269 moveto
-0.0354413 0.543123 lineto stroke
-0.102179 0.462553 moveto
-0.0620426 0.507269 lineto stroke
-0.155379 0.415633 moveto
-0.102179 0.462553 lineto stroke
-0.222128 0.37111 moveto
-0.155379 0.415633 lineto stroke
-0.286018 0.339964 moveto
-0.222128 0.37111 lineto stroke
-0.34431 0.319642 moveto
-0.286018 0.339964 lineto stroke
-0.395309 0.307491 moveto
-0.34431 0.319642 lineto stroke
-0.438189 0.301068 moveto
-0.395309 0.307491 lineto stroke
-0.472979 0.29831 moveto
-0.438189 0.301068 lineto stroke
-0.500549 0.297661 moveto
-0.472979 0.29831 lineto stroke
-0.525 0.301 moveto
-0.500549 0.297661 lineto stroke
-0.510772 0.277276 moveto
-0.525 0.301 lineto stroke
-0.493378 0.244049 moveto
-0.510772 0.277276 lineto stroke
-0.476024 0.204145 moveto
-0.493378 0.244049 lineto stroke
-0.457487 0.148005 moveto
-0.476024 0.204145 lineto stroke
-0.443304 0.0794727 moveto
-0.457487 0.148005 lineto stroke
-0.43766 -0.000452407 moveto
-0.443304 0.0794727 lineto stroke
-0.442241 -0.0716282 moveto
-0.43766 -0.000452407 lineto stroke
-0.453506 -0.132552 moveto
-0.442241 -0.0716282 lineto stroke
-0.468289 -0.183056 moveto
-0.453506 -0.132552 lineto stroke
-0.48404 -0.223631 moveto
-0.468289 -0.183056 lineto stroke
-0.498963 -0.25532 moveto
-0.48404 -0.223631 lineto stroke
-0.512277 -0.279914 moveto
-0.498963 -0.25532 lineto stroke
-0.525 -0.301 moveto
-0.512277 -0.279914 lineto stroke
-0.495665 -0.297677 moveto
-0.525 -0.301 lineto stroke
-0.457209 -0.299291 moveto
-0.495665 -0.297677 lineto stroke
-0.413171 -0.304404 moveto
-0.457209 -0.299291 lineto stroke
-0.354687 -0.31676 moveto
-0.413171 -0.304404 lineto stroke
-0.287772 -0.339246 moveto
-0.354687 -0.31676 lineto stroke
-0.215705 -0.374817 moveto
-0.287772 -0.339246 lineto stroke
-0.156551 -0.414726 moveto
-0.215705 -0.374817 lineto stroke
-0.109628 -0.455234 moveto
-0.156551 -0.414726 lineto stroke
-0.0734813 -0.49352 moveto
-0.109628 -0.455234 lineto stroke
-0.0463988 -0.527627 moveto
-0.0734813 -0.49352 lineto stroke
-0.0265739 -0.55653 moveto
-0.0463988 -0.527627 lineto stroke
-0.0120555 -0.580472 moveto
-0.0265739 -0.55653 lineto stroke
0 -0.602 moveto
-0.0120555 -0.580472 lineto stroke
0.0146749 -0.575948 moveto
0 -0.602 lineto stroke
0.0354413 -0.543123 moveto
0.0146749 -0.575948 lineto stroke
0.0620426 -0.507269 moveto
0.0354413 -0.543123 lineto stroke
0.102179 -0.462553 moveto
0.0620426 -0.507269 lineto stroke
0.155379 -0.415633 moveto
0.102179 -0.462553 lineto stroke
0.222128 -0.37111 moveto
0.155379 -0.415633 lineto stroke
0.286018 -0.339964 moveto
0.222128 -0.37111 lineto stroke
0.34431 -0.319642 moveto
0.286018 -0.339964 lineto stroke
0.395309 -0.307491 moveto
0.34431 -0.319642 lineto stroke
0.438189 -0.301068 moveto
0.395309 -0.307491 lineto stroke
0.472979 -0.29831 moveto
0.438189 -0.301068 lineto stroke
0.500549 -0.297661 moveto
0.472979 -0.29831 lineto stroke
0.525 -0.301 moveto
0.500549 -0.297661 lineto stroke
0.510772 -0.277276 moveto
0.525 -0.301 lineto stroke
0.493378 -0.244049 moveto
0.510772 -0.277276 lineto stroke
0.476024 -0.204145 moveto
0.493378 -0.244049 lineto stroke
0.457487 -0.148005 moveto
0.476024 -0.204145 lineto stroke
0.443304 -0.0794727 moveto
0.457487 -0.148005 lineto stroke
0.43766 0.000452407 moveto
0.443304 -0.0794727 lineto stroke
0.442241 0.0716282 moveto
0.43766 0.000452407 lineto stroke
0.453506 0.132552 moveto
0.442241 0.0716282 lineto stroke
0.468289 0.183056 moveto
0.453506 0.132552 lineto stroke
0.48404 0.223631 moveto
0.468289 0.183056 lineto stroke
0.498963 0.25532 moveto
0.48404 0.223631 lineto stroke
0.512277 0.279914 moveto
0.498963 0.25532 lineto stroke
0.525 0.301 moveto
0.512277 0.279914 lineto stroke
0.942851 -0.0982959 moveto
1 0 lineto stroke
0.893351 -0.183436 moveto
0.942851 -0.0982959 lineto stroke
0.847982 -0.261471 moveto
0.893351 -0.183436 lineto stroke
0.807306 -0.331434 moveto
0.847982 -0.261471 lineto stroke
0.76884 -0.397595 moveto
0.807306 -0.331434 lineto stroke
0.73116 -0.462405 moveto
0.76884 -0.397595 lineto stroke
0.692694 -0.528566 moveto
0.73116 -0.462405 lineto stroke
0.652018 -0.598529 moveto
0.692694 -0.528566 lineto stroke
0.606649 -0.676564 moveto
0.652018 -0.598529 lineto stroke
0.557149 -0.761704 moveto
0.606649 -0.676564 lineto stroke
0.5 -0.86 moveto
0.557149 -0.761704 lineto stroke
0.384167 -0.86 moveto
0.5 -0.86 lineto stroke
0.285073 -0.86 moveto
0.384167 -0.86 lineto stroke
0.194628 -0.86 moveto
0.285073 -0.86 lineto stroke
0.113822 -0.86 moveto
0.194628 -0.86 lineto stroke
0.0374194 -0.86 moveto
0.113822 -0.86 lineto stroke
-0.0374194 -0.86 moveto
0.0374194 -0.86 lineto stroke
-0.113822 -0.86 moveto
-0.0374194 -0.86 lineto stroke
-0.194628 -0.86 moveto
-0.113822 -0.86 lineto stroke
-0.285073 -0.86 moveto
-0.194628 -0.86 lineto stroke
-0.384167 -0.86 moveto
-0.285073 -0.86 lineto stroke
-0.5 -0.86 moveto
-0.384167 -0.86 lineto stroke
-0.55709 -0.761805 moveto
-0.5 -0.86 lineto stroke
-0.606594 -0.676658 moveto
-0.55709 -0.761805 lineto stroke
-0.65197 -0.598611 moveto
-0.606594 -0.676658 lineto stroke
-0.692665 -0.528616 moveto
-0.65197 -0.598611 lineto stroke
-0.73115 -0.462422 moveto
-0.692665 -0.528616 lineto stroke
-0.76885 -0.397578 moveto
-0.73115 -0.462422 lineto stroke
-0.807335 -0.331384 moveto
-0.76885 -0.397578 lineto stroke
-0.84803 -0.261389 moveto
-0.807335 -0.331384 lineto stroke
-0.893406 -0.183342 moveto
-0.84803 -0.261389 lineto stroke
-0.94291 -0.0981951 moveto
-0.893406 -0.183342 lineto stroke
-1 0 moveto
-0.94291 -0.0981951 lineto stroke
-0.942851 0.0982959 moveto
-1 0 lineto stroke
-0.893351 0.183436 moveto
-0.942851 0.0982959 lineto stroke
-0.847982 0.261471 moveto
-0.893351 0.183436 lineto stroke
-0.807306 0.331434 moveto
-0.847982 0.261471 lineto stroke
-0.76884 0.397595 moveto
-0.807306 0.331434 lineto stroke
-0.73116 0.462405 moveto
-0.76884 0.397595 lineto stroke
-0.692694 0.528566 moveto
-0.73116 0.462405 lineto stroke
-0.652018 0.598529 moveto
-0.692694 0.528566 lineto stroke
-0.606649 0.676564 moveto
-0.652018 0.598529 lineto stroke
-0.557149 0.761704 moveto
-0.606649 0.676564 lineto stroke
-0.5 0.86 moveto
-0.557149 0.761704 lineto stroke
-0.384167 0.86 moveto
-0.5 0.86 lineto stroke
-0.285073 0.86 moveto
-0.384167 0.86 lineto stroke
-0.194628 0.86 moveto
-0.285073 0.86 lineto stroke
-0.113822 0.86 moveto
-0.194628 0.86 lineto stroke
-0.0374194 0.86 moveto
-0.113822 0.86 lineto stroke
0.0374194 0.86 moveto
-0.0374194 0.86 lineto stroke
0.113822 0.86 moveto
0.0374194 0.86 lineto stroke
0.194628 0.86 moveto
0.113822 0.86 lineto stroke
0.285073 0.86 moveto
0.194628 0.86 lineto stroke
0.384167 0.86 moveto
0.285073 0.86 lineto stroke
0.5 0.86 moveto
0.384167 0.86 lineto stroke
0.55709 0.761805 moveto
0.5 0.86 lineto stroke
0.606594 0.676658 moveto
0.55709 0.761805 lineto stroke
0.65197 0.598611 moveto
0.606594 0.676658 lineto stroke
0.692665 0.528616 moveto
0.65197 0.598611 lineto stroke
0.73115 0.462422 moveto
0.692665 0.528616 lineto stroke
0.76885 0.397578 moveto
0.73115 0.462422 lineto stroke
0.807335 0.331384 moveto
0.76885 0.397578 lineto stroke
0.84803 0.261389 moveto
0.807335 0.331384 lineto stroke
0.893406 0.183342 moveto
0.84803 0.261389 lineto stroke
0.94291 0.0981951 moveto
0.893406 0.183342 lineto stroke
1 0 moveto
0.94291 0.0981951 lineto stroke

grestore
grestore

/Helvetica findfont 0.1 scalefont setfont	
1 0 0 setrgbcolor
381 312 moveto (AA) show
250 385 moveto (BB) show
102 306 moveto (CC) show
97 142 moveto (DD) show
240 54 moveto (EE) show
376 127 moveto (FF) show
483 218 moveto (A) show
364 417 moveto (B) show
141 417 moveto (C) show
28 221 moveto (D) show
135 27 moveto (E) show
364 25 moveto (F) show

showpage
%%Trailer
%EOF
