%!PS-Adobe-3.0 EPSF-3.0
%%Title:                     fill-angle-120-b
%%BoundingBox:    18   47   135   113
%%EndComments

gsave

1 setlinecap
20 rotate

0 setlinewidth 0.9 setgray
55 85 moveto
73 88 lineto
66 60 lineto   % A
85 35 lineto   % B
120 35 lineto  % C
140 60 lineto
160 57 lineto
154 51 151 48 145 45 curveto
140 43 138 40 135 36 curveto
134 31 132 28 127 25 curveto
123 23 117 24 113 25 curveto
106 27 99 27 93 25 curveto
86 23 79 22 75 25 curveto
66 30 62 39 60 40 curveto
50 45 51 49 50 53 curveto
50 60 50 60 55 70 curveto
55 76 56 80 55 85 curveto
closepath fill

1.3 setlinewidth
1 0.5 0 setrgbcolor
55 85 moveto
73 88 lineto
66 60 lineto  % A
85 35 lineto  % point120
120 35 lineto  % B
140 60 lineto
160 57 lineto
stroke

0.8 setlinewidth

120 35 moveto 127 25 lineto stroke
66 60 moveto 60 40 lineto stroke
66 60 moveto 50 53 lineto stroke
66 60 moveto 55 70 lineto stroke
65 35 moveto 85 35 lineto stroke
85 35 moveto 77 25 lineto stroke
85 35 moveto 93 25 lineto stroke
120 35 moveto 112 25 lineto stroke
120 35 moveto 135 36 lineto stroke
140 60 moveto 145 45 lineto stroke

gsave
[3 3] 0 setdash
1 setlinewidth
0.9 0.4 0.4 setrgbcolor
66 60 moveto 105 65 lineto  % P
85 35 lineto stroke
105 65 moveto 120 35 lineto stroke
grestore

0 0 1 setrgbcolor
140 60 moveto 140 60 1.6 0 360 arc fill
73 88 moveto 73 88 1.6 0 360 arc fill

grestore

/Helvetica findfont 10 scalefont setfont	
43 85 moveto (A) show
61 68 moveto (B) show
88 73 moveto (C) show
70 100 moveto (P) show


showpage
%%Trailer
%EOF
