%!PS-Adobe-3.0 EPSF-3.0
%%Title: square-split
%%Creator: GL2PS 1.4.3, (C) 1999-2020 C. Geuzaine
%%For: Gmsh
%%CreationDate: Wed May 08 06:32:55 2024
%%LanguageLevel: 3
%%DocumentData: Clean7Bit
%%Pages: 1
%%BoundingBox: 750 350 1240 654
%%EndComments
%%BeginProlog
/gl2psdict 64 dict def gl2psdict begin
/tryPS3shading false def % set to false to force subdivision
/rThreshold 0.0666667 def % red component subdivision threshold
/gThreshold 0.05 def % green component subdivision threshold
/bThreshold 0.1 def % blue component subdivision threshold
/BD { bind def } bind def
/C  { setrgbcolor } BD
/G  { 0.082 mul exch 0.6094 mul add exch 0.3086 mul add neg 1.0 add setgray } BD
/W  { setlinewidth } BD
/LC  { setlinecap } BD
/LJ  { setlinejoin } BD
/FC { findfont exch /SH exch def SH scalefont setfont } BD
/SW { dup stringwidth pop } BD
/S  { FC moveto show } BD
/SBC{ FC moveto SW -2 div 0 rmoveto show } BD
/SBR{ FC moveto SW neg 0 rmoveto show } BD
/SCL{ FC moveto 0 SH -2 div rmoveto show } BD
/SCC{ FC moveto SW -2 div SH -2 div rmoveto show } BD
/SCR{ FC moveto SW neg SH -2 div rmoveto show } BD
/STL{ FC moveto 0 SH neg rmoveto show } BD
/STC{ FC moveto SW -2 div SH neg rmoveto show } BD
/STR{ FC moveto SW neg SH neg rmoveto show } BD
/FCT { FC translate 0 0 } BD
/SR  { gsave FCT moveto rotate show grestore } BD
/SBCR{ gsave FCT moveto rotate SW -2 div 0 rmoveto show grestore } BD
/SBRR{ gsave FCT moveto rotate SW neg 0 rmoveto show grestore } BD
/SCLR{ gsave FCT moveto rotate 0 SH -2 div rmoveto show grestore} BD
/SCCR{ gsave FCT moveto rotate SW -2 div SH -2 div rmoveto show grestore} BD
/SCRR{ gsave FCT moveto rotate SW neg SH -2 div rmoveto show grestore} BD
/STLR{ gsave FCT moveto rotate 0 SH neg rmoveto show grestore } BD
/STCR{ gsave FCT moveto rotate SW -2 div SH neg rmoveto show grestore } BD
/STRR{ gsave FCT moveto rotate SW neg SH neg rmoveto show grestore } BD
/P  { newpath 0.0 360.0 arc closepath fill } BD
/R  { newpath moveto lineto lineto lineto closepath fill } BD
/LS { newpath moveto } BD
/L  { lineto } BD
/LE { lineto stroke } BD
/T  { newpath moveto lineto lineto closepath fill } BD
/STshfill {
      /b1 exch def /g1 exch def /r1 exch def /y1 exch def /x1 exch def
      /b2 exch def /g2 exch def /r2 exch def /y2 exch def /x2 exch def
      /b3 exch def /g3 exch def /r3 exch def /y3 exch def /x3 exch def
      gsave << /ShadingType 4 /ColorSpace [/DeviceRGB]
      /DataSource [ 0 x1 y1 r1 g1 b1 0 x2 y2 r2 g2 b2 0 x3 y3 r3 g3 b3 ] >>
      shfill grestore } BD
/Tm { 3 -1 roll 8 -1 roll 13 -1 roll add add 3 div
      3 -1 roll 7 -1 roll 11 -1 roll add add 3 div
      3 -1 roll 6 -1 roll 9 -1 roll add add 3 div C T } BD
/STsplit {
      4 index 15 index add 0.5 mul
      4 index 15 index add 0.5 mul
      4 index 15 index add 0.5 mul
      4 index 15 index add 0.5 mul
      4 index 15 index add 0.5 mul
      5 copy 5 copy 25 15 roll
      9 index 30 index add 0.5 mul
      9 index 30 index add 0.5 mul
      9 index 30 index add 0.5 mul
      9 index 30 index add 0.5 mul
      9 index 30 index add 0.5 mul
      5 copy 5 copy 35 5 roll 25 5 roll 15 5 roll
      4 index 10 index add 0.5 mul
      4 index 10 index add 0.5 mul
      4 index 10 index add 0.5 mul
      4 index 10 index add 0.5 mul
      4 index 10 index add 0.5 mul
      5 copy 5 copy 40 5 roll 25 5 roll 15 5 roll 25 5 roll
      STnoshfill STnoshfill STnoshfill STnoshfill } BD
/STnoshfill {
      2 index 8 index sub abs rThreshold gt
      { STsplit }
      { 1 index 7 index sub abs gThreshold gt
        { STsplit }
        { dup 6 index sub abs bThreshold gt
          { STsplit }
          { 2 index 13 index sub abs rThreshold gt
            { STsplit }
            { 1 index 12 index sub abs gThreshold gt
              { STsplit }
              { dup 11 index sub abs bThreshold gt
                { STsplit }
                { 7 index 13 index sub abs rThreshold gt
                  { STsplit }
                  { 6 index 12 index sub abs gThreshold gt
                    { STsplit }
                    { 5 index 11 index sub abs bThreshold gt
                      { STsplit }
                      { Tm }
                      ifelse }
                    ifelse }
                  ifelse }
                ifelse }
              ifelse }
            ifelse }
          ifelse }
        ifelse }
      ifelse } BD
tryPS3shading
{ /shfill where
  { /ST { STshfill } BD }
  { /ST { STnoshfill } BD }
  ifelse }
{ /ST { STnoshfill } BD }
ifelse
end


%* _____________________________ Arrows ____________________________________ 

%* Procedure to draw the path for an arrow head. Note: the arrowhead will be 
%* added to the current path. The arrowhead will also be drawn and filled. 
%* 
%* Usage: Linewidth deltaX deltaY ArrowHead 
%* 
%* where: LineWidth is the width in points of the arrow head lines 
%* 
%* deltaX and deltaY define the direction that the arrow points 
%* 
%* Note: If Linewidth is zero, a value of 1 will be substituted 
%*
/rArrowHead { 
exch atan matrix currentmatrix exch rotate exch 
dup 0 eq 
{ pop 1 } if 
dup scale 
-7 2 rlineto 
1 -2 rlineto 
-1 -2 rlineto 
7 2 rlineto 
currentpoint 
gsave 
newpath moveto 
-7 2 rlineto 
1 -2 rlineto 
-1 -2 rlineto 
closepath 
fill 
grestore 
setmatrix 
} def 

%* Procedure to draw the path for an arrow head. Note: the arrowhead will be 
%* added to the current path. The arrowhead will also be drawn and filled. 
%* 
%* Usage: Linewidth PreviousX PreviousY ArrowHead 
%* 
%* where: LineWidth is the width in points of the arrow head lines 
%* 
%* PreviousX and PreviousY along with the currentpoint 
%* define the direction that the arrow points 
%* 
%* Note: If Linewidth is zero, a value of 1 will be substituted 
%*
/ArrowHead { 
currentpoint 
4 2 roll exch 4 -1 roll exch 
sub 3 1 roll sub
rArrowHead
} def 

%* _____________________________ RLineto^ ____________________________________ 
%* Procedure to add a relative line to the current path and then add the 
%* path for an arrow on its end. 
%* 
%* Usage: x y RLineto^ 
%* 
%* where: x and y are the offsets from the current point 
%* 
/RLineto^ { 
currentlinewidth currentpoint 5 3 roll 
rlineto 
ArrowHead 
} def 

%* _____________________________ Lineto^ ____________________________________ 
%* Procedure to add a line to the current path and then add the 
%* path for an arrow on its end. 
%* 
%* Usage: x y Lineto^ 
%* 
%* where: x and y are the new points for the path 
%* 
/Lineto^ { 
currentlinewidth currentpoint 5 3 roll 
lineto 
ArrowHead 
} def 

%* _____________________________ Arc^ ____________________________________ 
%* Procedure to add an arc to the current path and then add the 
%* path for arrow on its end. 
%* 
%* Usage: x y r ang1 ang2 Arc^ 
%* 
%* where: x, y, ang1, ang2, and r are the normal parameters 
%* for drawing an arc. 
%* 
/Arc^ { 
5 copy arc 
exch pop 2 sub 
dup cos 2 index mul 4 index add 
exch sin 2 index mul 3 index add 
currentlinewidth 3 1 roll 
ArrowHead pop pop pop 
} def 

%* _____________________________ Arcn^ ____________________________________ 
%* Procedure to add an arc to the current path and then add the 
%* path for arrow on its end. 
%* 
%* Usage: x y r ang1 ang2 Arcn^ 
%* 
%* where: x, y, ang1, ang2, and r are the normal parameters 
%* for drawing an arcn. 
%* 
/Arcn^ { 
5 copy arcn 
exch pop 2 add 
dup cos 2 index mul 4 index add 
exch sin 2 index mul 3 index add 
currentlinewidth 3 1 roll 
ArrowHead pop pop pop 
} def


%%EndProlog
%%BeginSetup
/DeviceRGB setcolorspace
gl2psdict begin
%%EndSetup
%%Page: 1 1
%%BeginPageSetup
%%EndPageSetup
mark

(c) 826 357 15 /Helvetica S
(cr) 760 618 15 /Helvetica S
(d) 810 497 15 /Helvetica S
(i) 790 478 15 /Helvetica S
(s) 1078 488 15 /Helvetica S
(b) 1110 469 15 /Helvetica S
(p) 972 465 15 /Helvetica S
(q) 973 500 15 /Helvetica S
(r) 969 530 15 /Helvetica S

0.5 setgray
850 500 moveto 896 500 Lineto^ stroke
1070 490 moveto 1029 490 Lineto^ stroke
878 359 moveto 
878 429 70 270 310 Arc^ stroke
848 632 moveto 
884 594 52 134 40 Arcn^ stroke

1 2 scale 0 setlinewidth
1030 250 moveto currentpoint exch -70 add exch
70 0 360 arc clip
1 0.5 scale

gsave
1.0 1.0 scale
1 W
1 0.672573 0.0236323 C
807.946 501.919 LS
776.525 506.82 L
789.003 477.506 L
807.946 501.919 LE
836.941 473.527 LS
807.946 501.919 L
789.003 477.506 L
836.941 473.527 LE
836.711 509.509 LS
807.946 501.919 L
836.941 473.527 L
836.711 509.509 LE
776.525 506.82 LS
807.946 501.919 L
797.455 539.996 L
776.525 506.82 LE
797.455 539.996 LS
807.946 501.919 L
836.711 509.509 L
797.455 539.996 LE
841.195 555.856 LS
797.455 539.996 L
836.711 509.509 L
841.195 555.856 LE
865.219 534.502 LS
841.195 555.856 L
836.711 509.509 L
865.219 534.502 L
836.711 509.509 L
872.527 502.024 L
865.219 534.502 LE
872.527 502.024 LS
836.711 509.509 L
836.941 473.527 L
872.527 502.024 LE
873.822 469.909 LS
872.527 502.024 L
836.941 473.527 L
873.822 469.909 LE
817.994 445.366 LS
836.941 473.527 L
789.003 477.506 L
817.994 445.366 LE
873.822 469.909 LS
836.941 473.527 L
855.334 441.588 L
873.822 469.909 LE
855.334 441.588 LS
836.941 473.527 L
817.994 445.366 L
855.334 441.588 LE
785.445 446.12 LS
817.994 445.366 L
789.003 477.506 L
785.445 446.12 L
789.003 477.506 L
750.49 479.771 L
785.445 446.12 LE
750.49 479.771 LS
789.003 477.506 L
776.525 506.82 L
750.49 479.771 LE
741.034 435.685 LS
785.445 446.12 L
750.49 479.771 L
741.034 435.685 LE
768.39 413.933 LS
785.445 446.12 L
741.034 435.685 L
768.39 413.933 LE
817.994 445.366 LS
785.445 446.12 L
800.401 412.911 L
817.994 445.366 LE
800.401 412.911 LS
785.445 446.12 L
768.39 413.933 L
800.401 412.911 LE
855.334 441.588 LS
817.994 445.366 L
833.021 418.384 L
855.334 441.588 LE
833.021 418.384 LS
817.994 445.366 L
800.401 412.911 L
833.021 418.384 LE
764.762 538.067 LS
776.525 506.82 L
797.455 539.996 L
764.762 538.067 LE
750.49 479.771 LS
776.525 506.82 L
744.196 512.379 L
750.49 479.771 LE
744.196 512.379 LS
776.525 506.82 L
764.762 538.067 L
744.196 512.379 LE
720.282 460.229 LS
741.034 435.685 L
750.49 479.771 L
720.282 460.229 L
750.49 479.771 L
718.689 488.23 L
720.282 460.229 LE
718.689 488.23 LS
750.49 479.771 L
744.196 512.379 L
718.689 488.23 LE
812.957 573.221 LS
797.455 539.996 L
841.195 555.856 L
812.957 573.221 LE
764.762 538.067 LS
797.455 539.996 L
780.794 571.558 L
764.762 538.067 LE
780.794 571.558 LS
797.455 539.996 L
812.957 573.221 L
780.794 571.558 LE
748.584 567.356 LS
764.762 538.067 L
780.794 571.558 L
748.584 567.356 LE
744.196 512.379 LS
764.762 538.067 L
728.317 542.086 L
744.196 512.379 LE
728.317 542.086 LS
764.762 538.067 L
748.584 567.356 L
728.317 542.086 LE
718.689 488.23 LS
744.196 512.379 L
711.919 514.964 L
718.689 488.23 LE
711.919 514.964 LS
744.196 512.379 L
728.317 542.086 L
711.919 514.964 LE
720.282 460.229 LS
718.689 488.23 L
679.871 488.183 L
720.282 460.229 LE
679.871 488.183 LS
718.689 488.23 L
711.919 514.964 L
679.871 488.183 LE
685.75 450.949 LS
720.282 460.229 L
679.871 488.183 L
685.75 450.949 LE
741.034 435.685 LS
720.282 460.229 L
703.732 426.854 L
741.034 435.685 LE
703.732 426.854 LS
720.282 460.229 L
685.75 450.949 L
703.732 426.854 LE
768.39 413.933 LS
741.034 435.685 L
726.01 403.827 L
768.39 413.933 LE
726.01 403.827 LS
741.034 435.685 L
703.732 426.854 L
726.01 403.827 LE
678.82 520.97 LS
679.871 488.183 L
711.919 514.964 L
678.82 520.97 L
711.919 514.964 L
692.181 547.202 L
678.82 520.97 LE
692.181 547.202 LS
711.919 514.964 L
728.317 542.086 L
692.181 547.202 L
728.317 542.086 L
711.535 571.54 L
692.181 547.202 LE
711.535 571.54 LS
728.317 542.086 L
748.584 567.356 L
711.535 571.54 LE
752.344 382.495 LS
768.39 413.933 L
726.01 403.827 L
752.344 382.495 LE
800.401 412.911 LS
768.39 413.933 L
784.268 379.159 L
800.401 412.911 LE
784.268 379.159 LS
768.39 413.933 L
752.344 382.495 L
784.268 379.159 LE
833.021 418.384 LS
800.401 412.911 L
814.93 378.836 L
833.021 418.384 LE
814.93 378.836 LS
800.401 412.911 L
784.268 379.159 L
814.93 378.836 LE
843.982 385.289 LS
833.021 418.384 L
814.93 378.836 L
843.982 385.289 LE
855.334 441.588 LS
833.021 418.384 L
869.047 406.129 L
855.334 441.588 LE
869.047 406.129 LS
833.021 418.384 L
843.982 385.289 L
869.047 406.129 LE
873.822 469.909 LS
855.334 441.588 L
889.893 429.688 L
873.822 469.909 LE
889.893 429.688 LS
855.334 441.588 L
869.047 406.129 L
889.893 429.688 LE
905.816 455.402 LS
873.822 469.909 L
889.893 429.688 L
905.816 455.402 LE
872.527 502.024 LS
873.822 469.909 L
907.543 487.839 L
872.527 502.024 LE
907.543 487.839 LS
873.822 469.909 L
905.816 455.402 L
907.543 487.839 LE
865.219 534.502 LS
872.527 502.024 L
905.46 518.961 L
865.219 534.502 LE
905.46 518.961 LS
872.527 502.024 L
907.543 487.839 L
905.46 518.961 LE
897.778 547.507 LS
865.219 534.502 L
905.46 518.961 L
897.778 547.507 LE
841.195 555.856 LS
865.219 534.502 L
875.589 571.242 L
841.195 555.856 LE
875.589 571.242 LS
865.219 534.502 L
897.778 547.507 L
875.589 571.242 LE
812.957 573.221 LS
841.195 555.856 L
851.876 591.39 L
812.957 573.221 LE
851.876 591.39 LS
841.195 555.856 L
875.589 571.242 L
851.876 591.39 LE
826.098 605.626 LS
812.957 573.221 L
851.876 591.39 L
826.098 605.626 LE
780.794 571.558 LS
812.957 573.221 L
793.603 606.155 L
780.794 571.558 LE
793.603 606.155 LS
812.957 573.221 L
826.098 605.626 L
793.603 606.155 LE
748.584 567.356 LS
780.794 571.558 L
762.641 603.141 L
748.584 567.356 LE
762.641 603.141 LS
780.794 571.558 L
793.603 606.155 L
762.641 603.141 LE
711.535 571.54 LS
748.584 567.356 L
734.51 594.528 L
711.535 571.54 LE
734.51 594.528 LS
748.584 567.356 L
762.641 603.141 L
734.51 594.528 LE
647.923 470.945 LS
685.75 450.949 L
679.871 488.183 L
647.923 470.945 L
679.871 488.183 L
646.487 500.63 L
647.923 470.945 LE
646.487 500.63 LS
679.871 488.183 L
678.82 520.97 L
646.487 500.63 LE
651.098 529.861 LS
646.487 500.63 L
678.82 520.97 L
651.098 529.861 L
678.82 520.97 L
661.474 557.506 L
651.098 529.861 LE
661.474 557.506 LS
678.82 520.97 L
692.181 547.202 L
661.474 557.506 L
692.181 547.202 L
677.155 582.487 L
661.474 557.506 LE
677.155 582.487 LS
692.181 547.202 L
711.535 571.54 L
677.155 582.487 L
711.535 571.54 L
697.494 603.825 L
677.155 582.487 LE
697.494 603.825 LS
711.535 571.54 L
734.51 594.528 L
697.494 603.825 LE
721.671 620.679 LS
697.494 603.825 L
734.51 594.528 L
721.671 620.679 L
734.51 594.528 L
748.717 632.382 L
721.671 620.679 LE
748.717 632.382 LS
734.51 594.528 L
762.641 603.141 L
748.717 632.382 L
762.641 603.141 L
777.548 638.469 L
748.717 632.382 LE
777.548 638.469 LS
762.641 603.141 L
793.603 606.155 L
777.548 638.469 L
793.603 606.155 L
807.014 638.699 L
777.548 638.469 LE
807.014 638.699 LS
793.603 606.155 L
826.098 605.626 L
807.014 638.699 LE
835.935 633.065 LS
807.014 638.699 L
826.098 605.626 L
835.935 633.065 L
826.098 605.626 L
863.157 621.791 L
835.935 633.065 LE
863.157 621.791 LS
826.098 605.626 L
851.876 591.39 L
863.157 621.791 L
851.876 591.39 L
887.591 605.329 L
863.157 621.791 LE
887.591 605.329 LS
851.876 591.39 L
875.589 571.242 L
887.591 605.329 L
875.589 571.242 L
908.261 584.337 L
887.591 605.329 LE
908.261 584.337 LS
875.589 571.242 L
897.778 547.507 L
908.261 584.337 LE
924.34 559.654 LS
908.261 584.337 L
897.778 547.507 L
924.34 559.654 L
897.778 547.507 L
935.186 532.266 L
924.34 559.654 LE
935.186 532.266 LS
897.778 547.507 L
905.46 518.961 L
935.186 532.266 L
905.46 518.961 L
940.365 503.269 L
935.186 532.266 LE
940.365 503.269 LS
905.46 518.961 L
907.543 487.839 L
940.365 503.269 L
907.543 487.839 L
939.671 473.821 L
940.365 503.269 LE
939.671 473.821 LS
907.543 487.839 L
905.816 455.402 L
939.671 473.821 LE
933.13 445.1 LS
939.671 473.821 L
905.816 455.402 L
933.13 445.1 L
905.816 455.402 L
921.005 418.254 L
933.13 445.1 LE
921.005 418.254 LS
905.816 455.402 L
889.893 429.688 L
921.005 418.254 L
889.893 429.688 L
903.996 394.384 L
921.005 418.254 LE
903.996 394.384 LS
889.893 429.688 L
869.047 406.129 L
903.996 394.384 L
869.047 406.129 L
881.239 374.366 L
903.996 394.384 LE
881.239 374.366 LS
869.047 406.129 L
843.982 385.289 L
881.239 374.366 LE
655.694 441.99 LS
685.75 450.949 L
647.923 470.945 L
655.694 441.99 LE
703.732 426.854 LS
685.75 450.949 L
670.368 414.822 L
703.732 426.854 LE
670.368 414.822 LS
685.75 450.949 L
655.694 441.99 L
670.368 414.822 LE
726.01 403.827 LS
703.732 426.854 L
691.393 390.648 L
726.01 403.827 LE
691.393 390.648 LS
703.732 426.854 L
670.368 414.822 L
691.393 390.648 LE
752.344 382.495 LS
726.01 403.827 L
717.341 369.256 L
752.344 382.495 LE
717.341 369.256 LS
726.01 403.827 L
691.393 390.648 L
717.341 369.256 LE
855.109 358.721 LS
881.239 374.366 L
843.982 385.289 L
855.109 358.721 L
843.982 385.289 L
826.13 348.84 L
855.109 358.721 LE
826.13 348.84 LS
843.982 385.289 L
814.93 378.836 L
826.13 348.84 L
814.93 378.836 L
795.553 345.22 L
826.13 348.84 LE
795.553 345.22 LS
814.93 378.836 L
784.268 379.159 L
795.553 345.22 L
784.268 379.159 L
764.783 348.102 L
795.553 345.22 LE
764.783 348.102 LS
784.268 379.159 L
752.344 382.495 L
764.783 348.102 L
752.344 382.495 L
738.777 355.007 L
764.783 348.102 LE
738.777 355.007 LS
752.344 382.495 L
717.341 369.256 L
738.777 355.007 LE
716.246 334.13 LS
738.777 355.007 L
717.341 369.256 L
716.246 334.13 LE
764.783 348.102 LS
738.777 355.007 L
750.896 321.506 L
764.783 348.102 LE
750.896 321.506 LS
738.777 355.007 L
716.246 334.13 L
750.896 321.506 LE
795.553 345.22 LS
764.783 348.102 L
787.68 316.38 L
795.553 345.22 LE
787.68 316.38 LS
764.783 348.102 L
750.896 321.506 L
787.68 316.38 LE
826.13 348.84 LS
795.553 345.22 L
824.769 319.103 L
826.13 348.84 LE
824.769 319.103 LS
795.553 345.22 L
787.68 316.38 L
824.769 319.103 LE
855.109 358.721 LS
826.13 348.84 L
860.327 329.513 L
855.109 358.721 LE
860.327 329.513 LS
826.13 348.84 L
824.769 319.103 L
860.327 329.513 LE
881.239 374.366 LS
855.109 358.721 L
892.687 346.989 L
881.239 374.366 LE
892.687 346.989 LS
855.109 358.721 L
860.327 329.513 L
892.687 346.989 LE
903.996 394.384 LS
881.239 374.366 L
920.464 370.566 L
903.996 394.384 LE
920.464 370.566 LS
881.239 374.366 L
892.687 346.989 L
920.464 370.566 LE
921.005 418.254 LS
903.996 394.384 L
943.392 400.355 L
921.005 418.254 LE
943.392 400.355 LS
903.996 394.384 L
920.464 370.566 L
943.392 400.355 LE
933.13 445.1 LS
921.005 418.254 L
958.631 432.011 L
933.13 445.1 LE
958.631 432.011 LS
921.005 418.254 L
943.392 400.355 L
958.631 432.011 LE
939.671 473.821 LS
933.13 445.1 L
967.267 466.065 L
939.671 473.821 LE
967.267 466.065 LS
933.13 445.1 L
958.631 432.011 L
967.267 466.065 LE
940.365 503.269 LS
939.671 473.821 L
968.953 501.156 L
940.365 503.269 LE
968.953 501.156 LS
939.671 473.821 L
967.267 466.065 L
968.953 501.156 LE
935.186 532.266 LS
940.365 503.269 L
963.623 535.88 L
935.186 532.266 LE
963.623 535.88 LS
940.365 503.269 L
968.953 501.156 L
963.623 535.88 LE
924.34 559.654 LS
935.186 532.266 L
951.489 568.851 L
924.34 559.654 LE
951.489 568.851 LS
935.186 532.266 L
963.623 535.88 L
951.489 568.851 LE
908.261 584.337 LS
924.34 559.654 L
933.037 598.749 L
908.261 584.337 LE
933.037 598.749 LS
924.34 559.654 L
951.489 568.851 L
933.037 598.749 LE
887.591 605.329 LS
908.261 584.337 L
909.005 624.381 L
887.591 605.329 LE
909.005 624.381 LS
908.261 584.337 L
933.037 598.749 L
909.005 624.381 LE
863.157 621.791 LS
887.591 605.329 L
880.352 644.721 L
863.157 621.791 LE
880.352 644.721 LS
887.591 605.329 L
909.005 624.381 L
880.352 644.721 LE
835.935 633.065 LS
863.157 621.791 L
848.224 658.956 L
835.935 633.065 LE
848.224 658.956 LS
863.157 621.791 L
880.352 644.721 L
848.224 658.956 LE
807.014 638.699 LS
835.935 633.065 L
813.906 666.517 L
807.014 638.699 LE
813.906 666.517 LS
835.935 633.065 L
848.224 658.956 L
813.906 666.517 LE
777.548 638.469 LS
807.014 638.699 L
778.768 667.102 L
777.548 638.469 LE
778.768 667.102 LS
807.014 638.699 L
813.906 666.517 L
778.768 667.102 LE
748.717 632.382 LS
777.548 638.469 L
744.217 660.688 L
748.717 632.382 LE
744.217 660.688 LS
777.548 638.469 L
778.768 667.102 L
744.217 660.688 LE
721.671 620.679 LS
748.717 632.382 L
711.633 647.531 L
721.671 620.679 LE
711.633 647.531 LS
748.717 632.382 L
744.217 660.688 L
711.633 647.531 LE
697.494 603.825 LS
721.671 620.679 L
682.318 628.157 L
697.494 603.825 LE
682.318 628.157 LS
721.671 620.679 L
711.633 647.531 L
682.318 628.157 LE
677.155 582.487 LS
697.494 603.825 L
657.444 603.34 L
677.155 582.487 LE
657.444 603.34 LS
697.494 603.825 L
682.318 628.157 L
657.444 603.34 LE
661.474 557.506 LS
677.155 582.487 L
638.006 574.073 L
661.474 557.506 LE
638.006 574.073 LS
677.155 582.487 L
657.444 603.34 L
638.006 574.073 LE
651.098 529.861 LS
661.474 557.506 L
624.78 541.525 L
651.098 529.861 LE
624.78 541.525 LS
661.474 557.506 L
638.006 574.073 L
624.78 541.525 LE
646.487 500.63 LS
651.098 529.861 L
618.296 506.997 L
646.487 500.63 LE
618.296 506.997 LS
651.098 529.861 L
624.78 541.525 L
618.296 506.997 LE
647.923 470.945 LS
646.487 500.63 L
618.811 471.87 L
647.923 470.945 LE
618.811 471.87 LS
646.487 500.63 L
618.296 506.997 L
618.811 471.87 LE
655.694 441.99 LS
647.923 470.945 L
626.308 437.547 L
655.694 441.99 LE
626.308 437.547 LS
647.923 470.945 L
618.811 471.87 L
626.308 437.547 LE
670.368 414.822 LS
655.694 441.99 L
640.483 405.401 L
670.368 414.822 LE
640.483 405.401 LS
655.694 441.99 L
626.308 437.547 L
640.483 405.401 LE
691.393 390.648 LS
670.368 414.822 L
660.773 376.717 L
691.393 390.648 LE
660.773 376.717 LS
670.368 414.822 L
640.483 405.401 L
660.773 376.717 LE
717.341 369.256 LS
691.393 390.648 L
686.365 352.641 L
717.341 369.256 LE
686.365 352.641 LS
691.393 390.648 L
660.773 376.717 L
686.365 352.641 LE
716.246 334.13 LS
717.341 369.256 L
686.365 352.641 L
716.246 334.13 LE
0.0236323 1 0.802361 C
956.794 700.865 LS
926.062 694.326 L
955.656 671.253 L
956.794 700.865 LE
984.586 683.03 LS
956.794 700.865 L
955.656 671.253 L
984.586 683.03 LE
982.312 715.54 LS
956.794 700.865 L
984.586 683.03 L
982.312 715.54 LE
926.062 694.326 LS
956.794 700.865 L
933.453 724.509 L
926.062 694.326 LE
933.453 724.509 LS
956.794 700.865 L
982.312 715.54 L
933.453 724.509 LE
952.526 753.874 LS
933.453 724.509 L
982.312 715.54 L
952.526 753.874 LE
985.821 754.243 LS
952.526 753.874 L
982.312 715.54 L
985.821 754.243 LE
1011.62 725.357 LS
985.821 754.243 L
982.312 715.54 L
1011.62 725.357 L
982.312 715.54 L
1014.67 692.956 L
1011.62 725.357 LE
1014.67 692.956 LS
982.312 715.54 L
984.586 683.03 L
1014.67 692.956 LE
1018.26 754.584 LS
985.821 754.243 L
1011.62 725.357 L
1018.26 754.584 LE
1044.07 739.97 LS
1018.26 754.584 L
1011.62 725.357 L
1044.07 739.97 L
1011.62 725.357 L
1043.78 706.308 L
1044.07 739.97 LE
1043.78 706.308 LS
1011.62 725.357 L
1014.67 692.956 L
1043.78 706.308 LE
984.273 650.237 LS
984.586 683.03 L
955.656 671.253 L
984.273 650.237 LE
1014.67 692.956 LS
984.586 683.03 L
1015.38 659.777 L
1014.67 692.956 LE
1015.38 659.777 LS
984.586 683.03 L
984.273 650.237 L
1015.38 659.777 LE
1043.78 706.308 LS
1014.67 692.956 L
1043.79 673.047 L
1043.78 706.308 LE
1043.79 673.047 LS
1014.67 692.956 L
1015.38 659.777 L
1043.79 673.047 LE
1044.01 640.509 LS
1043.79 673.047 L
1015.38 659.777 L
1044.01 640.509 L
1015.38 659.777 L
1010.89 622.421 L
1044.01 640.509 LE
1010.89 622.421 LS
1015.38 659.777 L
984.273 650.237 L
1010.89 622.421 LE
920.973 752.185 LS
933.453 724.509 L
952.526 753.874 L
920.973 752.185 LE
926.062 694.326 LS
933.453 724.509 L
895.688 713.746 L
926.062 694.326 LE
895.688 713.746 LS
933.453 724.509 L
920.973 752.185 L
895.688 713.746 LE
890.181 751.678 LS
895.688 713.746 L
920.973 752.185 L
890.181 751.678 LE
909.221 781.734 LS
890.181 751.678 L
920.973 752.185 L
909.221 781.734 L
920.973 752.185 L
942.357 783.508 L
909.221 781.734 LE
942.357 783.508 LS
920.973 752.185 L
952.526 753.874 L
942.357 783.508 L
952.526 753.874 L
976.396 783.684 L
942.357 783.508 LE
976.396 783.684 LS
952.526 753.874 L
985.821 754.243 L
976.396 783.684 L
985.821 754.243 L
1010.5 783.897 L
976.396 783.684 LE
1010.5 783.897 LS
985.821 754.243 L
1018.26 754.584 L
1010.5 783.897 L
1018.26 754.584 L
1044.06 784.195 L
1010.5 783.897 LE
1044.06 784.195 LS
1018.26 754.584 L
1044.07 739.97 L
1044.06 784.195 LE
1074.16 750.899 LS
1044.06 784.195 L
1044.07 739.97 L
1074.16 750.899 L
1044.07 739.97 L
1073.64 716.717 L
1074.16 750.899 LE
1073.64 716.717 LS
1044.07 739.97 L
1043.78 706.308 L
1073.64 716.717 L
1043.78 706.308 L
1073.29 682.437 L
1073.64 716.717 LE
1073.29 682.437 LS
1043.78 706.308 L
1043.79 673.047 L
1073.29 682.437 L
1043.79 673.047 L
1073.07 648.096 L
1073.29 682.437 LE
1073.07 648.096 LS
1043.79 673.047 L
1044.01 640.509 L
1073.07 648.096 LE
1045.75 609.685 LS
1044.01 640.509 L
1010.89 622.421 L
1045.75 609.685 LE
1073.07 648.096 LS
1044.01 640.509 L
1072.96 613.723 L
1073.07 648.096 LE
1072.96 613.723 LS
1044.01 640.509 L
1045.75 609.685 L
1072.96 613.723 LE
1029.47 588.066 LS
1045.75 609.685 L
1010.89 622.421 L
1029.47 588.066 LE
1072.96 613.723 LS
1045.75 609.685 L
1071.63 578.346 L
1072.96 613.723 LE
1071.63 578.346 LS
1045.75 609.685 L
1029.47 588.066 L
1071.63 578.346 LE
1041.25 553.715 LS
1071.63 578.346 L
1029.47 588.066 L
1041.25 553.715 LE
1071.81 544.652 LS
1071.63 578.346 L
1041.25 553.715 L
1071.81 544.652 LE
1102.81 563.567 LS
1071.63 578.346 L
1071.81 544.652 L
1102.81 563.567 LE
1072.96 613.723 LS
1071.63 578.346 L
1102.62 597.982 L
1072.96 613.723 LE
1102.62 597.982 LS
1071.63 578.346 L
1102.81 563.567 L
1102.62 597.982 LE
1073.07 648.096 LS
1072.96 613.723 L
1102.53 632.411 L
1073.07 648.096 LE
1102.53 632.411 LS
1072.96 613.723 L
1102.62 597.982 L
1102.53 632.411 LE
1073.29 682.437 LS
1073.07 648.096 L
1102.51 666.83 L
1073.29 682.437 LE
1102.51 666.83 LS
1073.07 648.096 L
1102.53 632.411 L
1102.51 666.83 LE
1073.64 716.717 LS
1073.29 682.437 L
1102.55 701.214 L
1073.64 716.717 LE
1102.55 701.214 LS
1073.29 682.437 L
1102.51 666.83 L
1102.55 701.214 LE
1074.16 750.899 LS
1073.64 716.717 L
1102.62 735.536 L
1074.16 750.899 LE
1102.62 735.536 LS
1073.64 716.717 L
1102.55 701.214 L
1102.62 735.536 LE
1103.19 529.178 LS
1102.81 563.567 L
1071.81 544.652 L
1103.19 529.178 LE
1077.43 509.385 LS
1103.19 529.178 L
1071.81 544.652 L
1077.43 509.385 L
1071.81 544.652 L
1048.91 517.747 L
1077.43 509.385 LE
1048.91 517.747 LS
1071.81 544.652 L
1041.25 553.715 L
1048.91 517.747 LE
1040.78 289.328 LS
1046.49 260.412 L
1073.53 271.602 L
1040.78 289.328 LE
1073.75 307.384 LS
1040.78 289.328 L
1073.53 271.602 L
1073.75 307.384 LE
1043.68 320.876 LS
1040.78 289.328 L
1073.75 307.384 L
1043.68 320.876 LE
1011.47 314.03 LS
1040.78 289.328 L
1043.68 320.876 L
1011.47 314.03 LE
1010.02 286.869 LS
1040.78 289.328 L
1011.47 314.03 L
1010.02 286.869 LE
1046.49 260.412 LS
1040.78 289.328 L
1015.98 259.226 L
1046.49 260.412 LE
1015.98 259.226 LS
1040.78 289.328 L
1010.02 286.869 L
1015.98 259.226 LE
978.903 290.586 LS
1010.02 286.869 L
1011.47 314.03 L
978.903 290.586 LE
1015.98 259.226 LS
1010.02 286.869 L
984.387 259.91 L
1015.98 259.226 LE
984.387 259.91 LS
1010.02 286.869 L
978.903 290.586 L
984.387 259.91 LE
979.288 322.141 LS
978.903 290.586 L
1011.47 314.03 L
979.288 322.141 LE
948.928 303.183 LS
978.903 290.586 L
979.288 322.141 L
948.928 303.183 LE
984.387 259.91 LS
978.903 290.586 L
952.581 260.27 L
984.387 259.91 LE
952.581 260.27 LS
978.903 290.586 L
948.928 303.183 L
952.581 260.27 LE
920.99 280.644 LS
952.581 260.27 L
948.928 303.183 L
920.99 280.644 LE
922.326 248.817 LS
952.581 260.27 L
920.99 280.644 L
922.326 248.817 LE
944.545 229.797 LS
952.581 260.27 L
922.326 248.817 L
944.545 229.797 LE
984.387 259.91 LS
952.581 260.27 L
976.641 230.484 L
984.387 259.91 LE
976.641 230.484 LS
952.581 260.27 L
944.545 229.797 L
976.641 230.484 LE
1015.98 259.226 LS
984.387 259.91 L
1009.93 230.583 L
1015.98 259.226 LE
1009.93 230.583 LS
984.387 259.91 L
976.641 230.484 L
1009.93 230.583 LE
1046.49 260.412 LS
1015.98 259.226 L
1043.66 230.572 L
1046.49 260.412 LE
1043.66 230.572 LS
1015.98 259.226 L
1009.93 230.583 L
1043.66 230.572 LE
1073.53 271.602 LS
1046.49 260.412 L
1074.81 232.814 L
1073.53 271.602 LE
1074.81 232.814 LS
1046.49 260.412 L
1043.66 230.572 L
1074.81 232.814 LE
1103.31 259.073 LS
1073.53 271.602 L
1074.81 232.814 L
1103.31 259.073 LE
1073.75 307.384 LS
1073.53 271.602 L
1103 292.612 L
1073.75 307.384 LE
1103 292.612 LS
1073.53 271.602 L
1103.31 259.073 L
1103 292.612 LE
979.288 322.141 LS
1011.47 314.03 L
1004.65 351.373 L
979.288 322.141 LE
1004.65 351.373 LS
1011.47 314.03 L
1043.68 320.876 L
1004.65 351.373 LE
1044.1 354.713 LS
1004.65 351.373 L
1043.68 320.876 L
1044.1 354.713 L
1043.68 320.876 L
1073.97 341.348 L
1044.1 354.713 LE
1073.97 341.348 LS
1043.68 320.876 L
1073.75 307.384 L
1073.97 341.348 L
1073.75 307.384 L
1102.78 326.693 L
1073.97 341.348 LE
1102.78 326.693 LS
1073.75 307.384 L
1103 292.612 L
1102.78 326.693 LE
1076.96 784.255 LS
1044.06 784.195 L
1074.16 750.899 L
1076.96 784.255 L
1074.16 750.899 L
1102.89 769.13 L
1076.96 784.255 LE
1102.89 769.13 LS
1074.16 750.899 L
1102.62 735.536 L
1102.89 769.13 LE
1021.39 385.395 LS
1004.65 351.373 L
1044.1 354.713 L
1021.39 385.395 LE
1051.26 385.468 LS
1021.39 385.395 L
1044.1 354.713 L
1051.26 385.468 L
1044.1 354.713 L
1078.22 374.566 L
1051.26 385.468 LE
1078.22 374.566 LS
1044.1 354.713 L
1073.97 341.348 L
1078.22 374.566 L
1073.97 341.348 L
1102.61 360.933 L
1078.22 374.566 LE
1102.61 360.933 LS
1073.97 341.348 L
1102.78 326.693 L
1102.61 360.933 LE
1102.46 395.302 LS
1078.22 374.566 L
1102.61 360.933 L
1102.46 395.302 LE
1051.26 385.468 LS
1078.22 374.566 L
1068.17 409.382 L
1051.26 385.468 LE
1068.17 409.382 LS
1078.22 374.566 L
1102.46 395.302 L
1068.17 409.382 LE
1021.39 385.395 LS
1051.26 385.468 L
1030.7 419.775 L
1021.39 385.395 LE
1030.7 419.775 LS
1051.26 385.468 L
1068.17 409.382 L
1030.7 419.775 LE
1062.68 442.202 LS
1030.7 419.775 L
1068.17 409.382 L
1062.68 442.202 L
1068.17 409.382 L
1100.89 430.231 L
1062.68 442.202 LE
1100.89 430.231 LS
1068.17 409.382 L
1102.46 395.302 L
1100.89 430.231 LE
929.864 813.417 LS
909.221 781.734 L
942.357 783.508 L
929.864 813.417 L
942.357 783.508 L
964.64 813.496 L
929.864 813.417 LE
964.64 813.496 LS
942.357 783.508 L
976.396 783.684 L
964.64 813.496 L
976.396 783.684 L
999.346 813.596 L
964.64 813.496 LE
999.346 813.596 LS
976.396 783.684 L
1010.5 783.897 L
999.346 813.596 L
1010.5 783.897 L
1033.96 813.722 L
999.346 813.596 LE
1033.96 813.722 LS
1010.5 783.897 L
1044.06 784.195 L
1033.96 813.722 L
1044.06 784.195 L
1068.47 813.88 L
1033.96 813.722 LE
1068.47 813.88 LS
1044.06 784.195 L
1076.96 784.255 L
1068.47 813.88 L
1076.96 784.255 L
1102.01 814.295 L
1068.47 813.88 LE
1102.01 814.295 LS
1076.96 784.255 L
1102.89 769.13 L
1102.01 814.295 LE
1133.39 782.923 LS
1102.01 814.295 L
1102.89 769.13 L
1133.39 782.923 L
1102.89 769.13 L
1132.98 749.392 L
1133.39 782.923 LE
1132.98 749.392 LS
1102.89 769.13 L
1102.62 735.536 L
1132.98 749.392 L
1102.62 735.536 L
1132.82 714.895 L
1132.98 749.392 LE
1132.82 714.895 LS
1102.62 735.536 L
1102.55 701.214 L
1132.82 714.895 L
1102.55 701.214 L
1132.69 680.288 L
1132.82 714.895 LE
1132.69 680.288 LS
1102.55 701.214 L
1102.51 666.83 L
1132.69 680.288 L
1102.51 666.83 L
1132.59 645.593 L
1132.69 680.288 LE
1132.59 645.593 LS
1102.51 666.83 L
1102.53 632.411 L
1132.59 645.593 L
1102.53 632.411 L
1132.52 610.828 L
1132.59 645.593 LE
1132.52 610.828 LS
1102.53 632.411 L
1102.62 597.982 L
1132.52 610.828 L
1102.62 597.982 L
1132.45 576.008 L
1132.52 610.828 LE
1132.45 576.008 LS
1102.62 597.982 L
1102.81 563.567 L
1132.45 576.008 L
1102.81 563.567 L
1132.41 541.143 L
1132.45 576.008 LE
1132.41 541.143 LS
1102.81 563.567 L
1103.19 529.178 L
1132.41 541.143 LE
1103.94 496.063 LS
1103.19 529.178 L
1077.43 509.385 L
1103.94 496.063 LE
1132.41 541.143 LS
1103.19 529.178 L
1132.34 508.148 L
1132.41 541.143 LE
1132.34 508.148 LS
1103.19 529.178 L
1103.94 496.063 L
1132.34 508.148 LE
1077.84 479.093 LS
1103.94 496.063 L
1077.43 509.385 L
1077.84 479.093 LE
1101.31 464.735 LS
1103.94 496.063 L
1077.84 479.093 L
1101.31 464.735 LE
1132.34 508.148 LS
1103.94 496.063 L
1132.36 477.757 L
1132.34 508.148 LE
1132.36 477.757 LS
1103.94 496.063 L
1101.31 464.735 L
1132.36 477.757 LE
1077.84 479.093 LS
1077.43 509.385 L
1050.55 480.614 L
1077.84 479.093 LE
1050.55 480.614 LS
1077.43 509.385 L
1048.91 517.747 L
1050.55 480.614 LE
1101.31 464.735 LS
1077.84 479.093 L
1062.68 442.202 L
1101.31 464.735 LE
1062.68 442.202 LS
1077.84 479.093 L
1050.55 480.614 L
1062.68 442.202 LE
1100.89 430.231 LS
1101.31 464.735 L
1062.68 442.202 L
1100.89 430.231 LE
1132.36 477.757 LS
1101.31 464.735 L
1132.41 442.857 L
1132.36 477.757 LE
1132.41 442.857 LS
1101.31 464.735 L
1100.89 430.231 L
1132.41 442.857 L
1100.89 430.231 L
1132.45 407.992 L
1132.41 442.857 LE
1132.45 407.992 LS
1100.89 430.231 L
1102.46 395.302 L
1132.45 407.992 L
1102.46 395.302 L
1132.52 373.173 L
1132.45 407.992 LE
1132.52 373.173 LS
1102.46 395.302 L
1102.61 360.933 L
1132.52 373.173 L
1102.61 360.933 L
1132.59 338.407 L
1132.52 373.173 LE
1132.59 338.407 LS
1102.61 360.933 L
1102.78 326.693 L
1132.59 338.407 L
1102.78 326.693 L
1132.69 303.712 L
1132.59 338.407 LE
1132.69 303.712 LS
1102.78 326.693 L
1103 292.612 L
1132.69 303.712 LE
1103.39 226.218 LS
1103.31 259.073 L
1074.81 232.814 L
1103.39 226.218 LE
1088.27 200.342 LS
1103.39 226.218 L
1074.81 232.814 L
1088.27 200.342 L
1074.81 232.814 L
1054.67 200.66 L
1088.27 200.342 LE
1054.67 200.66 LS
1074.81 232.814 L
1043.66 230.572 L
1054.67 200.66 LE
1132.69 303.712 LS
1103 292.612 L
1132.82 269.105 L
1132.69 303.712 LE
1132.82 269.105 LS
1103 292.612 L
1103.31 259.073 L
1132.82 269.105 L
1103.31 259.073 L
1132.98 234.608 L
1132.82 269.105 LE
1132.98 234.608 LS
1103.31 259.073 L
1103.39 226.218 L
1132.98 234.608 L
1103.39 226.218 L
1133.39 201.077 L
1132.98 234.608 LE
1133.39 201.077 LS
1103.39 226.218 L
1088.27 200.342 L
1133.39 201.077 LE
1102.01 169.705 LS
1133.39 201.077 L
1088.27 200.342 L
1102.01 169.705 L
1088.27 200.342 L
1068.47 170.12 L
1102.01 169.705 LE
1068.47 170.12 LS
1088.27 200.342 L
1054.67 200.66 L
1068.47 170.12 LE
1054.67 200.66 LS
1043.66 230.572 L
1020.34 200.845 L
1054.67 200.66 LE
1020.34 200.845 LS
1043.66 230.572 L
1009.93 230.583 L
1020.34 200.845 LE
1068.47 170.12 LS
1054.67 200.66 L
1033.96 170.278 L
1068.47 170.12 LE
1033.96 170.278 LS
1054.67 200.66 L
1020.34 200.845 L
1033.96 170.278 LE
1020.34 200.845 LS
1009.93 230.583 L
985.931 201.049 L
1020.34 200.845 LE
985.931 201.049 LS
1009.93 230.583 L
976.641 230.484 L
985.931 201.049 LE
1033.96 170.278 LS
1020.34 200.845 L
999.346 170.404 L
1033.96 170.278 LE
999.346 170.404 LS
1020.34 200.845 L
985.931 201.049 L
999.346 170.404 LE
985.931 201.049 LS
976.641 230.484 L
951.474 201.3 L
985.931 201.049 LE
951.474 201.3 LS
976.641 230.484 L
944.545 229.797 L
951.474 201.3 LE
999.346 170.404 LS
985.931 201.049 L
964.64 170.504 L
999.346 170.404 LE
964.64 170.504 LS
985.931 201.049 L
951.474 201.3 L
964.64 170.504 LE
951.474 201.3 LS
944.545 229.797 L
917.002 201.644 L
951.474 201.3 LE
917.002 201.644 LS
944.545 229.797 L
922.326 248.817 L
917.002 201.644 LE
964.64 170.504 LS
951.474 201.3 L
929.864 170.583 L
964.64 170.504 LE
929.864 170.583 LS
951.474 201.3 L
917.002 201.644 L
929.864 170.583 LE
892.985 232.057 LS
917.002 201.644 L
922.326 248.817 L
892.985 232.057 LE
884.007 200.432 LS
917.002 201.644 L
892.985 232.057 L
884.007 200.432 LE
929.864 170.583 LS
917.002 201.644 L
895.034 170.645 L
929.864 170.583 LE
895.034 170.645 LS
917.002 201.644 L
884.007 200.432 L
895.034 170.645 LE
892.985 232.057 LS
922.326 248.817 L
887.322 264.587 L
892.985 232.057 LE
887.322 264.587 LS
922.326 248.817 L
920.99 280.644 L
887.322 264.587 LE
884.007 200.432 LS
892.985 232.057 L
855.783 239.486 L
884.007 200.432 LE
855.783 239.486 LS
892.985 232.057 L
887.322 264.587 L
855.783 239.486 LE
850.194 200.601 LS
884.007 200.432 L
855.783 239.486 L
850.194 200.601 LE
895.034 170.645 LS
884.007 200.432 L
860.158 170.694 L
895.034 170.645 LE
860.158 170.694 LS
884.007 200.432 L
850.194 200.601 L
860.158 170.694 LE
830.148 222.556 LS
850.194 200.601 L
855.783 239.486 L
830.148 222.556 LE
816.661 196.535 LS
850.194 200.601 L
830.148 222.556 L
816.661 196.535 LE
860.158 170.694 LS
850.194 200.601 L
827.153 170.763 L
860.158 170.694 LE
827.153 170.763 LS
850.194 200.601 L
816.661 196.535 L
827.153 170.763 LE
796.753 170.735 LS
827.153 170.763 L
816.661 196.535 L
796.753 170.735 LE
787.288 199.884 LS
796.753 170.735 L
816.661 196.535 L
787.288 199.884 L
816.661 196.535 L
800.232 229.464 L
787.288 199.884 LE
800.232 229.464 LS
816.661 196.535 L
830.148 222.556 L
800.232 229.464 L
830.148 222.556 L
823.295 261.222 L
800.232 229.464 LE
823.295 261.222 LS
830.148 222.556 L
855.783 239.486 L
823.295 261.222 LE
787.848 257.374 LS
800.232 229.464 L
823.295 261.222 L
787.848 257.374 LE
787.288 199.884 LS
800.232 229.464 L
760.807 233.078 L
787.288 199.884 LE
760.807 233.078 LS
800.232 229.464 L
787.848 257.374 L
760.807 233.078 LE
755.647 198.483 LS
787.288 199.884 L
760.807 233.078 L
755.647 198.483 LE
796.753 170.735 LS
787.288 199.884 L
761.842 170.694 L
796.753 170.735 LE
761.842 170.694 LS
787.288 199.884 L
755.647 198.483 L
761.842 170.694 LE
734.241 216.91 LS
755.647 198.483 L
760.807 233.078 L
734.241 216.91 LE
750.012 260.588 LS
760.807 233.078 L
787.848 257.374 L
750.012 260.588 LE
734.241 216.91 LS
760.807 233.078 L
722.676 243.6 L
734.241 216.91 LE
722.676 243.6 LS
760.807 233.078 L
750.012 260.588 L
722.676 243.6 LE
761.842 170.694 LS
755.647 198.483 L
726.966 170.645 L
761.842 170.694 LE
726.966 170.645 LS
755.647 198.483 L
734.241 216.91 L
726.966 170.645 LE
707.827 203.481 LS
726.966 170.645 L
734.241 216.91 L
707.827 203.481 L
734.241 216.91 L
696.295 229.852 L
707.827 203.481 LE
696.295 229.852 LS
734.241 216.91 L
722.676 243.6 L
696.295 229.852 LE
713.532 273.689 LS
722.676 243.6 L
750.012 260.588 L
713.532 273.689 LE
696.295 229.852 LS
722.676 243.6 L
687.939 261.169 L
696.295 229.852 LE
687.939 261.169 LS
722.676 243.6 L
713.532 273.689 L
687.939 261.169 LE
692.136 170.583 LS
726.966 170.645 L
707.827 203.481 L
692.136 170.583 LE
680.31 193.252 LS
692.136 170.583 L
707.827 203.481 L
680.31 193.252 L
707.827 203.481 L
670.279 218.021 L
680.31 193.252 LE
670.279 218.021 LS
707.827 203.481 L
696.295 229.852 L
670.279 218.021 L
696.295 229.852 L
661.271 247.873 L
670.279 218.021 LE
661.271 247.873 LS
696.295 229.852 L
687.939 261.169 L
661.271 247.873 LE
684.837 295.193 LS
687.939 261.169 L
713.532 273.689 L
684.837 295.193 LE
661.271 247.873 LS
687.939 261.169 L
658.304 282.095 L
661.271 247.873 LE
658.304 282.095 LS
687.939 261.169 L
684.837 295.193 L
658.304 282.095 LE
657.36 170.504 LS
692.136 170.583 L
680.31 193.252 L
657.36 170.504 L
680.31 193.252 L
645.69 200.335 L
657.36 170.504 LE
645.69 200.335 LS
680.31 193.252 L
670.279 218.021 L
645.69 200.335 L
670.279 218.021 L
633.254 232.226 L
645.69 200.335 LE
633.254 232.226 LS
670.279 218.021 L
661.271 247.873 L
633.254 232.226 L
661.271 247.873 L
631.161 270.257 L
633.254 232.226 LE
631.161 270.257 LS
661.271 247.873 L
658.304 282.095 L
631.161 270.257 LE
602.778 255.982 LS
633.254 232.226 L
631.161 270.257 L
602.778 255.982 LE
601.727 227.587 LS
633.254 232.226 L
602.778 255.982 L
601.727 227.587 LE
645.69 200.335 LS
633.254 232.226 L
611.596 200.165 L
645.69 200.335 LE
611.596 200.165 LS
633.254 232.226 L
601.727 227.587 L
611.596 200.165 LE
657.36 170.504 LS
645.69 200.335 L
622.654 170.404 L
657.36 170.504 LE
622.654 170.404 LS
645.69 200.335 L
611.596 200.165 L
622.654 170.404 LE
574.041 243.315 LS
601.727 227.587 L
602.778 255.982 L
574.041 243.315 LE
611.596 200.165 LS
601.727 227.587 L
577.671 200.024 L
611.596 200.165 LE
577.671 200.024 LS
601.727 227.587 L
574.041 243.315 L
577.671 200.024 LE
622.654 170.404 LS
611.596 200.165 L
588.036 170.278 L
622.654 170.404 LE
588.036 170.278 LS
611.596 200.165 L
577.671 200.024 L
588.036 170.278 LE
545.853 230.488 LS
577.671 200.024 L
574.041 243.315 L
545.853 230.488 LE
544.257 200.121 LS
577.671 200.024 L
545.853 230.488 L
544.257 200.121 LE
588.036 170.278 LS
577.671 200.024 L
553.529 170.12 L
588.036 170.278 LE
553.529 170.12 LS
577.671 200.024 L
544.257 200.121 L
553.529 170.12 LE
653.672 313.023 LS
658.304 282.095 L
684.837 295.193 L
653.672 313.023 LE
631.161 270.257 LS
658.304 282.095 L
624.564 300.503 L
631.161 270.257 LE
624.564 300.503 LS
658.304 282.095 L
653.672 313.023 L
624.564 300.503 LE
602.778 255.982 LS
631.161 270.257 L
596.39 285.826 L
602.778 255.982 LE
596.39 285.826 LS
631.161 270.257 L
624.564 300.503 L
596.39 285.826 LE
574.041 243.315 LS
602.778 255.982 L
567.026 273.262 L
574.041 243.315 LE
567.026 273.262 LS
602.778 255.982 L
596.39 285.826 L
567.026 273.262 LE
545.853 230.488 LS
574.041 243.315 L
538.434 260.586 L
545.853 230.488 LE
538.434 260.586 LS
574.041 243.315 L
567.026 273.262 L
538.434 260.586 LE
517.627 214.902 LS
544.257 200.121 L
545.853 230.488 L
517.627 214.902 L
545.853 230.488 L
513.123 247.778 L
517.627 214.902 LE
513.123 247.778 LS
545.853 230.488 L
538.434 260.586 L
513.123 247.778 LE
553.529 170.12 LS
544.257 200.121 L
519.987 169.705 L
553.529 170.12 LE
519.987 169.705 LS
544.257 200.121 L
517.627 214.902 L
519.987 169.705 LE
488.605 201.077 LS
519.987 169.705 L
517.627 214.902 L
488.605 201.077 L
517.627 214.902 L
489.02 234.608 L
488.605 201.077 LE
489.02 234.608 LS
517.627 214.902 L
513.123 247.778 L
489.02 234.608 LE
489.178 269.105 LS
489.02 234.608 L
513.123 247.778 L
489.178 269.105 L
513.123 247.778 L
517.447 285.487 L
489.178 269.105 LE
517.447 285.487 LS
513.123 247.778 L
538.434 260.586 L
517.447 285.487 L
538.434 260.586 L
545.038 297.718 L
517.447 285.487 LE
545.038 297.718 LS
538.434 260.586 L
567.026 273.262 L
545.038 297.718 L
567.026 273.262 L
572.459 308.649 L
545.038 297.718 LE
572.459 308.649 LS
567.026 273.262 L
596.39 285.826 L
572.459 308.649 L
596.39 285.826 L
599.104 322.115 L
572.459 308.649 LE
599.104 322.115 LS
596.39 285.826 L
624.564 300.503 L
599.104 322.115 LE
569.566 339.623 LS
572.459 308.649 L
599.104 322.115 L
569.566 339.623 LE
545.038 297.718 LS
572.459 308.649 L
538.954 328.127 L
545.038 297.718 LE
538.954 328.127 LS
572.459 308.649 L
569.566 339.623 L
538.954 328.127 LE
517.447 285.487 LS
545.038 297.718 L
512.538 319.51 L
517.447 285.487 LE
512.538 319.51 LS
545.038 297.718 L
538.954 328.127 L
512.538 319.51 LE
489.178 269.105 LS
517.447 285.487 L
489.305 303.712 L
489.178 269.105 LE
489.305 303.712 LS
517.447 285.487 L
512.538 319.51 L
489.305 303.712 LE
489.405 338.407 LS
489.305 303.712 L
512.538 319.51 L
489.405 338.407 L
512.538 319.51 L
521.799 356.732 L
489.405 338.407 LE
521.799 356.732 LS
512.538 319.51 L
538.954 328.127 L
521.799 356.732 L
538.954 328.127 L
548.091 360.261 L
521.799 356.732 LE
548.091 360.261 LS
538.954 328.127 L
569.566 339.623 L
548.091 360.261 LE
599.104 322.115 LS
624.564 300.503 L
626.499 338.595 L
599.104 322.115 LE
626.499 338.595 LS
624.564 300.503 L
653.672 313.023 L
626.499 338.595 LE
569.566 339.623 LS
599.104 322.115 L
591.702 358.987 L
569.566 339.623 LE
591.702 358.987 LS
599.104 322.115 L
626.499 338.595 L
591.702 358.987 LE
548.091 360.261 LS
569.566 339.623 L
566.334 379.404 L
548.091 360.261 LE
566.334 379.404 LS
569.566 339.623 L
591.702 358.987 L
566.334 379.404 LE
521.799 356.732 LS
548.091 360.261 L
522.279 391.63 L
521.799 356.732 LE
522.279 391.63 LS
548.091 360.261 L
566.334 379.404 L
522.279 391.63 LE
489.405 338.407 LS
521.799 356.732 L
489.484 373.173 L
489.405 338.407 LE
489.484 373.173 LS
521.799 356.732 L
522.279 391.63 L
489.484 373.173 LE
556.366 410.024 LS
522.279 391.63 L
566.334 379.404 L
556.366 410.024 LE
522.276 426.315 LS
522.279 391.63 L
556.366 410.024 L
522.276 426.315 LE
489.484 373.173 LS
522.279 391.63 L
489.546 407.992 L
489.484 373.173 LE
489.546 407.992 LS
522.279 391.63 L
522.276 426.315 L
489.546 407.992 LE
556.366 410.024 LS
566.334 379.404 L
600.225 397.155 L
556.366 410.024 LE
600.225 397.155 LS
566.334 379.404 L
591.702 358.987 L
600.225 397.155 LE
583.821 428.811 LS
556.366 410.024 L
600.225 397.155 L
583.821 428.811 LE
522.276 426.315 LS
556.366 410.024 L
548.537 445.523 L
522.276 426.315 LE
548.537 445.523 LS
556.366 410.024 L
583.821 428.811 L
548.537 445.523 LE
488.91 442.018 LS
489.546 407.992 L
522.276 426.315 L
488.91 442.018 L
522.276 426.315 L
513.456 460.684 L
488.91 442.018 LE
513.456 460.684 LS
522.276 426.315 L
548.537 445.523 L
513.456 460.684 LE
573.136 465.258 LS
548.537 445.523 L
583.821 428.811 L
573.136 465.258 LE
513.456 460.684 LS
548.537 445.523 L
535.655 479.381 L
513.456 460.684 LE
535.655 479.381 LS
548.537 445.523 L
573.136 465.258 L
535.655 479.381 LE
895.034 813.355 LS
909.221 781.734 L
929.864 813.417 L
895.034 813.355 LE
890.181 751.678 LS
909.221 781.734 L
871.327 785.056 L
890.181 751.678 LE
871.327 785.056 LS
909.221 781.734 L
895.034 813.355 L
871.327 785.056 LE
1162.54 492 LS
1132.34 508.148 L
1132.36 477.757 L
1162.54 492 LE
1132.41 541.143 LS
1132.34 508.148 L
1162.54 527.143 L
1132.41 541.143 LE
1162.54 527.143 LS
1132.34 508.148 L
1162.54 492 L
1162.54 527.143 LE
811 140.571 LS
827.153 170.763 L
796.753 170.735 L
811 140.571 LE
860.158 170.694 LS
827.153 170.763 L
846.154 140.571 L
860.158 170.694 LE
846.154 140.571 LS
827.153 170.763 L
811 140.571 L
846.154 140.571 LE
811 140.571 LS
796.753 170.735 L
775.846 140.571 L
811 140.571 LE
775.846 140.571 LS
796.753 170.735 L
761.842 170.694 L
775.846 140.571 LE
1162.54 492 LS
1132.36 477.757 L
1162.54 456.857 L
1162.54 492 LE
1162.54 456.857 LS
1132.36 477.757 L
1132.41 442.857 L
1162.54 456.857 LE
775.846 140.571 LS
761.842 170.694 L
740.693 140.571 L
775.846 140.571 LE
740.693 140.571 LS
761.842 170.694 L
726.966 170.645 L
740.693 140.571 LE
852.663 760.971 LS
890.181 751.678 L
871.327 785.056 L
852.663 760.971 LE
859.754 813.171 LS
871.327 785.056 L
895.034 813.355 L
859.754 813.171 LE
852.663 760.971 LS
871.327 785.056 L
831.547 789.124 L
852.663 760.971 LE
831.547 789.124 LS
871.327 785.056 L
859.754 813.171 L
831.547 789.124 LE
822.09 815.812 LS
831.547 789.124 L
859.754 813.171 L
822.09 815.812 LE
846.154 843.429 LS
822.09 815.812 L
859.754 813.171 L
846.154 843.429 L
859.754 813.171 L
881.307 843.429 L
846.154 843.429 LE
881.307 843.429 LS
859.754 813.171 L
895.034 813.355 L
881.307 843.429 LE
1162.54 456.857 LS
1132.41 442.857 L
1162.54 421.714 L
1162.54 456.857 LE
1162.54 421.714 LS
1132.41 442.857 L
1132.45 407.992 L
1162.54 421.714 LE
486.77 474.517 LS
488.91 442.018 L
513.456 460.684 L
486.77 474.517 LE
459.463 456.857 LS
488.91 442.018 L
486.77 474.517 L
459.463 456.857 LE
489.546 407.992 LS
488.91 442.018 L
459.463 421.714 L
489.546 407.992 LE
459.463 421.714 LS
488.91 442.018 L
459.463 456.857 L
459.463 421.714 LE
1132.45 576.008 LS
1132.41 541.143 L
1162.54 562.286 L
1132.45 576.008 LE
1162.54 562.286 LS
1132.41 541.143 L
1162.54 527.143 L
1162.54 562.286 LE
895.034 170.645 LS
860.158 170.694 L
881.307 140.571 L
895.034 170.645 LE
881.307 140.571 LS
860.158 170.694 L
846.154 140.571 L
881.307 140.571 LE
573.481 780.377 LS
602.883 785.065 L
588.036 813.722 L
573.481 780.377 LE
553.529 813.88 LS
573.481 780.377 L
588.036 813.722 L
553.529 813.88 LE
544.925 784.201 LS
573.481 780.377 L
553.529 813.88 L
544.925 784.201 LE
550.589 756.197 LS
573.481 780.377 L
544.925 784.201 L
550.589 756.197 LE
602.883 785.065 LS
573.481 780.377 L
587.312 744.832 L
602.883 785.065 LE
587.312 744.832 LS
573.481 780.377 L
550.589 756.197 L
587.312 744.832 LE
547.796 727.752 LS
587.312 744.832 L
550.589 756.197 L
547.796 727.752 LE
518.859 769.166 LS
550.589 756.197 L
544.925 784.201 L
518.859 769.166 LE
547.796 727.752 LS
550.589 756.197 L
519.043 735.589 L
547.796 727.752 LE
519.043 735.589 LS
550.589 756.197 L
518.859 769.166 L
519.043 735.589 LE
518.859 769.166 LS
544.925 784.201 L
519.987 814.295 L
518.859 769.166 LE
519.987 814.295 LS
544.925 784.201 L
553.529 813.88 L
519.987 814.295 LE
488.605 782.923 LS
518.859 769.166 L
519.987 814.295 L
488.605 782.923 LE
519.043 735.589 LS
518.859 769.166 L
489.02 749.392 L
519.043 735.589 LE
489.02 749.392 LS
518.859 769.166 L
488.605 782.923 L
489.02 749.392 LE
577.253 710.513 LS
587.312 744.832 L
547.796 727.752 L
577.253 710.513 LE
546.303 696.307 LS
577.253 710.513 L
547.796 727.752 L
546.303 696.307 L
547.796 727.752 L
518.954 701.267 L
546.303 696.307 LE
518.954 701.267 LS
547.796 727.752 L
519.043 735.589 L
518.954 701.267 L
519.043 735.589 L
489.178 714.895 L
518.954 701.267 LE
489.178 714.895 LS
519.043 735.589 L
489.02 749.392 L
489.178 714.895 LE
740.693 140.571 LS
726.966 170.645 L
705.539 140.571 L
740.693 140.571 LE
705.539 140.571 LS
726.966 170.645 L
692.136 170.583 L
705.539 140.571 LE
564.022 675.37 LS
577.253 710.513 L
546.303 696.307 L
564.022 675.37 L
546.303 696.307 L
518.722 666.882 L
564.022 675.37 LE
518.722 666.882 LS
546.303 696.307 L
518.954 701.267 L
518.722 666.882 L
518.954 701.267 L
489.305 680.288 L
518.722 666.882 LE
489.305 680.288 LS
518.954 701.267 L
489.178 714.895 L
489.305 680.288 LE
554.114 639.521 LS
564.022 675.37 L
518.722 666.882 L
554.114 639.521 LE
518.277 632.473 LS
554.114 639.521 L
518.722 666.882 L
518.277 632.473 L
518.722 666.882 L
489.405 645.593 L
518.277 632.473 LE
489.405 645.593 LS
518.722 666.882 L
489.305 680.288 L
489.405 645.593 LE
540.601 604.905 LS
554.114 639.521 L
518.277 632.473 L
540.601 604.905 LE
513.777 599.36 LS
540.601 604.905 L
518.277 632.473 L
513.777 599.36 L
518.277 632.473 L
489.484 610.828 L
513.777 599.36 LE
489.484 610.828 LS
518.277 632.473 L
489.405 645.593 L
489.484 610.828 LE
486.77 474.517 LS
513.456 460.684 L
505.924 499.944 L
486.77 474.517 LE
505.924 499.944 LS
513.456 460.684 L
535.655 479.381 L
505.924 499.944 LE
459.463 492 LS
459.463 456.857 L
486.77 474.517 L
459.463 492 L
486.77 474.517 L
481.879 510.096 L
459.463 492 LE
481.879 510.096 LS
486.77 474.517 L
505.924 499.944 L
481.879 510.096 LE
459.463 527.143 LS
459.463 492 L
481.879 510.096 L
459.463 527.143 L
481.879 510.096 L
484.992 542.422 L
459.463 527.143 LE
484.992 542.422 LS
481.879 510.096 L
505.924 499.944 L
484.992 542.422 LE
459.463 562.286 LS
459.463 527.143 L
484.992 542.422 L
459.463 562.286 LE
513.913 537.343 LS
484.992 542.422 L
505.924 499.944 L
513.913 537.343 LE
459.463 562.286 LS
484.992 542.422 L
489.936 575.954 L
459.463 562.286 LE
489.936 575.954 LS
484.992 542.422 L
513.913 537.343 L
489.936 575.954 LE
527.691 571.949 LS
540.601 604.905 L
513.777 599.36 L
527.691 571.949 L
513.777 599.36 L
489.936 575.954 L
527.691 571.949 LE
489.936 575.954 LS
513.777 599.36 L
489.484 610.828 L
489.936 575.954 LE
527.691 571.949 LS
489.936 575.954 L
513.913 537.343 L
527.691 571.949 LE
459.463 562.286 LS
489.936 575.954 L
459.463 597.429 L
459.463 562.286 LE
459.463 597.429 LS
489.936 575.954 L
489.484 610.828 L
459.463 597.429 LE
881.307 843.429 LS
895.034 813.355 L
916.461 843.429 L
881.307 843.429 LE
916.461 843.429 LS
895.034 813.355 L
929.864 813.417 L
916.461 843.429 LE
1162.54 421.714 LS
1132.45 407.992 L
1162.54 386.571 L
1162.54 421.714 LE
1162.54 386.571 LS
1132.45 407.992 L
1132.52 373.173 L
1162.54 386.571 LE
489.484 373.173 LS
489.546 407.992 L
459.463 386.571 L
489.484 373.173 LE
459.463 386.571 LS
489.546 407.992 L
459.463 421.714 L
459.463 386.571 LE
1132.52 610.828 LS
1132.45 576.008 L
1162.54 597.429 L
1132.52 610.828 LE
1162.54 597.429 LS
1132.45 576.008 L
1162.54 562.286 L
1162.54 597.429 LE
929.864 170.583 LS
895.034 170.645 L
916.461 140.571 L
929.864 170.583 LE
916.461 140.571 LS
895.034 170.645 L
881.307 140.571 L
916.461 140.571 LE
705.539 140.571 LS
692.136 170.583 L
670.385 140.571 L
705.539 140.571 LE
670.385 140.571 LS
692.136 170.583 L
657.36 170.504 L
670.385 140.571 LE
459.463 597.429 LS
489.484 610.828 L
459.463 632.571 L
459.463 597.429 LE
459.463 632.571 LS
489.484 610.828 L
489.405 645.593 L
459.463 632.571 LE
916.461 843.429 LS
929.864 813.417 L
951.615 843.429 L
916.461 843.429 LE
951.615 843.429 LS
929.864 813.417 L
964.64 813.496 L
951.615 843.429 LE
1162.54 386.571 LS
1132.52 373.173 L
1162.54 351.429 L
1162.54 386.571 LE
1162.54 351.429 LS
1132.52 373.173 L
1132.59 338.407 L
1162.54 351.429 LE
489.405 338.407 LS
489.484 373.173 L
459.463 351.429 L
489.405 338.407 LE
459.463 351.429 LS
489.484 373.173 L
459.463 386.571 L
459.463 351.429 LE
1132.59 645.593 LS
1132.52 610.828 L
1162.54 632.571 L
1132.59 645.593 LE
1162.54 632.571 LS
1132.52 610.828 L
1162.54 597.429 L
1162.54 632.571 LE
964.64 170.504 LS
929.864 170.583 L
951.615 140.571 L
964.64 170.504 LE
951.615 140.571 LS
929.864 170.583 L
916.461 140.571 L
951.615 140.571 LE
489.305 303.712 LS
489.405 338.407 L
459.463 316.286 L
489.305 303.712 LE
459.463 316.286 LS
489.405 338.407 L
459.463 351.429 L
459.463 316.286 LE
622.654 813.596 LS
588.036 813.722 L
602.883 785.065 L
622.654 813.596 LE
616.844 757.399 LS
602.883 785.065 L
587.312 744.832 L
616.844 757.399 LE
622.654 813.596 LS
602.883 785.065 L
640.892 788.274 L
622.654 813.596 LE
640.892 788.274 LS
602.883 785.065 L
616.844 757.399 L
640.892 788.274 LE
659.152 812.473 LS
622.654 813.596 L
640.892 788.274 L
659.152 812.473 LE
654.64 763.816 LS
640.892 788.274 L
616.844 757.399 L
654.64 763.816 LE
659.152 812.473 LS
640.892 788.274 L
679.753 779.565 L
659.152 812.473 LE
679.753 779.565 LS
640.892 788.274 L
654.64 763.816 L
679.753 779.565 LE
698.747 806.369 LS
659.152 812.473 L
679.753 779.565 L
698.747 806.369 LE
670.385 843.429 LS
659.152 812.473 L
698.747 806.369 L
670.385 843.429 LE
622.654 813.596 LS
659.152 812.473 L
635.232 843.429 L
622.654 813.596 LE
635.232 843.429 LS
659.152 812.473 L
670.385 843.429 L
635.232 843.429 LE
1132.69 680.288 LS
1132.59 645.593 L
1162.54 667.714 L
1132.69 680.288 LE
1162.54 667.714 LS
1132.59 645.593 L
1162.54 632.571 L
1162.54 667.714 LE
999.346 170.404 LS
964.64 170.504 L
986.768 140.571 L
999.346 170.404 LE
986.768 140.571 LS
964.64 170.504 L
951.615 140.571 L
986.768 140.571 LE
670.385 140.571 LS
657.36 170.504 L
635.232 140.571 L
670.385 140.571 LE
635.232 140.571 LS
657.36 170.504 L
622.654 170.404 L
635.232 140.571 LE
459.463 632.571 LS
489.405 645.593 L
459.463 667.714 L
459.463 632.571 LE
459.463 667.714 LS
489.405 645.593 L
489.305 680.288 L
459.463 667.714 LE
951.615 843.429 LS
964.64 813.496 L
986.768 843.429 L
951.615 843.429 LE
986.768 843.429 LS
964.64 813.496 L
999.346 813.596 L
986.768 843.429 LE
1162.54 351.429 LS
1132.59 338.407 L
1162.54 316.286 L
1162.54 351.429 LE
1162.54 316.286 LS
1132.59 338.407 L
1132.69 303.712 L
1162.54 316.286 LE
635.232 140.571 LS
622.654 170.404 L
600.078 140.571 L
635.232 140.571 LE
600.078 140.571 LS
622.654 170.404 L
588.036 170.278 L
600.078 140.571 LE
459.463 667.714 LS
489.305 680.288 L
459.463 702.857 L
459.463 667.714 LE
459.463 702.857 LS
489.305 680.288 L
489.178 714.895 L
459.463 702.857 LE
986.768 843.429 LS
999.346 813.596 L
1021.92 843.429 L
986.768 843.429 LE
1021.92 843.429 LS
999.346 813.596 L
1033.96 813.722 L
1021.92 843.429 LE
1162.54 316.286 LS
1132.69 303.712 L
1162.54 281.143 L
1162.54 316.286 LE
1162.54 281.143 LS
1132.69 303.712 L
1132.82 269.105 L
1162.54 281.143 LE
489.178 269.105 LS
489.305 303.712 L
459.463 281.143 L
489.178 269.105 LE
459.463 281.143 LS
489.305 303.712 L
459.463 316.286 L
459.463 281.143 LE
588.036 813.722 LS
622.654 813.596 L
600.078 843.429 L
588.036 813.722 LE
600.078 843.429 LS
622.654 813.596 L
635.232 843.429 L
600.078 843.429 LE
1132.82 714.895 LS
1132.69 680.288 L
1162.54 702.857 L
1132.82 714.895 LE
1162.54 702.857 LS
1132.69 680.288 L
1162.54 667.714 L
1162.54 702.857 LE
1033.96 170.278 LS
999.346 170.404 L
1021.92 140.571 L
1033.96 170.278 LE
1021.92 140.571 LS
999.346 170.404 L
986.768 140.571 L
1021.92 140.571 LE
811 843.429 LS
822.09 815.812 L
846.154 843.429 L
811 843.429 LE
791.267 816.073 LS
822.09 815.812 L
811 843.429 L
791.267 816.073 LE
831.547 789.124 LS
822.09 815.812 L
796.402 785.462 L
831.547 789.124 LE
796.402 785.462 LS
822.09 815.812 L
791.267 816.073 L
796.402 785.462 LE
775.846 843.429 LS
791.267 816.073 L
811 843.429 L
775.846 843.429 LE
757.776 821.102 LS
791.267 816.073 L
775.846 843.429 L
757.776 821.102 LE
796.402 785.462 LS
791.267 816.073 L
762.856 794.67 L
796.402 785.462 LE
762.856 794.67 LS
791.267 816.073 L
757.776 821.102 L
762.856 794.67 LE
600.078 140.571 LS
588.036 170.278 L
564.924 140.571 L
600.078 140.571 LE
564.924 140.571 LS
588.036 170.278 L
553.529 170.12 L
564.924 140.571 LE
459.463 702.857 LS
489.178 714.895 L
459.463 738 L
459.463 702.857 LE
459.463 738 LS
489.178 714.895 L
489.02 749.392 L
459.463 738 LE
1021.92 843.429 LS
1033.96 813.722 L
1057.08 843.429 L
1021.92 843.429 LE
1057.08 843.429 LS
1033.96 813.722 L
1068.47 813.88 L
1057.08 843.429 LE
1162.54 281.143 LS
1132.82 269.105 L
1162.54 246 L
1162.54 281.143 LE
1162.54 246 LS
1132.82 269.105 L
1132.98 234.608 L
1162.54 246 LE
489.02 234.608 LS
489.178 269.105 L
459.463 246 L
489.02 234.608 LE
459.463 246 LS
489.178 269.105 L
459.463 281.143 L
459.463 246 LE
553.529 813.88 LS
588.036 813.722 L
564.924 843.429 L
553.529 813.88 LE
564.924 843.429 LS
588.036 813.722 L
600.078 843.429 L
564.924 843.429 LE
1132.98 749.392 LS
1132.82 714.895 L
1162.54 738 L
1132.98 749.392 LE
1162.54 738 LS
1132.82 714.895 L
1162.54 702.857 L
1162.54 738 LE
1068.47 170.12 LS
1033.96 170.278 L
1057.08 140.571 L
1068.47 170.12 LE
1057.08 140.571 LS
1033.96 170.278 L
1021.92 140.571 L
1057.08 140.571 LE
564.924 140.571 LS
553.529 170.12 L
529.77 140.571 L
564.924 140.571 LE
529.77 140.571 LS
553.529 170.12 L
519.987 169.705 L
529.77 140.571 LE
459.463 738 LS
489.02 749.392 L
459.463 773.143 L
459.463 738 LE
459.463 773.143 LS
489.02 749.392 L
488.605 782.923 L
459.463 773.143 LE
1057.08 843.429 LS
1068.47 813.88 L
1092.23 843.429 L
1057.08 843.429 LE
1092.23 843.429 LS
1068.47 813.88 L
1102.01 814.295 L
1092.23 843.429 LE
1162.54 246 LS
1132.98 234.608 L
1162.54 210.857 L
1162.54 246 LE
1162.54 210.857 LS
1132.98 234.608 L
1133.39 201.077 L
1162.54 210.857 LE
488.605 201.077 LS
489.02 234.608 L
459.463 210.857 L
488.605 201.077 LE
459.463 210.857 LS
489.02 234.608 L
459.463 246 L
459.463 210.857 LE
519.987 814.295 LS
553.529 813.88 L
529.77 843.429 L
519.987 814.295 LE
529.77 843.429 LS
553.529 813.88 L
564.924 843.429 L
529.77 843.429 LE
1133.39 782.923 LS
1132.98 749.392 L
1162.54 773.143 L
1133.39 782.923 LE
1162.54 773.143 LS
1132.98 749.392 L
1162.54 738 L
1162.54 773.143 LE
1102.01 169.705 LS
1068.47 170.12 L
1092.23 140.571 L
1102.01 169.705 LE
1092.23 140.571 LS
1068.47 170.12 L
1057.08 140.571 L
1092.23 140.571 LE
488.006 169.106 LS
519.987 169.705 L
488.605 201.077 L
488.006 169.106 LE
529.77 140.571 LS
519.987 169.705 L
494.617 140.571 L
529.77 140.571 LE
494.617 140.571 LS
519.987 169.705 L
488.006 169.106 L
494.617 140.571 LE
488.006 814.894 LS
488.605 782.923 L
519.987 814.295 L
488.006 814.894 LE
459.463 773.143 LS
488.605 782.923 L
459.463 808.286 L
459.463 773.143 LE
459.463 808.286 LS
488.605 782.923 L
488.006 814.894 L
459.463 808.286 LE
1133.99 814.894 LS
1102.01 814.295 L
1133.39 782.923 L
1133.99 814.894 LE
1092.23 843.429 LS
1102.01 814.295 L
1127.38 843.429 L
1092.23 843.429 LE
1127.38 843.429 LS
1102.01 814.295 L
1133.99 814.894 L
1127.38 843.429 LE
1133.99 169.106 LS
1133.39 201.077 L
1102.01 169.705 L
1133.99 169.106 LE
1162.54 210.857 LS
1133.39 201.077 L
1162.54 175.714 L
1162.54 210.857 LE
1162.54 175.714 LS
1133.39 201.077 L
1133.99 169.106 L
1162.54 175.714 LE
488.006 169.106 LS
488.605 201.077 L
459.463 175.714 L
488.006 169.106 LE
459.463 175.714 LS
488.605 201.077 L
459.463 210.857 L
459.463 175.714 LE
488.006 814.894 LS
519.987 814.295 L
494.617 843.429 L
488.006 814.894 LE
494.617 843.429 LS
519.987 814.295 L
529.77 843.429 L
494.617 843.429 LE
1133.99 814.894 LS
1133.39 782.923 L
1162.54 808.286 L
1133.99 814.894 LE
1162.54 808.286 LS
1133.39 782.923 L
1162.54 773.143 L
1162.54 808.286 LE
1133.99 169.106 LS
1102.01 169.705 L
1127.38 140.571 L
1133.99 169.106 LE
1127.38 140.571 LS
1102.01 169.705 L
1092.23 140.571 L
1127.38 140.571 LE
740.693 843.429 LS
757.776 821.102 L
775.846 843.429 L
740.693 843.429 LE
727.118 822.359 LS
757.776 821.102 L
740.693 843.429 L
727.118 822.359 LE
762.856 794.67 LS
757.776 821.102 L
727.655 796.919 L
762.856 794.67 LE
727.655 796.919 LS
757.776 821.102 L
727.118 822.359 L
727.655 796.919 LE
705.539 843.429 LS
727.118 822.359 L
740.693 843.429 L
705.539 843.429 LE
727.655 796.919 LS
727.118 822.359 L
698.747 806.369 L
727.655 796.919 LE
698.747 806.369 LS
727.118 822.359 L
705.539 843.429 L
698.747 806.369 LE
494.617 140.571 LS
488.006 169.106 L
459.463 140.571 L
494.617 140.571 LE
459.463 140.571 LS
488.006 169.106 L
459.463 175.714 L
459.463 140.571 LE
459.463 808.286 LS
488.006 814.894 L
459.463 843.429 L
459.463 808.286 LE
459.463 843.429 LS
488.006 814.894 L
494.617 843.429 L
459.463 843.429 LE
1127.38 843.429 LS
1133.99 814.894 L
1162.54 843.429 L
1127.38 843.429 LE
1162.54 843.429 LS
1133.99 814.894 L
1162.54 808.286 L
1162.54 843.429 LE
1162.54 175.714 LS
1133.99 169.106 L
1162.54 140.571 L
1162.54 175.714 LE
1162.54 140.571 LS
1133.99 169.106 L
1127.38 140.571 L
1162.54 140.571 LE
705.539 843.429 LS
670.385 843.429 L
698.747 806.369 L
705.539 843.429 LE
727.655 796.919 LS
698.747 806.369 L
706.639 768.151 L
727.655 796.919 LE
706.639 768.151 LS
698.747 806.369 L
679.753 779.565 L
706.639 768.151 L
679.753 779.565 L
681.087 739.506 L
706.639 768.151 LE
681.087 739.506 LS
679.753 779.565 L
654.64 763.816 L
681.087 739.506 L
654.64 763.816 L
641.415 732.834 L
681.087 739.506 LE
641.415 732.834 LS
654.64 763.816 L
616.844 757.399 L
641.415 732.834 L
616.844 757.399 L
613.624 720.603 L
641.415 732.834 LE
613.624 720.603 LS
616.844 757.399 L
587.312 744.832 L
613.624 720.603 L
587.312 744.832 L
577.253 710.513 L
613.624 720.603 L
577.253 710.513 L
598.491 687.821 L
613.624 720.603 LE
598.491 687.821 LS
577.253 710.513 L
564.022 675.37 L
598.491 687.821 L
564.022 675.37 L
590.497 648.718 L
598.491 687.821 LE
590.497 648.718 LS
564.022 675.37 L
554.114 639.521 L
590.497 648.718 L
554.114 639.521 L
577.377 613.953 L
590.497 648.718 LE
577.377 613.953 LS
554.114 639.521 L
540.601 604.905 L
577.377 613.953 L
540.601 604.905 L
565.019 581.168 L
577.377 613.953 LE
565.019 581.168 LS
540.601 604.905 L
527.691 571.949 L
565.019 581.168 L
527.691 571.949 L
551.996 546.58 L
565.019 581.168 LE
551.996 546.58 LS
527.691 571.949 L
513.913 537.343 L
551.996 546.58 L
513.913 537.343 L
536.775 518.786 L
551.996 546.58 LE
536.775 518.786 LS
513.913 537.343 L
505.924 499.944 L
536.775 518.786 L
505.924 499.944 L
535.655 479.381 L
536.775 518.786 L
535.655 479.381 L
558.962 493.594 L
536.775 518.786 LE
558.962 493.594 LS
535.655 479.381 L
573.136 465.258 L
558.962 493.594 LE
600.225 397.155 LS
591.702 358.987 L
617.808 365.982 L
600.225 397.155 LE
617.808 365.982 LS
591.702 358.987 L
626.499 338.595 L
617.808 365.982 LE
551.996 546.58 LS
536.775 518.786 L
575.143 520.845 L
551.996 546.58 LE
575.143 520.845 LS
536.775 518.786 L
558.962 493.594 L
575.143 520.845 L
558.962 493.594 L
598.102 492.207 L
575.143 520.845 LE
598.102 492.207 LS
558.962 493.594 L
573.136 465.258 L
598.102 492.207 L
573.136 465.258 L
602.987 455.396 L
598.102 492.207 LE
602.987 455.396 LS
573.136 465.258 L
583.821 428.811 L
602.987 455.396 L
583.821 428.811 L
619.147 423.318 L
602.987 455.396 LE
619.147 423.318 LS
583.821 428.811 L
600.225 397.155 L
619.147 423.318 L
600.225 397.155 L
635.117 388.903 L
619.147 423.318 LE
635.117 388.903 LS
600.225 397.155 L
617.808 365.982 L
635.117 388.903 L
617.808 365.982 L
657.68 359.095 L
635.117 388.903 LE
657.68 359.095 LS
617.808 365.982 L
626.499 338.595 L
657.68 359.095 L
626.499 338.595 L
653.672 313.023 L
657.68 359.095 LE
683.178 333.478 LS
657.68 359.095 L
653.672 313.023 L
683.178 333.478 L
653.672 313.023 L
684.837 295.193 L
683.178 333.478 L
684.837 295.193 L
711.189 313.436 L
683.178 333.478 LE
711.189 313.436 LS
684.837 295.193 L
713.532 273.689 L
711.189 313.436 L
713.532 273.689 L
733.686 293.471 L
711.189 313.436 LE
733.686 293.471 LS
713.532 273.689 L
750.012 260.588 L
733.686 293.471 LE
823.295 261.222 LS
855.783 239.486 L
858.691 266.406 L
823.295 261.222 LE
858.691 266.406 LS
855.783 239.486 L
887.322 264.587 L
858.691 266.406 LE
733.686 293.471 LS
750.012 260.588 L
770.045 284.873 L
733.686 293.471 LE
770.045 284.873 LS
750.012 260.588 L
787.848 257.374 L
770.045 284.873 L
787.848 257.374 L
805.801 288.34 L
770.045 284.873 LE
805.801 288.34 LS
787.848 257.374 L
823.295 261.222 L
805.801 288.34 L
823.295 261.222 L
843.652 290.812 L
805.801 288.34 LE
843.652 290.812 LS
823.295 261.222 L
858.691 266.406 L
843.652 290.812 L
858.691 266.406 L
879.596 301.071 L
843.652 290.812 LE
879.596 301.071 LS
858.691 266.406 L
887.322 264.587 L
879.596 301.071 L
887.322 264.587 L
920.99 280.644 L
879.596 301.071 LE
912.678 315.558 LS
879.596 301.071 L
920.99 280.644 L
912.678 315.558 L
920.99 280.644 L
948.928 303.183 L
912.678 315.558 L
948.928 303.183 L
941.448 334.465 L
912.678 315.558 LE
941.448 334.465 LS
948.928 303.183 L
979.288 322.141 L
941.448 334.465 L
979.288 322.141 L
968.156 348.152 L
941.448 334.465 LE
968.156 348.152 LS
979.288 322.141 L
1004.65 351.373 L
968.156 348.152 LE
1030.7 419.775 LS
1062.68 442.202 L
1038.56 454.601 L
1030.7 419.775 LE
1038.56 454.601 LS
1062.68 442.202 L
1050.55 480.614 L
1038.56 454.601 LE
968.156 348.152 LS
1004.65 351.373 L
989.289 378.926 L
968.156 348.152 LE
989.289 378.926 LS
1004.65 351.373 L
1021.39 385.395 L
989.289 378.926 L
1021.39 385.395 L
999.065 413.457 L
989.289 378.926 LE
999.065 413.457 LS
1021.39 385.395 L
1030.7 419.775 L
999.065 413.457 L
1030.7 419.775 L
1010.37 449.563 L
999.065 413.457 LE
1010.37 449.563 LS
1030.7 419.775 L
1038.56 454.601 L
1010.37 449.563 L
1038.56 454.601 L
1013.88 486.711 L
1010.37 449.563 LE
1013.88 486.711 LS
1038.56 454.601 L
1050.55 480.614 L
1013.88 486.711 L
1050.55 480.614 L
1048.91 517.747 L
1013.88 486.711 LE
1012.45 522.62 LS
1013.88 486.711 L
1048.91 517.747 L
1012.45 522.62 L
1048.91 517.747 L
1041.25 553.715 L
1012.45 522.62 LE
1005.01 556.146 LS
1012.45 522.62 L
1041.25 553.715 L
1005.01 556.146 L
1041.25 553.715 L
1029.47 588.066 L
1005.01 556.146 L
1029.47 588.066 L
1002.16 585.672 L
1005.01 556.146 LE
1002.16 585.672 LS
1029.47 588.066 L
1010.89 622.421 L
1002.16 585.672 L
1010.89 622.421 L
981.004 616.253 L
1002.16 585.672 LE
981.004 616.253 LS
1010.89 622.421 L
984.273 650.237 L
981.004 616.253 LE
895.688 713.746 LS
890.181 751.678 L
868.201 732.305 L
895.688 713.746 LE
868.201 732.305 LS
890.181 751.678 L
852.663 760.971 L
868.201 732.305 LE
981.004 616.253 LS
984.273 650.237 L
952.445 637.391 L
981.004 616.253 LE
952.445 637.391 LS
984.273 650.237 L
955.656 671.253 L
952.445 637.391 L
955.656 671.253 L
922.49 660.851 L
952.445 637.391 LE
922.49 660.851 LS
955.656 671.253 L
926.062 694.326 L
922.49 660.851 L
926.062 694.326 L
891.808 680.329 L
922.49 660.851 LE
891.808 680.329 LS
926.062 694.326 L
895.688 713.746 L
891.808 680.329 L
895.688 713.746 L
866.227 699.436 L
891.808 680.329 LE
866.227 699.436 LS
895.688 713.746 L
868.201 732.305 L
866.227 699.436 L
868.201 732.305 L
831.974 720.355 L
866.227 699.436 LE
831.974 720.355 LS
868.201 732.305 L
852.663 760.971 L
831.974 720.355 LE
817.736 756.61 LS
831.974 720.355 L
852.663 760.971 L
817.736 756.61 L
852.663 760.971 L
831.547 789.124 L
817.736 756.61 L
831.547 789.124 L
796.402 785.462 L
817.736 756.61 L
796.402 785.462 L
780.512 751.054 L
817.736 756.61 LE
780.512 751.054 LS
796.402 785.462 L
762.856 794.67 L
780.512 751.054 LE
743.656 765.09 LS
780.512 751.054 L
762.856 794.67 L
743.656 765.09 L
762.856 794.67 L
727.655 796.919 L
743.656 765.09 L
727.655 796.919 L
706.639 768.151 L
743.656 765.09 L
706.639 768.151 L
717.039 734.934 L
743.656 765.09 LE
717.039 734.934 LS
706.639 768.151 L
681.087 739.506 L
717.039 734.934 LE
780.512 751.054 LS
743.656 765.09 L
747.599 738.156 L
780.512 751.054 LE
747.599 738.156 LS
743.656 765.09 L
717.039 734.934 L
747.599 738.156 LE
831.974 720.355 LS
817.736 756.61 L
804.852 729.752 L
831.974 720.355 LE
804.852 729.752 LS
817.736 756.61 L
780.512 751.054 L
804.852 729.752 L
780.512 751.054 L
770.657 718.208 L
804.852 729.752 LE
770.657 718.208 LS
780.512 751.054 L
747.599 738.156 L
770.657 718.208 L
747.599 738.156 L
734.49 701.098 L
770.657 718.208 LE
734.49 701.098 LS
747.599 738.156 L
717.039 734.934 L
734.49 701.098 L
717.039 734.934 L
699.003 704.651 L
734.49 701.098 LE
699.003 704.651 LS
717.039 734.934 L
681.087 739.506 L
699.003 704.651 L
681.087 739.506 L
666.715 716.514 L
699.003 704.651 LE
666.715 716.514 LS
681.087 739.506 L
641.415 732.834 L
666.715 716.514 L
641.415 732.834 L
637.362 693.391 L
666.715 716.514 LE
637.362 693.391 LS
641.415 732.834 L
613.624 720.603 L
637.362 693.391 L
613.624 720.603 L
598.491 687.821 L
637.362 693.391 L
598.491 687.821 L
616.537 667.284 L
637.362 693.391 LE
616.537 667.284 LS
598.491 687.821 L
590.497 648.718 L
616.537 667.284 LE
699.003 704.651 LS
666.715 716.514 L
667.687 684.44 L
699.003 704.651 LE
667.687 684.44 LS
666.715 716.514 L
637.362 693.391 L
667.687 684.44 L
637.362 693.391 L
646.537 655.967 L
667.687 684.44 LE
646.537 655.967 LS
637.362 693.391 L
616.537 667.284 L
646.537 655.967 L
616.537 667.284 L
621.747 628.6 L
646.537 655.967 LE
621.747 628.6 LS
616.537 667.284 L
590.497 648.718 L
621.747 628.6 L
590.497 648.718 L
577.377 613.953 L
621.747 628.6 LE
599.303 586.621 LS
621.747 628.6 L
577.377 613.953 L
599.303 586.621 L
577.377 613.953 L
565.019 581.168 L
599.303 586.621 L
565.019 581.168 L
586.238 551.679 L
599.303 586.621 LE
586.238 551.679 LS
565.019 581.168 L
551.996 546.58 L
586.238 551.679 L
551.996 546.58 L
575.143 520.845 L
586.238 551.679 L
575.143 520.845 L
608.385 520.552 L
586.238 551.679 LE
608.385 520.552 LS
575.143 520.845 L
598.102 492.207 L
608.385 520.552 LE
599.303 586.621 LS
586.238 551.679 L
616.989 553.905 L
599.303 586.621 LE
616.989 553.905 LS
586.238 551.679 L
608.385 520.552 L
616.989 553.905 LE
635.414 595.545 LS
621.747 628.6 L
599.303 586.621 L
635.414 595.545 L
599.303 586.621 L
616.989 553.905 L
635.414 595.545 LE
648.834 559.778 LS
635.414 595.545 L
616.989 553.905 L
648.834 559.778 L
616.989 553.905 L
638.588 526.173 L
648.834 559.778 LE
638.588 526.173 LS
616.989 553.905 L
608.385 520.552 L
638.588 526.173 L
608.385 520.552 L
635.233 491.202 L
638.588 526.173 LE
635.233 491.202 LS
608.385 520.552 L
598.102 492.207 L
635.233 491.202 L
598.102 492.207 L
602.987 455.396 L
635.233 491.202 LE
638.905 456.264 LS
635.233 491.202 L
602.987 455.396 L
638.905 456.264 L
602.987 455.396 L
619.147 423.318 L
638.905 456.264 L
619.147 423.318 L
649.456 422.753 L
638.905 456.264 LE
649.456 422.753 LS
619.147 423.318 L
635.117 388.903 L
649.456 422.753 L
635.117 388.903 L
666.464 392.011 L
649.456 422.753 LE
666.464 392.011 LS
635.117 388.903 L
657.68 359.095 L
666.464 392.011 L
657.68 359.095 L
689.25 365.266 L
666.464 392.011 LE
689.25 365.266 LS
657.68 359.095 L
683.178 333.478 L
689.25 365.266 L
683.178 333.478 L
716.903 343.586 L
689.25 365.266 LE
716.903 343.586 LS
683.178 333.478 L
711.189 313.436 L
716.903 343.586 L
711.189 313.436 L
748.317 327.839 L
716.903 343.586 LE
748.317 327.839 LS
711.189 313.436 L
733.686 293.471 L
748.317 327.839 L
733.686 293.471 L
770.045 284.873 L
748.317 327.839 LE
782.236 318.655 LS
748.317 327.839 L
770.045 284.873 L
782.236 318.655 L
770.045 284.873 L
805.801 288.34 L
782.236 318.655 L
805.801 288.34 L
817.305 316.399 L
782.236 318.655 LE
817.305 316.399 LS
805.801 288.34 L
843.652 290.812 L
817.305 316.399 L
843.652 290.812 L
852.123 321.162 L
817.305 316.399 LE
852.123 321.162 LS
843.652 290.812 L
879.596 301.071 L
852.123 321.162 L
879.596 301.071 L
885.296 332.755 L
852.123 321.162 LE
885.296 332.755 LS
879.596 301.071 L
912.678 315.558 L
885.296 332.755 L
912.678 315.558 L
915.5 350.713 L
885.296 332.755 LE
915.5 350.713 LS
912.678 315.558 L
941.448 334.465 L
915.5 350.713 L
941.448 334.465 L
941.527 374.319 L
915.5 350.713 LE
941.527 374.319 LS
941.448 334.465 L
968.156 348.152 L
941.527 374.319 L
968.156 348.152 L
989.289 378.926 L
941.527 374.319 LE
962.335 402.629 LS
941.527 374.319 L
989.289 378.926 L
962.335 402.629 L
989.289 378.926 L
999.065 413.457 L
962.335 402.629 L
999.065 413.457 L
977.095 434.511 L
962.335 402.629 LE
977.095 434.511 LS
999.065 413.457 L
1010.37 449.563 L
977.095 434.511 L
1010.37 449.563 L
985.215 468.691 L
977.095 434.511 LE
985.215 468.691 LS
1010.37 449.563 L
1013.88 486.711 L
985.215 468.691 L
1013.88 486.711 L
986.371 503.803 L
985.215 468.691 LE
986.371 503.803 LS
1013.88 486.711 L
1012.45 522.62 L
986.371 503.803 L
1012.45 522.62 L
980.518 538.444 L
986.371 503.803 LE
980.518 538.444 LS
1012.45 522.62 L
1005.01 556.146 L
980.518 538.444 L
1005.01 556.146 L
967.888 571.227 L
980.518 538.444 LE
967.888 571.227 LS
1005.01 556.146 L
1002.16 585.672 L
967.888 571.227 L
1002.16 585.672 L
981.004 616.253 L
967.888 571.227 LE
948.986 600.844 LS
967.888 571.227 L
981.004 616.253 L
948.986 600.844 L
981.004 616.253 L
952.445 637.391 L
948.986 600.844 L
952.445 637.391 L
922.673 627.692 L
948.986 600.844 LE
922.673 627.692 LS
952.445 637.391 L
922.49 660.851 L
922.673 627.692 L
922.49 660.851 L
892.286 647.796 L
922.673 627.692 LE
892.286 647.796 LS
922.49 660.851 L
891.808 680.329 L
892.286 647.796 L
891.808 680.329 L
858.075 661.295 L
892.286 647.796 LE
858.075 661.295 LS
891.808 680.329 L
866.227 699.436 L
858.075 661.295 L
866.227 699.436 L
839.378 692.975 L
858.075 661.295 LE
839.378 692.975 LS
866.227 699.436 L
831.974 720.355 L
839.378 692.975 L
831.974 720.355 L
801.311 693.845 L
839.378 692.975 LE
801.311 693.845 LS
831.974 720.355 L
804.852 729.752 L
801.311 693.845 L
804.852 729.752 L
770.657 718.208 L
801.311 693.845 L
770.657 718.208 L
764.607 691.095 L
801.311 693.845 LE
764.607 691.095 LS
770.657 718.208 L
734.49 701.098 L
764.607 691.095 LE
858.075 661.295 LS
839.378 692.975 L
821.53 667.399 L
858.075 661.295 LE
821.53 667.399 LS
839.378 692.975 L
801.311 693.845 L
821.53 667.399 L
801.311 693.845 L
784.38 665.687 L
821.53 667.399 LE
784.38 665.687 LS
801.311 693.845 L
764.607 691.095 L
784.38 665.687 L
764.607 691.095 L
748.469 656.219 L
784.38 665.687 LE
748.469 656.219 LS
764.607 691.095 L
734.49 701.098 L
748.469 656.219 LE
715.217 671.099 LS
748.469 656.219 L
734.49 701.098 L
715.217 671.099 L
734.49 701.098 L
699.003 704.651 L
715.217 671.099 L
699.003 704.651 L
667.687 684.44 L
715.217 671.099 LE
682.834 652.37 LS
715.217 671.099 L
667.687 684.44 L
682.834 652.37 L
667.687 684.44 L
646.537 655.967 L
682.834 652.37 L
646.537 655.967 L
657.445 626.214 L
682.834 652.37 LE
657.445 626.214 LS
646.537 655.967 L
621.747 628.6 L
657.445 626.214 L
621.747 628.6 L
635.414 595.545 L
657.445 626.214 L
635.414 595.545 L
665.562 590.673 L
657.445 626.214 LE
665.562 590.673 LS
635.414 595.545 L
648.834 559.778 L
665.562 590.673 LE
748.469 656.219 LS
715.217 671.099 L
715.569 639.56 L
748.469 656.219 LE
715.569 639.56 LS
715.217 671.099 L
682.834 652.37 L
715.569 639.56 LE
682.834 652.37 LS
657.445 626.214 L
688.104 617.624 L
682.834 652.37 LE
688.104 617.624 LS
657.445 626.214 L
665.562 590.673 L
688.104 617.624 LE
715.569 639.56 LS
682.834 652.37 L
688.104 617.624 L
715.569 639.56 LE
1 0.109804 0.705882 C


686.365 352.641 LS
716.246 334.13 LE
660.773 376.717 LS
686.365 352.641 LE
640.483 405.401 LS
660.773 376.717 LE
626.308 437.547 LS
640.483 405.401 LE
618.811 471.87 LS
626.308 437.547 LE
618.296 506.997 LS
618.811 471.87 LE
624.78 541.525 LS
618.296 506.997 LE
638.006 574.073 LS
624.78 541.525 LE
657.444 603.34 LS
638.006 574.073 LE
682.318 628.157 LS
657.444 603.34 LE
711.633 647.531 LS
682.318 628.157 LE
744.217 660.688 LS
711.633 647.531 LE
778.768 667.102 LS
744.217 660.688 LE
813.906 666.517 LS
778.768 667.102 LE
848.224 658.956 LS
813.906 666.517 LE
880.352 644.721 LS
848.224 658.956 LE
909.005 624.381 moveto
880.352 644.721 Lineto^ stroke
933.037 598.749 moveto
909.005 624.381 Lineto^ stroke
951.489 568.851 moveto
933.037 598.749 Lineto^ stroke
963.623 535.88 moveto
951.489 568.851 Lineto^ stroke
968.953 501.156 moveto
963.623 535.88 Lineto^ stroke
967.267 466.065 moveto
968.953 501.156 Lineto^ stroke
958.631 432.011 moveto
967.267 466.065 Lineto^ stroke
943.392 400.355 moveto
958.631 432.011 Lineto^ stroke
920.464 370.566 moveto
943.392 400.355 Lineto^ stroke
892.687 346.989 moveto
920.464 370.566 Lineto^ stroke
860.327 329.513 moveto
892.687 346.989 Lineto^ stroke
824.769 319.103 LS
860.327 329.513 LE
787.68 316.38 LS
824.769 319.103 LE
750.896 321.506 LS
787.68 316.38 LE
716.246 334.13 LS
750.896 321.506 LE
748.469 656.219 LS
715.569 639.56 LE
784.38 665.687 LS
748.469 656.219 LE
821.53 667.399 LS
784.38 665.687 LE
858.075 661.295 LS
821.53 667.399 LE
892.286 647.796 LS
858.075 661.295 LE
892.286 647.796 moveto
922.673 627.692 Lineto^ stroke
922.673 627.692 moveto
948.986 600.844 Lineto^ stroke
948.986 600.844 moveto
967.888 571.227 Lineto^ stroke
967.888 571.227 moveto
980.518 538.444 Lineto^ stroke
980.518 538.444 moveto
986.371 503.803 Lineto^ stroke
986.371 503.803 moveto
985.215 468.691 Lineto^ stroke
985.215 468.691 moveto
977.095 434.511 Lineto^ stroke
977.095 434.511 moveto
962.335 402.629 Lineto^ stroke
962.335 402.629 moveto
941.527 374.319 Lineto^ stroke
941.527 374.319 moveto
915.5 350.713 Lineto^ stroke
885.296 332.755 LS
915.5 350.713 LE
852.123 321.162 LS
885.296 332.755 LE
817.305 316.399 LS
852.123 321.162 LE
782.236 318.655 LS
817.305 316.399 LE
748.317 327.839 LS
782.236 318.655 LE
716.903 343.586 LS
748.317 327.839 LE
689.25 365.266 LS
716.903 343.586 LE
666.464 392.011 LS
689.25 365.266 LE
649.456 422.753 LS
666.464 392.011 LE
638.905 456.264 LS
649.456 422.753 LE
635.233 491.202 LS
638.905 456.264 LE
638.588 526.173 LS
635.233 491.202 LE
648.834 559.778 LS
638.588 526.173 LE
665.562 590.673 LS
648.834 559.778 LE
688.104 617.624 LS
665.562 590.673 LE
715.569 639.56 moveto
688.104 617.624  Lineto^ stroke

0.25 0.45 1 setrgbcolor

910 503 moveto currentpoint exch 7 add exch
7 180 500 arc
currentlinewidth -11 -3 rArrowHead stroke

921 519 moveto currentpoint exch 7 add exch
7 180 500 arc
currentlinewidth -11 -3 rArrowHead stroke

905 532 moveto currentpoint exch 7 add exch
7 180 500 arc
currentlinewidth -11 -3 rArrowHead stroke

913 547 moveto currentpoint exch 7 add exch
7 180 500 arc
currentlinewidth -11 -3 rArrowHead stroke

929 554 moveto currentpoint exch 7 add exch
7 180 500 arc
currentlinewidth -11 -3 rArrowHead stroke

929 574 moveto currentpoint exch 7 add exch
7 180 500 arc
currentlinewidth -11 -3 rArrowHead stroke

915 581 moveto currentpoint exch 7 add exch
7 180 500 arc
currentlinewidth -11 -3 rArrowHead stroke

904 564 moveto currentpoint exch 7 add exch
7 180 500 arc
currentlinewidth -11 -3 rArrowHead stroke

886 567 moveto currentpoint exch 7 add exch
7 180 500 arc
currentlinewidth -11 -3 rArrowHead stroke

944 544 moveto currentpoint exch 7 add exch
7 180 500 arc
currentlinewidth -11 -3 rArrowHead stroke

939 524 moveto currentpoint exch 7 add exch
7 180 500 arc
currentlinewidth -11 -3 rArrowHead stroke

951 512 moveto currentpoint exch 7 add exch
7 180 500 arc
currentlinewidth -11 -3 rArrowHead stroke

942 493 moveto currentpoint exch 7 add exch
7 180 500 arc
currentlinewidth -11 -3 rArrowHead stroke

952 479 moveto currentpoint exch 7 add exch
7 180 500 arc
currentlinewidth -11 -3 rArrowHead stroke

940 462 moveto currentpoint exch 7 add exch
7 180 500 arc
currentlinewidth -11 -3 rArrowHead stroke

946 445 moveto currentpoint exch 7 add exch
7 180 500 arc
currentlinewidth -11 -3 rArrowHead stroke

930 432 moveto currentpoint exch 7 add exch
7 180 500 arc
currentlinewidth -11 -3 rArrowHead stroke

933 415 moveto currentpoint exch 7 add exch
7 180 500 arc
currentlinewidth -11 -3 rArrowHead stroke

925 489 moveto currentpoint exch 7 add exch
7 180 500 arc
currentlinewidth -11 -3 rArrowHead stroke

911 472 moveto currentpoint exch 7 add exch
7 180 500 arc
currentlinewidth -11 -3 rArrowHead stroke

920 457 moveto currentpoint exch 7 add exch
7 180 500 arc
currentlinewidth -11 -3 rArrowHead stroke

914 440 moveto currentpoint exch 7 add exch
7 180 500 arc
currentlinewidth -11 -3 rArrowHead stroke

959 597 moveto currentpoint exch 7 add exch
7 180 500 arc
currentlinewidth -11 -3 rArrowHead stroke

978 590 moveto currentpoint exch 7 add exch
7 180 500 arc
currentlinewidth -11 -3 rArrowHead stroke

986 571 moveto currentpoint exch 7 add exch
7 180 500 arc
currentlinewidth -11 -3 rArrowHead stroke

978 554 moveto currentpoint exch 7 add exch
7 180 500 arc
currentlinewidth -11 -3 rArrowHead stroke

992 540 moveto currentpoint exch 7 add exch
7 180 500 arc
currentlinewidth -11 -3 rArrowHead stroke

955 618 moveto currentpoint exch 7 add exch
7 180 500 arc
currentlinewidth -11 -3 rArrowHead stroke

934 622 moveto currentpoint exch 7 add exch
7 180 500 arc
currentlinewidth -11 -3 rArrowHead stroke

987 521 moveto currentpoint exch 7 add exch
7 180 500 arc
currentlinewidth -11 -3 rArrowHead stroke

997 505 moveto currentpoint exch 7 add exch
7 180 500 arc
currentlinewidth -11 -3 rArrowHead stroke

987 487 moveto currentpoint exch 7 add exch
7 180 500 arc
currentlinewidth -11 -3 rArrowHead stroke

996 468 moveto currentpoint exch 7 add exch
7 180 500 arc
currentlinewidth -11 -3 rArrowHead stroke

983 451 moveto currentpoint exch 7 add exch
7 180 500 arc
currentlinewidth -11 -3 rArrowHead stroke

989 432 moveto currentpoint exch 7 add exch
7 180 500 arc
currentlinewidth -11 -3 rArrowHead stroke

974 418 moveto currentpoint exch 7 add exch
7 180 500 arc
currentlinewidth -11 -3 rArrowHead stroke

977 398 moveto currentpoint exch 7 add exch
7 180 500 arc
currentlinewidth -11 -3 rArrowHead stroke

957 387 moveto currentpoint exch 7 add exch
7 180 500 arc
currentlinewidth -11 -3 rArrowHead stroke

957 367 moveto currentpoint exch 7 add exch
7 180 500 arc
currentlinewidth -11 -3 rArrowHead stroke

1011 544 moveto currentpoint exch 7 add exch
7 180 500 arc
currentlinewidth -11 -3 rArrowHead stroke

1016 508 moveto currentpoint exch 7 add exch
7 180 500 arc
currentlinewidth -11 -3 rArrowHead stroke

1014 462 moveto currentpoint exch 7 add exch
7 180 500 arc
currentlinewidth -11 -3 rArrowHead stroke

1006 428 moveto currentpoint exch 7 add exch
7 180 500 arc
currentlinewidth -11 -3 rArrowHead stroke

997 391 moveto currentpoint exch 7 add exch
7 180 500 arc
currentlinewidth -11 -3 rArrowHead stroke



1 2 scale 0.5 setgray
1030 250 moveto currentpoint exch -70 add exch
70 0 360 arc stroke



0 0 0 C
(X) 1581.49 64.5 15 /Helvetica S
(Y) 1536.47 109.5 15 /Helvetica S
(Z) 1536.47 64.5 15 /Helvetica S
1531.97 60 LS
1576.99 60 LE
1531.97 60 LS
1531.97 105 LE
1531.97 60 LS
1531.97 60 LE
grestore
showpage
cleartomark
%%PageTrailer
%%Trailer
end
%%EOF
