%!PS-Adobe-3.0 EPSF-3.0
%%Title:                     maniFEM
%%BoundingBox:  0 0  520   329.947
%%EndComments
%%BeginSetup
<< /PageSize [520 329.947] >> setpagedevice
%%EndSetup

/contour
{ /xmin {-1.49761} def  /xmax {2.49984} def  /ymin {-1.98161} def  /ymax {0.496383} def  /border {0.079949}  def
xmin border add ymin border add border 180 270 arc
xmax border sub ymin lineto
xmax border sub ymin border add border -90 0 arc
xmax ymax border sub lineto
xmax border sub ymax border sub border 0 90 arc
xmin border add ymax lineto
xmin border add ymax border sub border 90 180 arc
xmin ymin border add lineto
} def

/shadow
{ -1.1 -1.25 moveto
  2.3 0 rlineto 0 1.4 rlineto -2.3 0 rlineto } def

gsave
197.321 257.859 translate
125.08 dup scale

0 setgray contour clip
newpath 0.6 0.8 1. setrgbcolor shadow fill
0.0119923 setlinewidth 1 0.5 0 setrgbcolor

0 -0.0952759 moveto
0.0207052 -0.1295 lineto stroke
2.3 -0.0952759 moveto
2.32071 -0.1295 lineto stroke
0 -1.49528 moveto
0.0207052 -1.5295 lineto stroke
2.3 -1.49528 moveto
2.32071 -1.5295 lineto stroke
0.0207052 -0.1295 moveto
0.0437126 -0.162221 lineto stroke
2.32071 -0.1295 moveto
2.34371 -0.162221 lineto stroke
0.0207052 -1.5295 moveto
0.0437126 -1.56222 lineto stroke
2.32071 -1.5295 moveto
2.34371 -1.56222 lineto stroke
0.0437126 -0.162221 moveto
0.0680821 -0.19394 lineto stroke
2.34371 -0.162221 moveto
2.36808 -0.19394 lineto stroke
0.0437126 -1.56222 moveto
0.0680821 -1.59394 lineto stroke
2.34371 -1.56222 moveto
2.36808 -1.59394 lineto stroke
0.0680821 -0.19394 moveto
0.0933682 -0.224934 lineto stroke
2.36808 -0.19394 moveto
2.39337 -0.224934 lineto stroke
0.0680821 -1.59394 moveto
0.0933682 -1.62493 lineto stroke
2.36808 -1.59394 moveto
2.39337 -1.62493 lineto stroke
0.0933682 -0.224934 moveto
0.119321 -0.255372 lineto stroke
2.39337 -0.224934 moveto
2.41932 -0.255372 lineto stroke
0.0933682 -1.62493 moveto
0.119321 -1.65537 lineto stroke
2.39337 -1.62493 moveto
2.41932 -1.65537 lineto stroke
0.119321 -0.255372 moveto
0.145782 -0.285369 lineto stroke
2.41932 -0.255372 moveto
2.44578 -0.285369 lineto stroke
0.119321 -1.65537 moveto
0.145782 -1.68537 lineto stroke
2.41932 -1.65537 moveto
2.44578 -1.68537 lineto stroke
0.145782 -0.285369 moveto
0.172646 -0.315005 lineto stroke
2.44578 -0.285369 moveto
2.47265 -0.315005 lineto stroke
0.145782 -1.68537 moveto
0.172646 -1.715 lineto stroke
2.44578 -1.68537 moveto
2.47265 -1.715 lineto stroke
0.172646 -0.315005 moveto
0.199836 -0.344343 lineto stroke
2.47265 -0.315005 moveto
2.49984 -0.344343 lineto stroke
0.172646 -1.715 moveto
0.199836 -1.74434 lineto stroke
2.47265 -1.715 moveto
2.49984 -1.74434 lineto stroke
0.199836 -0.344343 moveto
0.227292 -0.373432 lineto stroke
2.49984 -0.344343 moveto
2.52729 -0.373432 lineto stroke
0.199836 -1.74434 moveto
0.227292 -1.77343 lineto stroke
2.49984 -1.74434 moveto
2.52729 -1.77343 lineto stroke
0.227292 -0.373432 moveto
0.254966 -0.402314 lineto stroke
0.227292 -1.77343 moveto
0.254966 -1.80231 lineto stroke
0.254966 -0.402314 moveto
0.282819 -0.431023 lineto stroke
0.254966 -1.80231 moveto
0.282819 -1.83102 lineto stroke
0.282819 -0.431023 moveto
0.310816 -0.459591 lineto stroke
0.282819 -1.83102 moveto
0.310816 -1.85959 lineto stroke
0.310816 -0.459591 moveto
0.338927 -0.488048 lineto stroke
0.310816 -1.85959 moveto
0.338927 -1.88805 lineto stroke
0.338927 -0.488048 moveto
0.367121 -0.516422 lineto stroke
0.338927 -1.88805 moveto
0.367121 -1.91642 lineto stroke
0.367121 -0.516422 moveto
0.395371 -0.544741 lineto stroke
0.367121 -1.91642 moveto
0.395371 -1.94474 lineto stroke
0.395371 -0.544741 moveto
0.42365 -0.57303 lineto stroke
0.395371 -1.94474 moveto
0.42365 -1.97303 lineto stroke
0.42365 -0.57303 moveto
0.451938 -0.601311 lineto stroke
0.42365 -1.97303 moveto
0.451938 -2.00131 lineto stroke
0.451938 -0.601311 moveto
0.480252 -0.629566 lineto stroke
0.480252 -0.629566 moveto
0.508618 -0.657768 lineto stroke
0.508618 -0.657768 moveto
0.537063 -0.68589 lineto stroke
0.537063 -0.68589 moveto
0.565617 -0.713902 lineto stroke
0.565617 -0.713902 moveto
0.594308 -0.741774 lineto stroke
0.594308 -0.741774 moveto
0.623168 -0.769471 lineto stroke
0.623168 -0.769471 moveto
0.652231 -0.796954 lineto stroke
0.652231 -0.796954 moveto
0.681537 -0.824178 lineto stroke
0.681537 -0.824178 moveto
0.711136 -0.851084 lineto stroke
0.711136 -0.851084 moveto
0.741086 -0.877598 lineto stroke
0.741086 -0.877598 moveto
0.771467 -0.903617 lineto stroke
0.741086 0.522402 moveto
0.771467 0.496383 lineto stroke
0.771467 -0.903617 moveto
0.802388 -0.928991 lineto stroke
0.771467 0.496383 moveto
0.802388 0.471009 lineto stroke
-1.52853 0.496383 moveto
-1.49761 0.471009 lineto stroke
-1.52853 -0.903617 moveto
-1.49761 -0.928991 lineto stroke
0.802388 -0.928991 moveto
0.834011 -0.953486 lineto stroke
0.802388 0.471009 moveto
0.834011 0.446514 lineto stroke
-1.49761 0.471009 moveto
-1.46599 0.446514 lineto stroke
-1.49761 -0.928991 moveto
-1.46599 -0.953486 lineto stroke
0.834011 -0.953486 moveto
0.866594 -0.976688 lineto stroke
0.834011 0.446514 moveto
0.866594 0.423312 lineto stroke
-1.46599 0.446514 moveto
-1.43341 0.423312 lineto stroke
-1.46599 -0.953486 moveto
-1.43341 -0.976688 lineto stroke
0.866594 -0.976688 moveto
0.900603 -0.997745 lineto stroke
0.866594 0.423312 moveto
0.900603 0.402255 lineto stroke
-1.43341 0.423312 moveto
-1.3994 0.402255 lineto stroke
-1.43341 -0.976688 moveto
-1.3994 -0.997745 lineto stroke
0.900603 -0.997745 moveto
0.936982 -1.01436 lineto stroke
0.900603 0.402255 moveto
0.936982 0.38564 lineto stroke
-1.3994 0.402255 moveto
-1.36302 0.38564 lineto stroke
-1.3994 -0.997745 moveto
-1.36302 -1.01436 lineto stroke
0.936982 -1.01436 moveto
0.976383 -1.01691 lineto stroke
0.936982 0.38564 moveto
0.976383 0.383086 lineto stroke
-1.36302 0.38564 moveto
-1.32362 0.383086 lineto stroke
-1.36302 -1.01436 moveto
-1.32362 -1.01691 lineto stroke
0.976383 -1.01691 moveto
1.00733 -0.992335 lineto stroke
0.976383 0.383086 moveto
1.00733 0.407665 lineto stroke
-1.32362 0.383086 moveto
-1.29267 0.407665 lineto stroke
-1.32362 -1.01691 moveto
-1.29267 -0.992335 lineto stroke
1.00733 -0.992335 moveto
1.01892 -0.958366 lineto stroke
1.00733 0.407665 moveto
1.01892 0.441634 lineto stroke
-1.29267 0.407665 moveto
-1.28108 0.441634 lineto stroke
-1.29267 -0.992335 moveto
-1.28108 -0.958366 lineto stroke
1.01892 -0.958366 moveto
1.00786 -0.920519 lineto stroke
1.01892 0.441634 moveto
1.00786 0.479481 lineto stroke
-1.28108 0.441634 moveto
-1.29214 0.479481 lineto stroke
-1.28108 -0.958366 moveto
-1.29214 -0.920519 lineto stroke
1.00786 -0.920519 moveto
0.988794 -0.885354 lineto stroke
1.00786 0.479481 moveto
0.988794 0.514646 lineto stroke
-1.29214 0.479481 moveto
-1.31121 0.514646 lineto stroke
-1.29214 -0.920519 moveto
-1.31121 -0.885354 lineto stroke
0.988794 -0.885354 moveto
0.966633 -0.852054 lineto stroke
-1.31121 -0.885354 moveto
-1.33337 -0.852054 lineto stroke
0.966633 -0.852054 moveto
0.942791 -0.819936 lineto stroke
-1.33337 -0.852054 moveto
-1.35721 -0.819936 lineto stroke
0.942791 -0.819936 moveto
0.91787 -0.788648 lineto stroke
-1.35721 -0.819936 moveto
-1.38213 -0.788648 lineto stroke
0.91787 -0.788648 moveto
0.892188 -0.757982 lineto stroke
-1.38213 -0.788648 moveto
-1.40781 -0.757982 lineto stroke
0.892188 -0.757982 moveto
0.865935 -0.727803 lineto stroke
-1.40781 -0.757982 moveto
-1.43407 -0.727803 lineto stroke
0.865935 -0.727803 moveto
0.839237 -0.698016 lineto stroke
-1.43407 -0.727803 moveto
-1.46076 -0.698016 lineto stroke
0.839237 -0.698016 moveto
0.812183 -0.668553 lineto stroke
-1.46076 -0.698016 moveto
-1.48782 -0.668553 lineto stroke
0.812183 -0.668553 moveto
0.784838 -0.63936 lineto stroke
-1.48782 -0.668553 moveto
-1.51516 -0.63936 lineto stroke
0.784838 -0.63936 moveto
0.757255 -0.610391 lineto stroke
0.757255 -0.610391 moveto
0.729476 -0.58161 lineto stroke
0.757255 -2.01039 moveto
0.729476 -1.98161 lineto stroke
0.729476 -0.58161 moveto
0.701538 -0.552984 lineto stroke
0.729476 -1.98161 moveto
0.701538 -1.95298 lineto stroke
0.701538 -0.552984 moveto
0.673474 -0.524481 lineto stroke
0.701538 -1.95298 moveto
0.673474 -1.92448 lineto stroke
0.673474 -0.524481 moveto
0.645313 -0.496074 lineto stroke
0.673474 -1.92448 moveto
0.645313 -1.89607 lineto stroke
0.645313 -0.496074 moveto
0.617084 -0.467735 lineto stroke
0.645313 -1.89607 moveto
0.617084 -1.86773 lineto stroke
0.617084 -0.467735 moveto
0.588815 -0.439436 lineto stroke
0.617084 -1.86773 moveto
0.588815 -1.83944 lineto stroke
0.588815 -0.439436 moveto
0.56053 -0.411151 lineto stroke
0.588815 -1.83944 moveto
0.56053 -1.81115 lineto stroke
0.56053 -0.411151 moveto
0.532231 -0.382882 lineto stroke
0.56053 -1.81115 moveto
0.532231 -1.78288 lineto stroke
0.532231 -0.382882 moveto
0.503892 -0.354653 lineto stroke
0.532231 -1.78288 moveto
0.503892 -1.75465 lineto stroke
0.503892 -0.354653 moveto
0.475485 -0.326492 lineto stroke
0.503892 -1.75465 moveto
0.475485 -1.72649 lineto stroke
0.475485 -0.326492 moveto
0.446982 -0.298428 lineto stroke
0.475485 -1.72649 moveto
0.446982 -1.69843 lineto stroke
0.446982 -0.298428 moveto
0.418355 -0.27049 lineto stroke
0.446982 -1.69843 moveto
0.418355 -1.67049 lineto stroke
0.418355 -0.27049 moveto
0.389574 -0.242712 lineto stroke
0.418355 -1.67049 moveto
0.389574 -1.64271 lineto stroke
0.389574 -0.242712 moveto
0.360605 -0.215129 lineto stroke
0.389574 -1.64271 moveto
0.360605 -1.61513 lineto stroke
0.360605 -0.215129 moveto
0.331412 -0.187785 lineto stroke
0.360605 -1.61513 moveto
0.331412 -1.58778 lineto stroke
0.331412 -0.187785 moveto
0.301948 -0.160731 lineto stroke
0.331412 -1.58778 moveto
0.301948 -1.56073 lineto stroke
0.301948 -0.160731 moveto
0.272161 -0.134033 lineto stroke
0.301948 -1.56073 moveto
0.272161 -1.53403 lineto stroke
0.272161 -0.134033 moveto
0.241982 -0.107781 lineto stroke
0.272161 -1.53403 moveto
0.241982 -1.50778 lineto stroke
0.241982 -0.107781 moveto
0.20863 -0.0799068 lineto stroke
0.241982 -1.50778 moveto
0.20863 -1.47991 lineto stroke
0.20863 -0.0799068 moveto
0.175798 -0.0539304 lineto stroke
2.50863 -0.0799068 moveto
2.4758 -0.0539304 lineto stroke
0.20863 -1.47991 moveto
0.175798 -1.45393 lineto stroke
2.50863 -1.47991 moveto
2.4758 -1.45393 lineto stroke
0.175798 -0.0539304 moveto
0.141583 -0.0289022 lineto stroke
2.4758 -0.0539304 moveto
2.44158 -0.0289022 lineto stroke
0.175798 -1.45393 moveto
0.141583 -1.4289 lineto stroke
2.4758 -1.45393 moveto
2.44158 -1.4289 lineto stroke
0.141583 -0.0289022 moveto
0.10554 -0.00575166 lineto stroke
2.44158 -0.0289022 moveto
2.40554 -0.00575166 lineto stroke
0.141583 -1.4289 moveto
0.10554 -1.40575 lineto stroke
2.44158 -1.4289 moveto
2.40554 -1.40575 lineto stroke
0.10554 -0.00575166 moveto
0.0668395 0.0130357 lineto stroke
2.40554 -0.00575166 moveto
2.36684 0.0130357 lineto stroke
0.10554 -1.40575 moveto
0.0668395 -1.38696 lineto stroke
2.40554 -1.40575 moveto
2.36684 -1.38696 lineto stroke
0.0668395 0.0130357 moveto
0.0262943 0.0177035 lineto stroke
2.36684 0.0130357 moveto
2.32629 0.0177035 lineto stroke
0.0668395 -1.38696 moveto
0.0262943 -1.3823 lineto stroke
2.36684 -1.38696 moveto
2.32629 -1.3823 lineto stroke
0.0262943 0.0177035 moveto
0 0 lineto stroke
2.32629 0.0177035 moveto
2.3 0 lineto stroke
0.0262943 -1.3823 moveto
0 -1.4 lineto stroke
2.32629 -1.3823 moveto
2.3 -1.4 lineto stroke
0 0 moveto
-0.0351833 0.0190084 lineto stroke
2.3 0 moveto
2.26482 0.0190084 lineto stroke
0 -1.4 moveto
-0.0351833 -1.38099 lineto stroke
2.3 -1.4 moveto
2.26482 -1.38099 lineto stroke
-0.0351833 0.0190084 moveto
-0.0735227 0.0104385 lineto stroke
2.26482 0.0190084 moveto
2.22648 0.0104385 lineto stroke
-0.0351833 -1.38099 moveto
-0.0735227 -1.38956 lineto stroke
2.26482 -1.38099 moveto
2.22648 -1.38956 lineto stroke
-0.0735227 0.0104385 moveto
-0.109097 -0.00784616 lineto stroke
2.22648 0.0104385 moveto
2.1909 -0.00784616 lineto stroke
-0.0735227 -1.38956 moveto
-0.109097 -1.40785 lineto stroke
2.22648 -1.38956 moveto
2.1909 -1.40785 lineto stroke
-0.109097 -0.00784616 moveto
-0.14264 -0.0296371 lineto stroke
2.1909 -0.00784616 moveto
2.15736 -0.0296371 lineto stroke
-0.109097 -1.40785 moveto
-0.14264 -1.42964 lineto stroke
2.1909 -1.40785 moveto
2.15736 -1.42964 lineto stroke
-0.14264 -0.0296371 moveto
-0.17492 -0.0532595 lineto stroke
2.15736 -0.0296371 moveto
2.12508 -0.0532595 lineto stroke
-0.14264 -1.42964 moveto
-0.17492 -1.45326 lineto stroke
2.15736 -1.42964 moveto
2.12508 -1.45326 lineto stroke
-0.17492 -0.0532595 moveto
-0.206326 -0.078032 lineto stroke
2.12508 -0.0532595 moveto
2.09367 -0.078032 lineto stroke
-0.17492 -1.45326 moveto
-0.206326 -1.47803 lineto stroke
2.12508 -1.45326 moveto
2.09367 -1.47803 lineto stroke
-0.206326 -0.078032 moveto
-0.237082 -0.103606 lineto stroke
2.09367 -0.078032 moveto
2.06292 -0.103606 lineto stroke
-0.206326 -1.47803 moveto
-0.237082 -1.50361 lineto stroke
2.09367 -1.47803 moveto
2.06292 -1.50361 lineto stroke
-0.237082 -0.103606 moveto
-0.267334 -0.129776 lineto stroke
2.06292 -0.103606 moveto
2.03267 -0.129776 lineto stroke
-0.237082 -1.50361 moveto
-0.267334 -1.52978 lineto stroke
2.06292 -1.50361 moveto
2.03267 -1.52978 lineto stroke
-0.267334 -0.129776 moveto
-0.297178 -0.156408 lineto stroke
2.03267 -0.129776 moveto
2.00282 -0.156408 lineto stroke
-0.267334 -1.52978 moveto
-0.297178 -1.55641 lineto stroke
2.03267 -1.52978 moveto
2.00282 -1.55641 lineto stroke
-0.297178 -0.156408 moveto
-0.32669 -0.18341 lineto stroke
2.00282 -0.156408 moveto
1.97331 -0.18341 lineto stroke
-0.297178 -1.55641 moveto
-0.32669 -1.58341 lineto stroke
2.00282 -1.55641 moveto
1.97331 -1.58341 lineto stroke
-0.32669 -0.18341 moveto
-0.355924 -0.210711 lineto stroke
1.97331 -0.18341 moveto
1.94408 -0.210711 lineto stroke
-0.32669 -1.58341 moveto
-0.355924 -1.61071 lineto stroke
1.97331 -1.58341 moveto
1.94408 -1.61071 lineto stroke
-0.355924 -0.210711 moveto
-0.384926 -0.238259 lineto stroke
1.94408 -0.210711 moveto
1.91507 -0.238259 lineto stroke
-0.355924 -1.61071 moveto
-0.384926 -1.63826 lineto stroke
1.94408 -1.61071 moveto
1.91507 -1.63826 lineto stroke
-0.384926 -0.238259 moveto
-0.413735 -0.266009 lineto stroke
1.91507 -0.238259 moveto
1.88626 -0.266009 lineto stroke
-0.384926 -1.63826 moveto
-0.413735 -1.66601 lineto stroke
1.91507 -1.63826 moveto
1.88626 -1.66601 lineto stroke
-0.413735 -0.266009 moveto
-0.442385 -0.293923 lineto stroke
1.88626 -0.266009 moveto
1.85762 -0.293923 lineto stroke
-0.413735 -1.66601 moveto
-0.442385 -1.69392 lineto stroke
1.88626 -1.66601 moveto
1.85762 -1.69392 lineto stroke
-0.442385 -0.293923 moveto
-0.470905 -0.321969 lineto stroke
1.85762 -0.293923 moveto
1.82909 -0.321969 lineto stroke
-0.442385 -1.69392 moveto
-0.470905 -1.72197 lineto stroke
1.85762 -1.69392 moveto
1.82909 -1.72197 lineto stroke
-0.470905 -0.321969 moveto
-0.499326 -0.350116 lineto stroke
1.82909 -0.321969 moveto
1.80067 -0.350116 lineto stroke
-0.470905 -1.72197 moveto
-0.499326 -1.75012 lineto stroke
1.82909 -1.72197 moveto
1.80067 -1.75012 lineto stroke
-0.499326 -0.350116 moveto
-0.527675 -0.378336 lineto stroke
1.80067 -0.350116 moveto
1.77233 -0.378336 lineto stroke
-0.499326 -1.75012 moveto
-0.527675 -1.77834 lineto stroke
1.80067 -1.75012 moveto
1.77233 -1.77834 lineto stroke
-0.527675 -0.378336 moveto
-0.555978 -0.406601 lineto stroke
1.77233 -0.378336 moveto
1.74402 -0.406601 lineto stroke
-0.527675 -1.77834 moveto
-0.555978 -1.8066 lineto stroke
1.77233 -1.77834 moveto
1.74402 -1.8066 lineto stroke
-0.555978 -0.406601 moveto
-0.584264 -0.434884 lineto stroke
1.74402 -0.406601 moveto
1.71574 -0.434884 lineto stroke
-0.555978 -1.8066 moveto
-0.584264 -1.83488 lineto stroke
1.74402 -1.8066 moveto
1.71574 -1.83488 lineto stroke
-0.584264 -0.434884 moveto
-0.612537 -0.463179 lineto stroke
1.71574 -0.434884 moveto
1.68746 -0.463179 lineto stroke
-0.584264 -1.83488 moveto
-0.612537 -1.86318 lineto stroke
1.71574 -1.83488 moveto
1.68746 -1.86318 lineto stroke
-0.612537 -0.463179 moveto
-0.640775 -0.49151 lineto stroke
1.68746 -0.463179 moveto
1.65923 -0.49151 lineto stroke
-0.612537 -1.86318 moveto
-0.640775 -1.89151 lineto stroke
1.68746 -1.86318 moveto
1.65923 -1.89151 lineto stroke
-0.640775 -0.49151 moveto
-0.668948 -0.519904 lineto stroke
1.65923 -0.49151 moveto
1.63105 -0.519904 lineto stroke
-0.640775 -1.89151 moveto
-0.668948 -1.9199 lineto stroke
1.65923 -1.89151 moveto
1.63105 -1.9199 lineto stroke
-0.668948 -0.519904 moveto
-0.69703 -0.54839 lineto stroke
1.63105 -0.519904 moveto
1.60297 -0.54839 lineto stroke
-0.668948 -1.9199 moveto
-0.69703 -1.94839 lineto stroke
1.63105 -1.9199 moveto
1.60297 -1.94839 lineto stroke
-0.69703 -0.54839 moveto
-0.72499 -0.576994 lineto stroke
1.60297 -0.54839 moveto
1.57501 -0.576994 lineto stroke
-0.69703 -1.94839 moveto
-0.72499 -1.97699 lineto stroke
1.60297 -1.94839 moveto
1.57501 -1.97699 lineto stroke
-0.72499 -0.576994 moveto
-0.752797 -0.605748 lineto stroke
1.57501 -0.576994 moveto
1.5472 -0.605748 lineto stroke
-0.72499 -1.97699 moveto
-0.752797 -2.00575 lineto stroke
1.57501 -1.97699 moveto
1.5472 -2.00575 lineto stroke
-0.752797 -0.605748 moveto
-0.780414 -0.634684 lineto stroke
1.5472 -0.605748 moveto
1.51959 -0.634684 lineto stroke
-0.780414 -0.634684 moveto
-0.807801 -0.663839 lineto stroke
1.51959 -0.634684 moveto
1.4922 -0.663839 lineto stroke
-0.807801 -0.663839 moveto
-0.834906 -0.693255 lineto stroke
1.4922 -0.663839 moveto
1.46509 -0.693255 lineto stroke
-0.834906 -0.693255 moveto
-0.861666 -0.722985 lineto stroke
1.46509 -0.693255 moveto
1.43833 -0.722985 lineto stroke
-0.861666 -0.722985 moveto
-0.887998 -0.753095 lineto stroke
1.43833 -0.722985 moveto
1.412 -0.753095 lineto stroke
-0.887998 -0.753095 moveto
-0.913782 -0.783676 lineto stroke
1.412 -0.753095 moveto
1.38622 -0.783676 lineto stroke
-0.913782 -0.783676 moveto
-0.938843 -0.814852 lineto stroke
1.38622 -0.783676 moveto
1.36116 -0.814852 lineto stroke
-0.938843 -0.814852 moveto
-0.962889 -0.846817 lineto stroke
1.36116 -0.814852 moveto
1.33711 -0.846817 lineto stroke
-0.962889 -0.846817 moveto
-0.985383 -0.879894 lineto stroke
1.33711 -0.846817 moveto
1.31462 -0.879894 lineto stroke
-0.985383 -0.879894 moveto
-1.00511 -0.914688 lineto stroke
1.31462 -0.879894 moveto
1.29489 -0.914688 lineto stroke
1.31462 0.520106 moveto
1.29489 0.485312 lineto stroke
-0.985383 0.520106 moveto
-1.00511 0.485312 lineto stroke
-1.00511 -0.914688 moveto
-1.01823 -0.952441 lineto stroke
1.29489 -0.914688 moveto
1.28177 -0.952441 lineto stroke
1.29489 0.485312 moveto
1.28177 0.447559 lineto stroke
-1.00511 0.485312 moveto
-1.01823 0.447559 lineto stroke
-1.01823 -0.952441 moveto
-1.00943 -0.989808 lineto stroke
1.28177 -0.952441 moveto
1.29057 -0.989808 lineto stroke
1.28177 0.447559 moveto
1.29057 0.410192 lineto stroke
-1.01823 0.447559 moveto
-1.00943 0.410192 lineto stroke
-1.00943 -0.989808 moveto
-0.97996 -1.01552 lineto stroke
1.29057 -0.989808 moveto
1.32004 -1.01552 lineto stroke
1.29057 0.410192 moveto
1.32004 0.384478 lineto stroke
-1.00943 0.410192 moveto
-0.97996 0.384478 lineto stroke
-0.97996 -1.01552 moveto
-0.943158 -1.01622 lineto stroke
1.32004 -1.01552 moveto
1.35684 -1.01622 lineto stroke
1.32004 0.384478 moveto
1.35684 0.383783 lineto stroke
-0.97996 0.384478 moveto
-0.943158 0.383783 lineto stroke
-0.943158 -1.01622 moveto
-0.906258 -1.00082 lineto stroke
1.35684 -1.01622 moveto
1.39374 -1.00082 lineto stroke
1.35684 0.383783 moveto
1.39374 0.399181 lineto stroke
-0.943158 0.383783 moveto
-0.906258 0.399181 lineto stroke
-0.906258 -1.00082 moveto
-0.871951 -0.980252 lineto stroke
1.39374 -1.00082 moveto
1.42805 -0.980252 lineto stroke
1.39374 0.399181 moveto
1.42805 0.419748 lineto stroke
-0.906258 0.399181 moveto
-0.871951 0.419748 lineto stroke
-0.871951 -0.980252 moveto
-0.839178 -0.95732 lineto stroke
1.42805 -0.980252 moveto
1.46082 -0.95732 lineto stroke
1.42805 0.419748 moveto
1.46082 0.44268 lineto stroke
-0.871951 0.419748 moveto
-0.839178 0.44268 lineto stroke
-0.839178 -0.95732 moveto
-0.807421 -0.932998 lineto stroke
1.46082 -0.95732 moveto
1.49258 -0.932998 lineto stroke
1.46082 0.44268 moveto
1.49258 0.467002 lineto stroke
-0.839178 0.44268 moveto
-0.807421 0.467002 lineto stroke
-0.807421 -0.932998 moveto
-0.7764 -0.907746 lineto stroke
1.49258 -0.932998 moveto
1.5236 -0.907746 lineto stroke
1.49258 0.467002 moveto
1.5236 0.492254 lineto stroke
-0.807421 0.467002 moveto
-0.7764 0.492254 lineto stroke
-0.7764 -0.907746 moveto
-0.745941 -0.881819 lineto stroke
1.5236 -0.907746 moveto
1.55406 -0.881819 lineto stroke
1.5236 0.492254 moveto
1.55406 0.518181 lineto stroke
-0.7764 0.492254 moveto
-0.745941 0.518181 lineto stroke
-0.745941 -0.881819 moveto
-0.715927 -0.855377 lineto stroke
1.55406 -0.881819 moveto
1.58407 -0.855377 lineto stroke
-0.715927 -0.855377 moveto
-0.686276 -0.828528 lineto stroke
1.58407 -0.855377 moveto
1.61372 -0.828528 lineto stroke
-0.686276 -0.828528 moveto
-0.656926 -0.801352 lineto stroke
1.61372 -0.828528 moveto
1.64307 -0.801352 lineto stroke
-0.656926 -0.801352 moveto
-0.627827 -0.773906 lineto stroke
1.64307 -0.801352 moveto
1.67217 -0.773906 lineto stroke
-0.627827 -0.773906 moveto
-0.598937 -0.746241 lineto stroke
1.67217 -0.773906 moveto
1.70106 -0.746241 lineto stroke
-0.598937 -0.746241 moveto
-0.570222 -0.718395 lineto stroke
1.70106 -0.746241 moveto
1.72978 -0.718395 lineto stroke
-0.570222 -0.718395 moveto
-0.541648 -0.690403 lineto stroke
1.72978 -0.718395 moveto
1.75835 -0.690403 lineto stroke
-0.541648 -0.690403 moveto
-0.513186 -0.662297 lineto stroke
1.75835 -0.690403 moveto
1.78681 -0.662297 lineto stroke
-0.513186 -0.662297 moveto
-0.484809 -0.634106 lineto stroke
1.78681 -0.662297 moveto
1.81519 -0.634106 lineto stroke
-0.484809 -0.634106 moveto
-0.456489 -0.605857 lineto stroke
1.81519 -0.634106 moveto
1.84351 -0.605857 lineto stroke
-0.456489 -0.605857 moveto
-0.428199 -0.577579 lineto stroke
1.84351 -0.605857 moveto
1.8718 -0.577579 lineto stroke
-0.456489 -2.00586 moveto
-0.428199 -1.97758 lineto stroke
1.84351 -2.00586 moveto
1.8718 -1.97758 lineto stroke
-0.428199 -0.577579 moveto
-0.399918 -0.549292 lineto stroke
1.8718 -0.577579 moveto
1.90008 -0.549292 lineto stroke
-0.428199 -1.97758 moveto
-0.399918 -1.94929 lineto stroke
1.8718 -1.97758 moveto
1.90008 -1.94929 lineto stroke
-0.399918 -0.549292 moveto
-0.371661 -0.52098 lineto stroke
1.90008 -0.549292 moveto
1.92834 -0.52098 lineto stroke
-0.399918 -1.94929 moveto
-0.371661 -1.92098 lineto stroke
1.90008 -1.94929 moveto
1.92834 -1.92098 lineto stroke
-0.371661 -0.52098 moveto
-0.343456 -0.492617 lineto stroke
1.92834 -0.52098 moveto
1.95654 -0.492617 lineto stroke
-0.371661 -1.92098 moveto
-0.343456 -1.89262 lineto stroke
1.92834 -1.92098 moveto
1.95654 -1.89262 lineto stroke
-0.343456 -0.492617 moveto
-0.31533 -0.464175 lineto stroke
1.95654 -0.492617 moveto
1.98467 -0.464175 lineto stroke
-0.343456 -1.89262 moveto
-0.31533 -1.86417 lineto stroke
1.95654 -1.89262 moveto
1.98467 -1.86417 lineto stroke
-0.31533 -0.464175 moveto
-0.287313 -0.435626 lineto stroke
1.98467 -0.464175 moveto
2.01269 -0.435626 lineto stroke
-0.31533 -1.86417 moveto
-0.287313 -1.83563 lineto stroke
1.98467 -1.86417 moveto
2.01269 -1.83563 lineto stroke
-0.287313 -0.435626 moveto
-0.259434 -0.406942 lineto stroke
2.01269 -0.435626 moveto
2.04057 -0.406942 lineto stroke
-0.287313 -1.83563 moveto
-0.259434 -1.80694 lineto stroke
2.01269 -1.83563 moveto
2.04057 -1.80694 lineto stroke
-0.259434 -0.406942 moveto
-0.231729 -0.378091 lineto stroke
2.04057 -0.406942 moveto
2.06827 -0.378091 lineto stroke
-0.259434 -1.80694 moveto
-0.231729 -1.77809 lineto stroke
2.04057 -1.80694 moveto
2.06827 -1.77809 lineto stroke
-0.231729 -0.378091 moveto
-0.204235 -0.349037 lineto stroke
2.06827 -0.378091 moveto
2.09576 -0.349037 lineto stroke
-0.231729 -1.77809 moveto
-0.204235 -1.74904 lineto stroke
2.06827 -1.77809 moveto
2.09576 -1.74904 lineto stroke
-0.204235 -0.349037 moveto
-0.176999 -0.319742 lineto stroke
2.09576 -0.349037 moveto
2.123 -0.319742 lineto stroke
-0.204235 -1.74904 moveto
-0.176999 -1.71974 lineto stroke
2.09576 -1.74904 moveto
2.123 -1.71974 lineto stroke
-0.176999 -0.319742 moveto
-0.149327 -0.289322 lineto stroke
2.123 -0.319742 moveto
2.15067 -0.289322 lineto stroke
-0.176999 -1.71974 moveto
-0.149327 -1.68932 lineto stroke
2.123 -1.71974 moveto
2.15067 -1.68932 lineto stroke
-0.149327 -0.289322 moveto
-0.122408 -0.258921 lineto stroke
2.15067 -0.289322 moveto
2.17759 -0.258921 lineto stroke
-0.149327 -1.68932 moveto
-0.122408 -1.65892 lineto stroke
2.15067 -1.68932 moveto
2.17759 -1.65892 lineto stroke
-0.122408 -0.258921 moveto
-0.0958899 -0.227945 lineto stroke
2.17759 -0.258921 moveto
2.20411 -0.227945 lineto stroke
-0.122408 -1.65892 moveto
-0.0958899 -1.62795 lineto stroke
2.17759 -1.65892 moveto
2.20411 -1.62795 lineto stroke
-0.0958899 -0.227945 moveto
-0.0699514 -0.196288 lineto stroke
2.20411 -0.227945 moveto
2.23005 -0.196288 lineto stroke
-0.0958899 -1.62795 moveto
-0.0699514 -1.59629 lineto stroke
2.20411 -1.62795 moveto
2.23005 -1.59629 lineto stroke
-0.0699514 -0.196288 moveto
-0.0448904 -0.16381 lineto stroke
2.23005 -0.196288 moveto
2.25511 -0.16381 lineto stroke
-0.0699514 -1.59629 moveto
-0.0448904 -1.56381 lineto stroke
2.23005 -1.59629 moveto
2.25511 -1.56381 lineto stroke
-0.0448904 -0.16381 moveto
-0.0212244 -0.130283 lineto stroke
2.25511 -0.16381 moveto
2.27878 -0.130283 lineto stroke
-0.0448904 -1.56381 moveto
-0.0212244 -1.53028 lineto stroke
2.25511 -1.56381 moveto
2.27878 -1.53028 lineto stroke
-0.0212244 -0.130283 moveto
0 -0.0952759 lineto stroke
2.27878 -0.130283 moveto
2.3 -0.0952759 lineto stroke
-0.0212244 -1.53028 moveto
0 -1.49528 lineto stroke
2.27878 -1.53028 moveto
2.3 -1.49528 lineto stroke
1.15 -1.72472 moveto
1.12929 -1.6905 lineto stroke
1.15 -0.324724 moveto
1.12929 -0.2905 lineto stroke
-1.15 -0.324724 moveto
-1.17071 -0.2905 lineto stroke
-1.15 -1.72472 moveto
-1.17071 -1.6905 lineto stroke
1.12929 -1.6905 moveto
1.10629 -1.65778 lineto stroke
1.12929 -0.2905 moveto
1.10629 -0.257779 lineto stroke
-1.17071 -0.2905 moveto
-1.19371 -0.257779 lineto stroke
-1.17071 -1.6905 moveto
-1.19371 -1.65778 lineto stroke
1.10629 -1.65778 moveto
1.08192 -1.62606 lineto stroke
1.10629 -0.257779 moveto
1.08192 -0.22606 lineto stroke
-1.19371 -0.257779 moveto
-1.21808 -0.22606 lineto stroke
-1.19371 -1.65778 moveto
-1.21808 -1.62606 lineto stroke
1.08192 -1.62606 moveto
1.05663 -1.59507 lineto stroke
1.08192 -0.22606 moveto
1.05663 -0.195066 lineto stroke
-1.21808 -0.22606 moveto
-1.24337 -0.195066 lineto stroke
-1.21808 -1.62606 moveto
-1.24337 -1.59507 lineto stroke
1.05663 -1.59507 moveto
1.03068 -1.56463 lineto stroke
1.05663 -0.195066 moveto
1.03068 -0.164628 lineto stroke
-1.24337 -0.195066 moveto
-1.26932 -0.164628 lineto stroke
-1.24337 -1.59507 moveto
-1.26932 -1.56463 lineto stroke
1.03068 -1.56463 moveto
1.00422 -1.53463 lineto stroke
1.03068 -0.164628 moveto
1.00422 -0.134631 lineto stroke
-1.26932 -0.164628 moveto
-1.29578 -0.134631 lineto stroke
-1.26932 -1.56463 moveto
-1.29578 -1.53463 lineto stroke
1.00422 -1.53463 moveto
0.977354 -1.505 lineto stroke
1.00422 -0.134631 moveto
0.977354 -0.104995 lineto stroke
-1.29578 -0.134631 moveto
-1.32265 -0.104995 lineto stroke
-1.29578 -1.53463 moveto
-1.32265 -1.505 lineto stroke
0.977354 -1.505 moveto
0.950164 -1.47566 lineto stroke
0.977354 -0.104995 moveto
0.950164 -0.0756569 lineto stroke
-1.32265 -0.104995 moveto
-1.34984 -0.0756569 lineto stroke
-1.32265 -1.505 moveto
-1.34984 -1.47566 lineto stroke
0.950164 -1.47566 moveto
0.922708 -1.44657 lineto stroke
0.950164 -0.0756569 moveto
0.922708 -0.0465675 lineto stroke
-1.34984 -0.0756569 moveto
-1.37729 -0.0465675 lineto stroke
-1.34984 -1.47566 moveto
-1.37729 -1.44657 lineto stroke
0.922708 -1.44657 moveto
0.895034 -1.41769 lineto stroke
0.922708 -0.0465675 moveto
0.895034 -0.017686 lineto stroke
-1.37729 -0.0465675 moveto
-1.40497 -0.017686 lineto stroke
-1.37729 -1.44657 moveto
-1.40497 -1.41769 lineto stroke
0.895034 -1.41769 moveto
0.867181 -1.38898 lineto stroke
0.895034 -0.017686 moveto
0.867181 0.011023 lineto stroke
-1.40497 -0.017686 moveto
-1.43282 0.011023 lineto stroke
-1.40497 -1.41769 moveto
-1.43282 -1.38898 lineto stroke
0.867181 -1.38898 moveto
0.839184 -1.36041 lineto stroke
0.867181 0.011023 moveto
0.839184 0.0395913 lineto stroke
-1.43282 0.011023 moveto
-1.46082 0.0395913 lineto stroke
-1.43282 -1.38898 moveto
-1.46082 -1.36041 lineto stroke
0.839184 -1.36041 moveto
0.811073 -1.33195 lineto stroke
0.839184 0.0395913 moveto
0.811073 0.0680483 lineto stroke
-1.46082 0.0395913 moveto
-1.48893 0.0680483 lineto stroke
-1.46082 -1.36041 moveto
-1.48893 -1.33195 lineto stroke
0.811073 -1.33195 moveto
0.782879 -1.30358 lineto stroke
0.811073 0.0680483 moveto
0.782879 0.0964223 lineto stroke
-1.48893 0.0680483 moveto
-1.51712 0.0964223 lineto stroke
-1.48893 -1.33195 moveto
-1.51712 -1.30358 lineto stroke
0.782879 -1.30358 moveto
0.754629 -1.27526 lineto stroke
0.782879 0.0964223 moveto
0.754629 0.124741 lineto stroke
0.754629 -1.27526 moveto
0.72635 -1.24697 lineto stroke
0.754629 0.124741 moveto
0.72635 0.15303 lineto stroke
0.72635 -1.24697 moveto
0.698062 -1.21869 lineto stroke
0.72635 0.15303 moveto
0.698062 0.181311 lineto stroke
0.698062 -1.21869 moveto
0.669748 -1.19043 lineto stroke
0.698062 0.181311 moveto
0.669748 0.209566 lineto stroke
0.669748 -1.19043 moveto
0.641382 -1.16223 lineto stroke
0.669748 0.209566 moveto
0.641382 0.237768 lineto stroke
0.641382 -1.16223 moveto
0.612937 -1.13411 lineto stroke
0.641382 0.237768 moveto
0.612937 0.26589 lineto stroke
0.612937 -1.13411 moveto
0.584383 -1.1061 lineto stroke
0.612937 0.26589 moveto
0.584383 0.293902 lineto stroke
0.584383 -1.1061 moveto
0.555692 -1.07823 lineto stroke
0.584383 0.293902 moveto
0.555692 0.321774 lineto stroke
0.555692 -1.07823 moveto
0.526832 -1.05053 lineto stroke
0.555692 0.321774 moveto
0.526832 0.349471 lineto stroke
0.526832 -1.05053 moveto
0.497769 -1.02305 lineto stroke
0.526832 0.349471 moveto
0.497769 0.376954 lineto stroke
0.497769 -1.02305 moveto
0.468463 -0.995822 lineto stroke
0.497769 0.376954 moveto
0.468463 0.404178 lineto stroke
0.468463 -0.995822 moveto
0.438864 -0.968916 lineto stroke
0.468463 0.404178 moveto
0.438864 0.431084 lineto stroke
0.438864 -0.968916 moveto
0.408914 -0.942402 lineto stroke
0.438864 0.431084 moveto
0.408914 0.457598 lineto stroke
0.408914 -0.942402 moveto
0.378533 -0.916383 lineto stroke
0.408914 0.457598 moveto
0.378533 0.483617 lineto stroke
0.378533 -0.916383 moveto
0.347612 -0.891009 lineto stroke
0.378533 0.483617 moveto
0.347612 0.508991 lineto stroke
0.347612 -0.891009 moveto
0.315989 -0.866514 lineto stroke
0.315989 -0.866514 moveto
0.283406 -0.843312 lineto stroke
0.283406 -0.843312 moveto
0.249397 -0.822255 lineto stroke
0.249397 -0.822255 moveto
0.213018 -0.80564 lineto stroke
0.213018 -0.80564 moveto
0.173617 -0.803086 lineto stroke
2.51302 -0.80564 moveto
2.47362 -0.803086 lineto stroke
0.173617 -0.803086 moveto
0.142672 -0.827665 lineto stroke
2.47362 -0.803086 moveto
2.44267 -0.827665 lineto stroke
0.142672 -0.827665 moveto
0.131081 -0.861634 lineto stroke
2.44267 -0.827665 moveto
2.43108 -0.861634 lineto stroke
0.131081 -0.861634 moveto
0.142144 -0.899481 lineto stroke
2.43108 -0.861634 moveto
2.44214 -0.899481 lineto stroke
0.142144 -0.899481 moveto
0.161206 -0.934646 lineto stroke
2.44214 -0.899481 moveto
2.46121 -0.934646 lineto stroke
2.44214 0.500519 moveto
2.46121 0.465354 lineto stroke
0.142144 0.500519 moveto
0.161206 0.465354 lineto stroke
0.161206 -0.934646 moveto
0.183367 -0.967946 lineto stroke
2.46121 -0.934646 moveto
2.48337 -0.967946 lineto stroke
2.46121 0.465354 moveto
2.48337 0.432054 lineto stroke
0.161206 0.465354 moveto
0.183367 0.432054 lineto stroke
0.183367 -0.967946 moveto
0.207209 -1.00006 lineto stroke
2.48337 -0.967946 moveto
2.50721 -1.00006 lineto stroke
2.48337 0.432054 moveto
2.50721 0.399936 lineto stroke
0.183367 0.432054 moveto
0.207209 0.399936 lineto stroke
0.207209 -1.00006 moveto
0.23213 -1.03135 lineto stroke
0.207209 0.399936 moveto
0.23213 0.368648 lineto stroke
0.23213 -1.03135 moveto
0.257812 -1.06202 lineto stroke
0.23213 0.368648 moveto
0.257812 0.337982 lineto stroke
0.257812 -1.06202 moveto
0.284065 -1.0922 lineto stroke
0.257812 0.337982 moveto
0.284065 0.307803 lineto stroke
0.284065 -1.0922 moveto
0.310763 -1.12198 lineto stroke
0.284065 0.307803 moveto
0.310763 0.278016 lineto stroke
0.310763 -1.12198 moveto
0.337817 -1.15145 lineto stroke
0.310763 0.278016 moveto
0.337817 0.248553 lineto stroke
0.337817 -1.15145 moveto
0.365162 -1.18064 lineto stroke
0.337817 0.248553 moveto
0.365162 0.21936 lineto stroke
0.365162 -1.18064 moveto
0.392745 -1.20961 lineto stroke
0.365162 0.21936 moveto
0.392745 0.190391 lineto stroke
0.392745 -1.20961 moveto
0.420524 -1.23839 lineto stroke
0.392745 0.190391 moveto
0.420524 0.16161 lineto stroke
0.420524 -1.23839 moveto
0.448462 -1.26702 lineto stroke
0.420524 0.16161 moveto
0.448462 0.132984 lineto stroke
0.448462 -1.26702 moveto
0.476526 -1.29552 lineto stroke
0.448462 0.132984 moveto
0.476526 0.104481 lineto stroke
0.476526 -1.29552 moveto
0.504687 -1.32393 lineto stroke
0.476526 0.104481 moveto
0.504687 0.076074 lineto stroke
0.504687 -1.32393 moveto
0.532916 -1.35227 lineto stroke
0.504687 0.076074 moveto
0.532916 0.0477345 lineto stroke
0.532916 -1.35227 moveto
0.561185 -1.38056 lineto stroke
0.532916 0.0477345 moveto
0.561185 0.0194356 lineto stroke
0.561185 -1.38056 moveto
0.58947 -1.40885 lineto stroke
0.561185 0.0194356 moveto
0.58947 -0.00884863 lineto stroke
0.58947 -1.40885 moveto
0.617769 -1.43712 lineto stroke
0.58947 -0.00884863 moveto
0.617769 -0.0371182 lineto stroke
0.617769 -1.43712 moveto
0.646108 -1.46535 lineto stroke
0.617769 -0.0371182 moveto
0.646108 -0.0653471 lineto stroke
0.646108 -1.46535 moveto
0.674515 -1.49351 lineto stroke
0.646108 -0.0653471 moveto
0.674515 -0.0935079 lineto stroke
0.674515 -1.49351 moveto
0.703018 -1.52157 lineto stroke
0.674515 -0.0935079 moveto
0.703018 -0.121572 lineto stroke
0.703018 -1.52157 moveto
0.731645 -1.54951 lineto stroke
0.703018 -0.121572 moveto
0.731645 -0.14951 lineto stroke
0.731645 -1.54951 moveto
0.760426 -1.57729 lineto stroke
0.731645 -0.14951 moveto
0.760426 -0.177288 lineto stroke
0.760426 -1.57729 moveto
0.789395 -1.60487 lineto stroke
0.760426 -0.177288 moveto
0.789395 -0.204871 lineto stroke
0.789395 -1.60487 moveto
0.818588 -1.63222 lineto stroke
0.789395 -0.204871 moveto
0.818588 -0.232215 lineto stroke
-1.51061 -0.204871 moveto
-1.48141 -0.232215 lineto stroke
-1.51061 -1.60487 moveto
-1.48141 -1.63222 lineto stroke
0.818588 -1.63222 moveto
0.848052 -1.65927 lineto stroke
0.818588 -0.232215 moveto
0.848052 -0.259269 lineto stroke
-1.48141 -0.232215 moveto
-1.45195 -0.259269 lineto stroke
-1.48141 -1.63222 moveto
-1.45195 -1.65927 lineto stroke
0.848052 -1.65927 moveto
0.877839 -1.68597 lineto stroke
0.848052 -0.259269 moveto
0.877839 -0.285967 lineto stroke
-1.45195 -0.259269 moveto
-1.42216 -0.285967 lineto stroke
-1.45195 -1.65927 moveto
-1.42216 -1.68597 lineto stroke
0.877839 -1.68597 moveto
0.908018 -1.71222 lineto stroke
0.877839 -0.285967 moveto
0.908018 -0.312219 lineto stroke
-1.42216 -0.285967 moveto
-1.39198 -0.312219 lineto stroke
-1.42216 -1.68597 moveto
-1.39198 -1.71222 lineto stroke
0.908018 -1.71222 moveto
0.94137 -1.74009 lineto stroke
0.908018 -0.312219 moveto
0.94137 -0.340093 lineto stroke
-1.39198 -0.312219 moveto
-1.35863 -0.340093 lineto stroke
-1.39198 -1.71222 moveto
-1.35863 -1.74009 lineto stroke
0.94137 -1.74009 moveto
0.974202 -1.76607 lineto stroke
0.94137 -0.340093 moveto
0.974202 -0.36607 lineto stroke
-1.35863 -0.340093 moveto
-1.3258 -0.36607 lineto stroke
-1.35863 -1.74009 moveto
-1.3258 -1.76607 lineto stroke
0.974202 -1.76607 moveto
1.00842 -1.7911 lineto stroke
0.974202 -0.36607 moveto
1.00842 -0.391098 lineto stroke
-1.3258 -0.36607 moveto
-1.29158 -0.391098 lineto stroke
-1.3258 -1.76607 moveto
-1.29158 -1.7911 lineto stroke
1.00842 -1.7911 moveto
1.04446 -1.81425 lineto stroke
1.00842 -0.391098 moveto
1.04446 -0.414248 lineto stroke
-1.29158 -0.391098 moveto
-1.25554 -0.414248 lineto stroke
-1.29158 -1.7911 moveto
-1.25554 -1.81425 lineto stroke
1.04446 -1.81425 moveto
1.08316 -1.83304 lineto stroke
1.04446 -0.414248 moveto
1.08316 -0.433036 lineto stroke
-1.25554 -0.414248 moveto
-1.21684 -0.433036 lineto stroke
-1.25554 -1.81425 moveto
-1.21684 -1.83304 lineto stroke
1.08316 -1.83304 moveto
1.12371 -1.8377 lineto stroke
1.08316 -0.433036 moveto
1.12371 -0.437704 lineto stroke
-1.21684 -0.433036 moveto
-1.17629 -0.437704 lineto stroke
-1.21684 -1.83304 moveto
-1.17629 -1.8377 lineto stroke
1.12371 -1.8377 moveto
1.15 -1.82 lineto stroke
1.12371 -0.437704 moveto
1.15 -0.42 lineto stroke
-1.17629 -0.437704 moveto
-1.15 -0.42 lineto stroke
-1.17629 -1.8377 moveto
-1.15 -1.82 lineto stroke
1.15 -1.82 moveto
1.18518 -1.83901 lineto stroke
1.15 -0.42 moveto
1.18518 -0.439008 lineto stroke
-1.15 -0.42 moveto
-1.11482 -0.439008 lineto stroke
-1.15 -1.82 moveto
-1.11482 -1.83901 lineto stroke
1.18518 -1.83901 moveto
1.22352 -1.83044 lineto stroke
1.18518 -0.439008 moveto
1.22352 -0.430439 lineto stroke
-1.11482 -0.439008 moveto
-1.07648 -0.430439 lineto stroke
-1.11482 -1.83901 moveto
-1.07648 -1.83044 lineto stroke
1.22352 -1.83044 moveto
1.2591 -1.81215 lineto stroke
1.22352 -0.430439 moveto
1.2591 -0.412154 lineto stroke
-1.07648 -0.430439 moveto
-1.0409 -0.412154 lineto stroke
-1.07648 -1.83044 moveto
-1.0409 -1.81215 lineto stroke
1.2591 -1.81215 moveto
1.29264 -1.79036 lineto stroke
1.2591 -0.412154 moveto
1.29264 -0.390363 lineto stroke
-1.0409 -0.412154 moveto
-1.00736 -0.390363 lineto stroke
-1.0409 -1.81215 moveto
-1.00736 -1.79036 lineto stroke
1.29264 -1.79036 moveto
1.32492 -1.76674 lineto stroke
1.29264 -0.390363 moveto
1.32492 -0.366741 lineto stroke
-1.00736 -0.390363 moveto
-0.97508 -0.366741 lineto stroke
-1.00736 -1.79036 moveto
-0.97508 -1.76674 lineto stroke
1.32492 -1.76674 moveto
1.35633 -1.74197 lineto stroke
1.32492 -0.366741 moveto
1.35633 -0.341968 lineto stroke
-0.97508 -0.366741 moveto
-0.943674 -0.341968 lineto stroke
-0.97508 -1.76674 moveto
-0.943674 -1.74197 lineto stroke
1.35633 -1.74197 moveto
1.38708 -1.71639 lineto stroke
1.35633 -0.341968 moveto
1.38708 -0.316394 lineto stroke
-0.943674 -0.341968 moveto
-0.912918 -0.316394 lineto stroke
-0.943674 -1.74197 moveto
-0.912918 -1.71639 lineto stroke
1.38708 -1.71639 moveto
1.41733 -1.69022 lineto stroke
1.38708 -0.316394 moveto
1.41733 -0.290224 lineto stroke
-0.912918 -0.316394 moveto
-0.882666 -0.290224 lineto stroke
-0.912918 -1.71639 moveto
-0.882666 -1.69022 lineto stroke
1.41733 -1.69022 moveto
1.44718 -1.66359 lineto stroke
1.41733 -0.290224 moveto
1.44718 -0.263592 lineto stroke
-0.882666 -0.290224 moveto
-0.852822 -0.263592 lineto stroke
-0.882666 -1.69022 moveto
-0.852822 -1.66359 lineto stroke
1.44718 -1.66359 moveto
1.47669 -1.63659 lineto stroke
1.44718 -0.263592 moveto
1.47669 -0.23659 lineto stroke
-0.852822 -0.263592 moveto
-0.82331 -0.23659 lineto stroke
-0.852822 -1.66359 moveto
-0.82331 -1.63659 lineto stroke
1.47669 -1.63659 moveto
1.50592 -1.60929 lineto stroke
1.47669 -0.23659 moveto
1.50592 -0.209289 lineto stroke
-0.82331 -0.23659 moveto
-0.794076 -0.209289 lineto stroke
-0.82331 -1.63659 moveto
-0.794076 -1.60929 lineto stroke
1.50592 -1.60929 moveto
1.53493 -1.58174 lineto stroke
1.50592 -0.209289 moveto
1.53493 -0.181741 lineto stroke
-0.794076 -0.209289 moveto
-0.765074 -0.181741 lineto stroke
-0.794076 -1.60929 moveto
-0.765074 -1.58174 lineto stroke
1.53493 -1.58174 moveto
1.56374 -1.55399 lineto stroke
1.53493 -0.181741 moveto
1.56374 -0.153991 lineto stroke
-0.765074 -0.181741 moveto
-0.736265 -0.153991 lineto stroke
-0.765074 -1.58174 moveto
-0.736265 -1.55399 lineto stroke
1.56374 -1.55399 moveto
1.59238 -1.52608 lineto stroke
1.56374 -0.153991 moveto
1.59238 -0.126077 lineto stroke
-0.736265 -0.153991 moveto
-0.707615 -0.126077 lineto stroke
-0.736265 -1.55399 moveto
-0.707615 -1.52608 lineto stroke
1.59238 -1.52608 moveto
1.62091 -1.49803 lineto stroke
1.59238 -0.126077 moveto
1.62091 -0.0980312 lineto stroke
-0.707615 -0.126077 moveto
-0.679095 -0.0980312 lineto stroke
-0.707615 -1.52608 moveto
-0.679095 -1.49803 lineto stroke
1.62091 -1.49803 moveto
1.64933 -1.46988 lineto stroke
1.62091 -0.0980312 moveto
1.64933 -0.069884 lineto stroke
-0.679095 -0.0980312 moveto
-0.650674 -0.069884 lineto stroke
-0.679095 -1.49803 moveto
-0.650674 -1.46988 lineto stroke
1.64933 -1.46988 moveto
1.67767 -1.44166 lineto stroke
1.64933 -0.069884 moveto
1.67767 -0.0416642 lineto stroke
-0.650674 -0.069884 moveto
-0.622325 -0.0416642 lineto stroke
-0.650674 -1.46988 moveto
-0.622325 -1.44166 lineto stroke
1.67767 -1.44166 moveto
1.70598 -1.4134 lineto stroke
1.67767 -0.0416642 moveto
1.70598 -0.0133993 lineto stroke
-0.622325 -0.0416642 moveto
-0.594022 -0.0133993 lineto stroke
-0.622325 -1.44166 moveto
-0.594022 -1.4134 lineto stroke
1.70598 -1.4134 moveto
1.73426 -1.38512 lineto stroke
1.70598 -0.0133993 moveto
1.73426 0.0148838 lineto stroke
-0.594022 -0.0133993 moveto
-0.565736 0.0148838 lineto stroke
-0.594022 -1.4134 moveto
-0.565736 -1.38512 lineto stroke
1.73426 -1.38512 moveto
1.76254 -1.35682 lineto stroke
1.73426 0.0148838 moveto
1.76254 0.0431787 lineto stroke
-0.565736 0.0148838 moveto
-0.537463 0.0431787 lineto stroke
-0.565736 -1.38512 moveto
-0.537463 -1.35682 lineto stroke
1.76254 -1.35682 moveto
1.79077 -1.32849 lineto stroke
1.76254 0.0431787 moveto
1.79077 0.0715098 lineto stroke
-0.537463 0.0431787 moveto
-0.509225 0.0715098 lineto stroke
-0.537463 -1.35682 moveto
-0.509225 -1.32849 lineto stroke
1.79077 -1.32849 moveto
1.81895 -1.3001 lineto stroke
1.79077 0.0715098 moveto
1.81895 0.0999042 lineto stroke
-0.509225 0.0715098 moveto
-0.481052 0.0999042 lineto stroke
-0.509225 -1.32849 moveto
-0.481052 -1.3001 lineto stroke
1.81895 -1.3001 moveto
1.84703 -1.27161 lineto stroke
1.81895 0.0999042 moveto
1.84703 0.12839 lineto stroke
-0.481052 0.0999042 moveto
-0.45297 0.12839 lineto stroke
-0.481052 -1.3001 moveto
-0.45297 -1.27161 lineto stroke
1.84703 -1.27161 moveto
1.87499 -1.24301 lineto stroke
1.84703 0.12839 moveto
1.87499 0.156994 lineto stroke
-0.45297 0.12839 moveto
-0.42501 0.156994 lineto stroke
-0.45297 -1.27161 moveto
-0.42501 -1.24301 lineto stroke
1.87499 -1.24301 moveto
1.9028 -1.21425 lineto stroke
1.87499 0.156994 moveto
1.9028 0.185748 lineto stroke
-0.42501 0.156994 moveto
-0.397203 0.185748 lineto stroke
-0.42501 -1.24301 moveto
-0.397203 -1.21425 lineto stroke
1.9028 -1.21425 moveto
1.93041 -1.18532 lineto stroke
1.9028 0.185748 moveto
1.93041 0.214684 lineto stroke
-0.397203 0.185748 moveto
-0.369586 0.214684 lineto stroke
-0.397203 -1.21425 moveto
-0.369586 -1.18532 lineto stroke
1.93041 -1.18532 moveto
1.9578 -1.15616 lineto stroke
1.93041 0.214684 moveto
1.9578 0.243839 lineto stroke
-0.369586 0.214684 moveto
-0.342199 0.243839 lineto stroke
-0.369586 -1.18532 moveto
-0.342199 -1.15616 lineto stroke
1.9578 -1.15616 moveto
1.98491 -1.12675 lineto stroke
1.9578 0.243839 moveto
1.98491 0.273255 lineto stroke
-0.342199 0.243839 moveto
-0.315094 0.273255 lineto stroke
-0.342199 -1.15616 moveto
-0.315094 -1.12675 lineto stroke
1.98491 -1.12675 moveto
2.01167 -1.09702 lineto stroke
1.98491 0.273255 moveto
2.01167 0.302985 lineto stroke
-0.315094 0.273255 moveto
-0.288334 0.302985 lineto stroke
-0.315094 -1.12675 moveto
-0.288334 -1.09702 lineto stroke
2.01167 -1.09702 moveto
2.038 -1.0669 lineto stroke
2.01167 0.302985 moveto
2.038 0.333095 lineto stroke
-0.288334 0.302985 moveto
-0.262002 0.333095 lineto stroke
-0.288334 -1.09702 moveto
-0.262002 -1.0669 lineto stroke
2.038 -1.0669 moveto
2.06378 -1.03632 lineto stroke
2.038 0.333095 moveto
2.06378 0.363676 lineto stroke
-0.262002 0.333095 moveto
-0.236218 0.363676 lineto stroke
-0.262002 -1.0669 moveto
-0.236218 -1.03632 lineto stroke
2.06378 -1.03632 moveto
2.08884 -1.00515 lineto stroke
2.06378 0.363676 moveto
2.08884 0.394852 lineto stroke
-0.236218 0.363676 moveto
-0.211157 0.394852 lineto stroke
-0.236218 -1.03632 moveto
-0.211157 -1.00515 lineto stroke
2.08884 -1.00515 moveto
2.11289 -0.973183 lineto stroke
2.08884 0.394852 moveto
2.11289 0.426817 lineto stroke
-0.211157 0.394852 moveto
-0.187111 0.426817 lineto stroke
-0.211157 -1.00515 moveto
-0.187111 -0.973183 lineto stroke
2.11289 -0.973183 moveto
2.13538 -0.940106 lineto stroke
2.11289 0.426817 moveto
2.13538 0.459894 lineto stroke
-0.187111 0.426817 moveto
-0.164617 0.459894 lineto stroke
-0.187111 -0.973183 moveto
-0.164617 -0.940106 lineto stroke
2.13538 -0.940106 moveto
2.15511 -0.905312 lineto stroke
2.13538 0.459894 moveto
2.15511 0.494688 lineto stroke
-0.164617 0.459894 moveto
-0.144887 0.494688 lineto stroke
-0.164617 -0.940106 moveto
-0.144887 -0.905312 lineto stroke
2.15511 -0.905312 moveto
2.16823 -0.867559 lineto stroke
2.15511 0.494688 moveto
2.16823 0.532441 lineto stroke
-0.144887 0.494688 moveto
-0.131769 0.532441 lineto stroke
-0.144887 -0.905312 moveto
-0.131769 -0.867559 lineto stroke
2.16823 -0.867559 moveto
2.15943 -0.830192 lineto stroke
-0.131769 -0.867559 moveto
-0.140565 -0.830192 lineto stroke
2.15943 -0.830192 moveto
2.12996 -0.804478 lineto stroke
-0.140565 -0.830192 moveto
-0.17004 -0.804478 lineto stroke
2.12996 -0.804478 moveto
2.09316 -0.803783 lineto stroke
-0.17004 -0.804478 moveto
-0.206842 -0.803783 lineto stroke
2.09316 -0.803783 moveto
2.05626 -0.819181 lineto stroke
-0.206842 -0.803783 moveto
-0.243742 -0.819181 lineto stroke
2.05626 -0.819181 moveto
2.02195 -0.839748 lineto stroke
-0.243742 -0.819181 moveto
-0.278049 -0.839748 lineto stroke
2.02195 -0.839748 moveto
1.98918 -0.86268 lineto stroke
-0.278049 -0.839748 moveto
-0.310822 -0.86268 lineto stroke
1.98918 -0.86268 moveto
1.95742 -0.887002 lineto stroke
-0.310822 -0.86268 moveto
-0.342579 -0.887002 lineto stroke
1.95742 -0.887002 moveto
1.9264 -0.912254 lineto stroke
1.95742 0.512998 moveto
1.9264 0.487746 lineto stroke
-0.342579 0.512998 moveto
-0.3736 0.487746 lineto stroke
-0.342579 -0.887002 moveto
-0.3736 -0.912254 lineto stroke
1.9264 -0.912254 moveto
1.89594 -0.938181 lineto stroke
1.9264 0.487746 moveto
1.89594 0.461819 lineto stroke
-0.3736 0.487746 moveto
-0.404059 0.461819 lineto stroke
-0.3736 -0.912254 moveto
-0.404059 -0.938181 lineto stroke
1.89594 -0.938181 moveto
1.86593 -0.964623 lineto stroke
1.89594 0.461819 moveto
1.86593 0.435377 lineto stroke
-0.404059 0.461819 moveto
-0.434073 0.435377 lineto stroke
-0.404059 -0.938181 moveto
-0.434073 -0.964623 lineto stroke
1.86593 -0.964623 moveto
1.83628 -0.991472 lineto stroke
1.86593 0.435377 moveto
1.83628 0.408528 lineto stroke
-0.434073 0.435377 moveto
-0.463724 0.408528 lineto stroke
-0.434073 -0.964623 moveto
-0.463724 -0.991472 lineto stroke
1.83628 -0.991472 moveto
1.80693 -1.01865 lineto stroke
1.83628 0.408528 moveto
1.80693 0.381352 lineto stroke
-0.463724 0.408528 moveto
-0.493074 0.381352 lineto stroke
-0.463724 -0.991472 moveto
-0.493074 -1.01865 lineto stroke
1.80693 -1.01865 moveto
1.77783 -1.04609 lineto stroke
1.80693 0.381352 moveto
1.77783 0.353906 lineto stroke
-0.493074 0.381352 moveto
-0.522173 0.353906 lineto stroke
-0.493074 -1.01865 moveto
-0.522173 -1.04609 lineto stroke
1.77783 -1.04609 moveto
1.74894 -1.07376 lineto stroke
1.77783 0.353906 moveto
1.74894 0.326241 lineto stroke
-0.522173 0.353906 moveto
-0.551063 0.326241 lineto stroke
-0.522173 -1.04609 moveto
-0.551063 -1.07376 lineto stroke
1.74894 -1.07376 moveto
1.72022 -1.10161 lineto stroke
1.74894 0.326241 moveto
1.72022 0.298395 lineto stroke
-0.551063 0.326241 moveto
-0.579778 0.298395 lineto stroke
-0.551063 -1.07376 moveto
-0.579778 -1.10161 lineto stroke
1.72022 -1.10161 moveto
1.69165 -1.1296 lineto stroke
1.72022 0.298395 moveto
1.69165 0.270403 lineto stroke
-0.579778 0.298395 moveto
-0.608352 0.270403 lineto stroke
-0.579778 -1.10161 moveto
-0.608352 -1.1296 lineto stroke
1.69165 -1.1296 moveto
1.66319 -1.1577 lineto stroke
1.69165 0.270403 moveto
1.66319 0.242297 lineto stroke
-0.608352 0.270403 moveto
-0.636814 0.242297 lineto stroke
-0.608352 -1.1296 moveto
-0.636814 -1.1577 lineto stroke
1.66319 -1.1577 moveto
1.63481 -1.18589 lineto stroke
1.66319 0.242297 moveto
1.63481 0.214106 lineto stroke
-0.636814 0.242297 moveto
-0.665191 0.214106 lineto stroke
-0.636814 -1.1577 moveto
-0.665191 -1.18589 lineto stroke
1.63481 -1.18589 moveto
1.60649 -1.21414 lineto stroke
1.63481 0.214106 moveto
1.60649 0.185857 lineto stroke
-0.665191 0.214106 moveto
-0.693511 0.185857 lineto stroke
-0.665191 -1.18589 moveto
-0.693511 -1.21414 lineto stroke
1.60649 -1.21414 moveto
1.5782 -1.24242 lineto stroke
1.60649 0.185857 moveto
1.5782 0.157579 lineto stroke
-0.693511 0.185857 moveto
-0.721801 0.157579 lineto stroke
-0.693511 -1.21414 moveto
-0.721801 -1.24242 lineto stroke
1.5782 -1.24242 moveto
1.54992 -1.27071 lineto stroke
1.5782 0.157579 moveto
1.54992 0.129292 lineto stroke
-0.721801 0.157579 moveto
-0.750082 0.129292 lineto stroke
-0.721801 -1.24242 moveto
-0.750082 -1.27071 lineto stroke
1.54992 -1.27071 moveto
1.52166 -1.29902 lineto stroke
1.54992 0.129292 moveto
1.52166 0.10098 lineto stroke
-0.750082 0.129292 moveto
-0.778339 0.10098 lineto stroke
-0.750082 -1.27071 moveto
-0.778339 -1.29902 lineto stroke
1.52166 -1.29902 moveto
1.49346 -1.32738 lineto stroke
1.52166 0.10098 moveto
1.49346 0.0726166 lineto stroke
-0.778339 0.10098 moveto
-0.806544 0.0726166 lineto stroke
-0.778339 -1.29902 moveto
-0.806544 -1.32738 lineto stroke
1.49346 -1.32738 moveto
1.46533 -1.35583 lineto stroke
1.49346 0.0726166 moveto
1.46533 0.0441748 lineto stroke
-0.806544 0.0726166 moveto
-0.83467 0.0441748 lineto stroke
-0.806544 -1.32738 moveto
-0.83467 -1.35583 lineto stroke
1.46533 -1.35583 moveto
1.43731 -1.38437 lineto stroke
1.46533 0.0441748 moveto
1.43731 0.0156263 lineto stroke
-0.83467 0.0441748 moveto
-0.862687 0.0156263 lineto stroke
-0.83467 -1.35583 moveto
-0.862687 -1.38437 lineto stroke
1.43731 -1.38437 moveto
1.40943 -1.41306 lineto stroke
1.43731 0.0156263 moveto
1.40943 -0.013058 lineto stroke
-0.862687 0.0156263 moveto
-0.890566 -0.013058 lineto stroke
-0.862687 -1.38437 moveto
-0.890566 -1.41306 lineto stroke
1.40943 -1.41306 moveto
1.38173 -1.44191 lineto stroke
1.40943 -0.013058 moveto
1.38173 -0.0419095 lineto stroke
-0.890566 -0.013058 moveto
-0.918271 -0.0419095 lineto stroke
-0.890566 -1.41306 moveto
-0.918271 -1.44191 lineto stroke
1.38173 -1.44191 moveto
1.35424 -1.47096 lineto stroke
1.38173 -0.0419095 moveto
1.35424 -0.0709628 lineto stroke
-0.918271 -0.0419095 moveto
-0.945765 -0.0709628 lineto stroke
-0.918271 -1.44191 moveto
-0.945765 -1.47096 lineto stroke
1.35424 -1.47096 moveto
1.327 -1.50026 lineto stroke
1.35424 -0.0709628 moveto
1.327 -0.100258 lineto stroke
-0.945765 -0.0709628 moveto
-0.973001 -0.100258 lineto stroke
-0.945765 -1.47096 moveto
-0.973001 -1.50026 lineto stroke
1.327 -1.50026 moveto
1.29933 -1.53068 lineto stroke
1.327 -0.100258 moveto
1.29933 -0.130678 lineto stroke
-0.973001 -0.100258 moveto
-1.00067 -0.130678 lineto stroke
-0.973001 -1.50026 moveto
-1.00067 -1.53068 lineto stroke
1.29933 -1.53068 moveto
1.27241 -1.56108 lineto stroke
1.29933 -0.130678 moveto
1.27241 -0.161079 lineto stroke
-1.00067 -0.130678 moveto
-1.02759 -0.161079 lineto stroke
-1.00067 -1.53068 moveto
-1.02759 -1.56108 lineto stroke
1.27241 -1.56108 moveto
1.24589 -1.59205 lineto stroke
1.27241 -0.161079 moveto
1.24589 -0.192055 lineto stroke
-1.02759 -0.161079 moveto
-1.05411 -0.192055 lineto stroke
-1.02759 -1.56108 moveto
-1.05411 -1.59205 lineto stroke
1.24589 -1.59205 moveto
1.21995 -1.62371 lineto stroke
1.24589 -0.192055 moveto
1.21995 -0.223712 lineto stroke
-1.05411 -0.192055 moveto
-1.08005 -0.223712 lineto stroke
-1.05411 -1.59205 moveto
-1.08005 -1.62371 lineto stroke
1.21995 -1.62371 moveto
1.19489 -1.65619 lineto stroke
1.21995 -0.223712 moveto
1.19489 -0.25619 lineto stroke
-1.08005 -0.223712 moveto
-1.10511 -0.25619 lineto stroke
-1.08005 -1.62371 moveto
-1.10511 -1.65619 lineto stroke
1.19489 -1.65619 moveto
1.17122 -1.68972 lineto stroke
1.19489 -0.25619 moveto
1.17122 -0.289717 lineto stroke
-1.10511 -0.25619 moveto
-1.12878 -0.289717 lineto stroke
-1.10511 -1.65619 moveto
-1.12878 -1.68972 lineto stroke
1.17122 -1.68972 moveto
1.15 -1.72472 lineto stroke
1.17122 -0.289717 moveto
1.15 -0.324724 lineto stroke
-1.12878 -0.289717 moveto
-1.15 -0.324724 lineto stroke
-1.12878 -1.68972 moveto
-1.15 -1.72472 lineto stroke

0.5 setgray 0.03 setlinewidth
newpath contour stroke

grestore

showpage
%%Trailer
%EOF

