%!PS-Adobe-3.0 EPSF-3.0
%%Title:                     angle-c
%%BoundingBox:     58   20   157   81
%%EndComments

% these procedures have been posted in comp.lang.postscript
% by Bill Lee, bill@leeweyr.sccsi.com, on Apr 19 1995
% subject: arc with arrow head


%* _____________________________ Arrows ____________________________________
%* Procedure to draw the path for an arrow head. Note: the arrowhead will be
%* added to the current path. The arrowhead will also be drawn and filled.
%*
%*      Usage:  Linewidth PreviousX PreviousY
%*                      ArrowHead
%*              
%*                 where: LineWidth is the width in points of the arrow head
%*                        lines
%*
%*                        PreviousX and PreviousY along with the currentpoint
%*                        define the direction that the arrow points
%*
%*              Note: If Linewidth is zero, a value of 1 will be substituted
/ArrowHead {
          currentpoint moveto
          currentpoint
          4 2 roll exch 4 -1 roll exch
          sub 3 1 roll sub
          exch atan matrix currentmatrix exch rotate exch
          dup 0 eq
            { pop 1 } if
          dup scale
          -7 2 rlineto
          1 -2 rlineto
          -1 -2 rlineto
          7 2 rlineto
          currentpoint
          gsave
            newpath moveto
            -7 2 rlineto
            1 -2 rlineto
            -1 -2 rlineto
            closepath
            fill
          grestore
          setmatrix
} bind def

%* _____________________________ RLineto^ ____________________________________
%* Procedure to add a relative line to the current path and then add the
%* path for an arrow on its end.
%*
%*      Usage:  x y RLineto^
%*
%*                where: x and y are the offsets from the current point
%*              
/RLineto^ {
        currentlinewidth currentpoint 5 3 roll
        rlineto
        ArrowHead
} bind def

%* _____________________________ Lineto^ ____________________________________
%* Procedure to add a line to the current path and then add the
%* path for an arrow on its end.
%*
%*      Usage:  x y Lineto^
%*
%*                where: x and y are the new points for the path
%*              
/Lineto^ {
        currentlinewidth currentpoint 5 3 roll
        lineto
        ArrowHead
} bind def

%* _____________________________ Arc^ ____________________________________
%* Procedure to add an arc to the current path and then add the
%* path for arrow on its end.
%*
%*      Usage:  x y r ang1 ang2 Arc^
%*
%*                where: x, y, ang1, ang2, and r are the normal parameters
%*                       for drawing an arc.
%*              
/Arc^ {
        5 copy arc
        exch pop 2 sub
        dup cos 2 index mul 4 index add
        exch sin 2 index mul 3 index add
        currentlinewidth  3 1 roll
        ArrowHead pop pop pop
} bind def

%* _____________________________ Arcn^ ____________________________________
%* Procedure to add an arc to the current path and then add the
%* path for arrow on its end.
%*
%*      Usage:  x y r ang1 ang2 Arcn^
%*
%*                where: x, y, ang1, ang2, and r are the normal parameters
%*                       for drawing an arcn.
%*              
/Arcn^ {
        5 copy arcn
        exch pop 2 add
        dup cos 2 index mul 4 index add
        exch sin 2 index mul 3 index add
        currentlinewidth  3 1 roll
        ArrowHead pop pop pop
} bind def


1 setlinecap

gsave 0 setlinewidth 0.9 setgray
60 30 moveto
85 35 lineto
105 65 lineto
138 58 lineto
156 60 lineto
152 55 152 50 146 45 curveto
142 41 140 41 137 35 curveto
135 30 132 24 128 23 curveto
122 21 115 22 111 22 curveto
104 23 99 23 94 22 curveto
89 21 84 21 78 22 curveto
71 24 65 25 60 30 curveto
closepath fill grestore

0.2 setgray 0.5 setlinewidth
94 49 moveto 82 58 Lineto^ stroke
118 63 moveto 122 77 Lineto^ stroke

0.8 setlinewidth
1 0.5 0 setrgbcolor
60 30 moveto
85 35 lineto
105 65 Lineto^ 
138 58 Lineto^
156 60 lineto
stroke

0.4 setlinewidth

40 60 moveto
105 65 moveto 120 35 lineto stroke
138 58 moveto 120 35 lineto stroke
85 35 moveto 78 22 lineto stroke
85 35 moveto 94 22 lineto stroke
120 35 moveto 85 35 lineto stroke
120 35 moveto 111 22 lineto stroke
120 35 moveto 111 22 lineto stroke
120 35 moveto 137 35 lineto stroke
120 35 moveto 128 23 lineto stroke
138 58 moveto 146 45 lineto stroke


/Helvetica findfont 10 scalefont setfont	
80 38 moveto (A) show
100 67 moveto (B) show
136 61 moveto (C) show
78 62 moveto (nab) show
123.5 73 moveto (nbc) show


showpage
%%Trailer
%EOF
