%!PS-Adobe-3.0 EPSF-3.0
%%Title: star
%%Creator: GL2PS 1.4.3, (C) 1999-2020 C. Geuzaine
%%For: Gmsh
%%CreationDate: Tue Aug 06 23:09:50 2024
%%LanguageLevel: 3
%%DocumentData: Clean7Bit
%%Pages: 1
%%BoundingBox: 534 120 1088 756
%%EndComments
%%BeginProlog
/gl2psdict 64 dict def gl2psdict begin
/tryPS3shading false def % set to false to force subdivision
/rThreshold 0.0666667 def % red component subdivision threshold
/gThreshold 0.05 def % green component subdivision threshold
/bThreshold 0.1 def % blue component subdivision threshold
/BD { bind def } bind def
/C  { setrgbcolor } BD
/G  { 0.082 mul exch 0.6094 mul add exch 0.3086 mul add neg 1.0 add setgray } BD
/W  { setlinewidth } BD
/LC  { setlinecap } BD
/LJ  { setlinejoin } BD
/FC { findfont exch /SH exch def SH scalefont setfont } BD
/SW { dup stringwidth pop } BD
/S  { FC moveto show } BD
/SBC{ FC moveto SW -2 div 0 rmoveto show } BD
/SBR{ FC moveto SW neg 0 rmoveto show } BD
/SCL{ FC moveto 0 SH -2 div rmoveto show } BD
/SCC{ FC moveto SW -2 div SH -2 div rmoveto show } BD
/SCR{ FC moveto SW neg SH -2 div rmoveto show } BD
/STL{ FC moveto 0 SH neg rmoveto show } BD
/STC{ FC moveto SW -2 div SH neg rmoveto show } BD
/STR{ FC moveto SW neg SH neg rmoveto show } BD
/FCT { FC translate 0 0 } BD
/SR  { gsave FCT moveto rotate show grestore } BD
/SBCR{ gsave FCT moveto rotate SW -2 div 0 rmoveto show grestore } BD
/SBRR{ gsave FCT moveto rotate SW neg 0 rmoveto show grestore } BD
/SCLR{ gsave FCT moveto rotate 0 SH -2 div rmoveto show grestore} BD
/SCCR{ gsave FCT moveto rotate SW -2 div SH -2 div rmoveto show grestore} BD
/SCRR{ gsave FCT moveto rotate SW neg SH -2 div rmoveto show grestore} BD
/STLR{ gsave FCT moveto rotate 0 SH neg rmoveto show grestore } BD
/STCR{ gsave FCT moveto rotate SW -2 div SH neg rmoveto show grestore } BD
/STRR{ gsave FCT moveto rotate SW neg SH neg rmoveto show grestore } BD
/P  { newpath 0.0 360.0 arc closepath fill } BD
/R  { newpath moveto lineto lineto lineto closepath fill } BD
/LS { newpath moveto } BD
/L  { lineto } BD
/LE { lineto stroke } BD
/T  { newpath moveto lineto lineto closepath fill } BD
/STshfill {
      /b1 exch def /g1 exch def /r1 exch def /y1 exch def /x1 exch def
      /b2 exch def /g2 exch def /r2 exch def /y2 exch def /x2 exch def
      /b3 exch def /g3 exch def /r3 exch def /y3 exch def /x3 exch def
      gsave << /ShadingType 4 /ColorSpace [/DeviceRGB]
      /DataSource [ 0 x1 y1 r1 g1 b1 0 x2 y2 r2 g2 b2 0 x3 y3 r3 g3 b3 ] >>
      shfill grestore } BD
/Tm { 3 -1 roll 8 -1 roll 13 -1 roll add add 3 div
      3 -1 roll 7 -1 roll 11 -1 roll add add 3 div
      3 -1 roll 6 -1 roll 9 -1 roll add add 3 div C T } BD
/STsplit {
      4 index 15 index add 0.5 mul
      4 index 15 index add 0.5 mul
      4 index 15 index add 0.5 mul
      4 index 15 index add 0.5 mul
      4 index 15 index add 0.5 mul
      5 copy 5 copy 25 15 roll
      9 index 30 index add 0.5 mul
      9 index 30 index add 0.5 mul
      9 index 30 index add 0.5 mul
      9 index 30 index add 0.5 mul
      9 index 30 index add 0.5 mul
      5 copy 5 copy 35 5 roll 25 5 roll 15 5 roll
      4 index 10 index add 0.5 mul
      4 index 10 index add 0.5 mul
      4 index 10 index add 0.5 mul
      4 index 10 index add 0.5 mul
      4 index 10 index add 0.5 mul
      5 copy 5 copy 40 5 roll 25 5 roll 15 5 roll 25 5 roll
      STnoshfill STnoshfill STnoshfill STnoshfill } BD
/STnoshfill {
      2 index 8 index sub abs rThreshold gt
      { STsplit }
      { 1 index 7 index sub abs gThreshold gt
        { STsplit }
        { dup 6 index sub abs bThreshold gt
          { STsplit }
          { 2 index 13 index sub abs rThreshold gt
            { STsplit }
            { 1 index 12 index sub abs gThreshold gt
              { STsplit }
              { dup 11 index sub abs bThreshold gt
                { STsplit }
                { 7 index 13 index sub abs rThreshold gt
                  { STsplit }
                  { 6 index 12 index sub abs gThreshold gt
                    { STsplit }
                    { 5 index 11 index sub abs bThreshold gt
                      { STsplit }
                      { Tm }
                      ifelse }
                    ifelse }
                  ifelse }
                ifelse }
              ifelse }
            ifelse }
          ifelse }
        ifelse }
      ifelse } BD
tryPS3shading
{ /shfill where
  { /ST { STshfill } BD }
  { /ST { STnoshfill } BD }
  ifelse }
{ /ST { STnoshfill } BD }
ifelse
end
%%EndProlog
%%BeginSetup
/DeviceRGB setcolorspace
gl2psdict begin
%%EndSetup
%%Page: 1 1
%%BeginPageSetup
%%EndPageSetup
mark
gsave
1.0 1.0 scale
1 0.510338 0.0236323 C
783.453 351.643 743.83 329.919 751.561 378.454 T
783.453 351.643 751.561 378.454 805.623 387.238 T
805.623 387.238 751.561 378.454 795.23 429.508 T
795.23 429.508 751.561 378.454 749.385 441.112 T
749.385 441.112 751.561 378.454 714.048 400.479 T
702.024 356.424 751.561 378.454 743.83 329.919 T
714.048 400.479 751.561 378.454 702.024 356.424 T
805.623 387.238 795.23 429.508 841.536 415.206 T
840.435 351.889 805.623 387.238 841.536 415.206 T
783.453 351.643 805.623 387.238 840.435 351.889 T
840.435 351.889 841.536 415.206 883.868 397.084 T
840.435 351.889 883.868 397.084 881.191 329.467 T
783.453 351.643 840.435 351.889 812.551 318.54 T
853.352 294.513 840.435 351.889 881.191 329.467 T
812.551 318.54 840.435 351.889 853.352 294.513 T
771.856 293.806 783.453 351.643 812.551 318.54 T
743.83 329.919 783.453 351.643 771.856 293.806 T
812.504 261.506 812.551 318.54 853.352 294.513 T
771.856 293.806 812.551 318.54 812.504 261.506 T
702.024 356.424 743.83 329.919 701.973 312.353 T
729.559 273.241 743.83 329.919 771.856 293.806 T
701.973 312.353 743.83 329.919 729.559 273.241 T
774.718 238.777 771.856 293.806 812.504 261.506 T
729.559 273.241 771.856 293.806 774.718 238.777 T
729.559 273.241 774.718 238.777 721.026 227.716 T
675.295 254.293 729.559 273.241 721.026 227.716 T
701.973 312.353 729.559 273.241 675.295 254.293 T
701.973 312.353 675.295 254.293 658.117 306.53 T
658.173 350.524 701.973 312.353 658.117 306.53 T
702.024 356.424 701.973 312.353 658.173 350.524 T
665.955 402.144 702.024 356.424 658.173 350.524 T
714.048 400.479 702.024 356.424 665.955 402.144 T
705.179 455.544 714.048 400.479 665.955 402.144 T
749.385 441.112 714.048 400.479 705.179 455.544 T
705.179 455.544 665.955 402.144 661.748 461.323 T
705.179 455.544 661.748 461.323 701.151 503.698 T
746.161 488.844 705.179 455.544 701.151 503.698 T
749.385 441.112 705.179 455.544 746.161 488.844 T
792.335 477.665 749.385 441.112 746.161 488.844 T
795.23 429.508 749.385 441.112 792.335 477.665 T
838.862 463.485 795.23 429.508 792.335 477.665 T
841.536 415.206 795.23 429.508 838.862 463.485 T
884.43 451.834 841.536 415.206 838.862 463.485 T
883.868 397.084 841.536 415.206 884.43 451.834 T
881.191 329.467 883.868 397.084 920.849 366.302 T
924.474 434.364 883.868 397.084 884.43 451.834 T
920.849 366.302 883.868 397.084 924.474 434.364 T
920.849 366.302 924.474 434.364 960.252 408.677 T
960.252 408.677 924.474 434.364 956.045 467.856 T
914.436 491.062 924.474 434.364 884.43 451.834 T
956.045 467.856 924.474 434.364 914.436 491.062 T
869.857 502.294 884.43 451.834 838.862 463.485 T
914.436 491.062 884.43 451.834 869.857 502.294 T
823.22 517.299 838.862 463.485 792.335 477.665 T
869.857 502.294 838.862 463.485 823.22 517.299 T
780.505 527.272 792.335 477.665 746.161 488.844 T
823.22 517.299 792.335 477.665 780.505 527.272 T
740.809 540.533 746.161 488.844 701.151 503.698 T
780.505 527.272 746.161 488.844 740.809 540.533 T
780.505 527.272 740.809 540.533 768.648 575.487 T
820.042 563.666 780.505 527.272 768.648 575.487 T
823.22 517.299 780.505 527.272 820.042 563.666 T
869.793 549.08 823.22 517.299 820.042 563.666 T
869.857 502.294 823.22 517.299 869.793 549.08 T
820.042 563.666 768.648 575.487 809.496 608.494 T
867.119 595.964 820.042 563.666 809.496 608.494 T
869.793 549.08 820.042 563.666 867.119 595.964 T
915.106 538.628 869.857 502.294 869.793 549.08 T
914.436 491.062 869.857 502.294 915.106 538.628 T
963.827 519.476 914.436 491.062 915.106 538.628 T
956.045 467.856 914.436 491.062 963.827 519.476 T
912.381 585.721 869.793 549.08 867.119 595.964 T
915.106 538.628 869.793 549.08 912.381 585.721 T
963.883 563.469 915.106 538.628 912.381 585.721 T
963.827 519.476 915.106 538.628 963.883 563.469 T
963.883 563.469 912.381 585.721 946.705 615.707 T
900.974 642.284 912.381 585.721 867.119 595.964 T
946.705 615.707 912.381 585.721 900.974 642.284 T
847.282 631.223 867.119 595.964 809.496 608.494 T
900.974 642.284 867.119 595.964 847.282 631.223 T
920.849 366.302 960.252 408.677 963.827 350.524 T
922.688 308.816 920.849 366.302 963.827 350.524 T
881.191 329.467 920.849 366.302 922.688 308.816 T
895.413 273.173 881.191 329.467 922.688 308.816 T
853.352 294.513 881.191 329.467 895.413 273.173 T
851.045 240.169 853.352 294.513 895.413 273.173 T
812.504 261.506 853.352 294.513 851.045 240.169 T
922.688 308.816 963.827 350.524 963.883 306.53 T
946.705 254.293 922.688 308.816 963.883 306.53 T
895.413 273.173 922.688 308.816 946.705 254.293 T
900.974 227.716 895.413 273.173 946.705 254.293 T
851.045 240.169 895.413 273.173 900.974 227.716 T
701.151 503.698 661.748 461.323 658.173 519.476 T
699.312 561.184 701.151 503.698 658.173 519.476 T
740.809 540.533 701.151 503.698 699.312 561.184 T
726.587 596.827 740.809 540.533 699.312 561.184 T
768.648 575.487 740.809 540.533 726.587 596.827 T
770.955 629.831 768.648 575.487 726.587 596.827 T
809.496 608.494 768.648 575.487 770.955 629.831 T
699.312 561.184 658.173 519.476 658.117 563.469 T
675.295 615.707 699.312 561.184 658.117 563.469 T
726.587 596.827 699.312 561.184 675.295 615.707 T
721.026 642.284 726.587 596.827 675.295 615.707 T
770.955 629.831 726.587 596.827 721.026 642.284 T
960.252 408.677 956.045 467.856 995.915 442.608 T
1002.09 372.862 960.252 408.677 995.915 442.608 T
963.827 350.524 960.252 408.677 1002.09 372.862 T
1002.09 497.138 956.045 467.856 963.827 519.476 T
995.915 442.608 956.045 467.856 1002.09 497.138 T
1002.09 372.862 995.915 442.608 1038.14 408.832 T
1038.14 461.168 995.915 442.608 1002.09 497.138 T
1038.14 408.832 995.915 442.608 1038.14 461.168 T
661.748 461.323 665.955 402.144 626.085 427.392 T
619.913 497.138 661.748 461.323 626.085 427.392 T
658.173 519.476 661.748 461.323 619.913 497.138 T
619.913 372.862 665.955 402.144 658.173 350.524 T
626.085 427.392 665.955 402.144 619.913 372.862 T
619.913 497.138 626.085 427.392 583.856 461.168 T
583.856 408.832 626.085 427.392 619.913 372.862 T
583.856 461.168 626.085 427.392 583.856 408.832 T
1015.22 322.019 963.827 350.524 1002.09 372.862 T
963.883 306.53 963.827 350.524 1015.22 322.019 T
994.968 271.733 963.883 306.53 1015.22 322.019 T
946.705 254.293 963.883 306.53 994.968 271.733 T
606.785 547.981 658.173 519.476 619.913 497.138 T
658.117 563.469 658.173 519.476 606.785 547.981 T
627.032 598.267 658.117 563.469 606.785 547.981 T
675.295 615.707 658.117 563.469 627.032 598.267 T
1015.22 547.981 963.827 519.476 963.883 563.469 T
1002.09 497.138 963.827 519.476 1015.22 547.981 T
994.968 598.267 963.883 563.469 946.705 615.707 T
1015.22 547.981 963.883 563.469 994.968 598.267 T
606.785 322.019 658.173 350.524 658.117 306.53 T
619.913 372.862 658.173 350.524 606.785 322.019 T
627.032 271.733 658.117 306.53 675.295 254.293 T
606.785 322.019 658.117 306.53 627.032 271.733 T
813.446 202.72 812.504 261.506 851.045 240.169 T
774.718 238.777 812.504 261.506 813.446 202.72 T
759.916 194.574 774.718 238.777 813.446 202.72 T
721.026 227.716 774.718 238.777 759.916 194.574 T
808.554 667.28 809.496 608.494 770.955 629.831 T
847.282 631.223 809.496 608.494 808.554 667.28 T
862.084 675.426 847.282 631.223 808.554 667.28 T
900.974 642.284 847.282 631.223 862.084 675.426 T
862.084 194.574 851.045 240.169 900.974 227.716 T
813.446 202.72 851.045 240.169 862.084 194.574 T
759.916 675.426 770.955 629.831 721.026 642.284 T
808.554 667.28 770.955 629.831 759.916 675.426 T
1047.11 358.931 1002.09 372.862 1038.14 408.832 T
1015.22 322.019 1002.09 372.862 1047.11 358.931 T
574.889 511.069 619.913 497.138 583.856 461.168 T
606.785 547.981 619.913 497.138 574.889 511.069 T
1047.11 511.069 1002.09 497.138 1015.22 547.981 T
1038.14 461.168 1002.09 497.138 1047.11 511.069 T
574.889 358.931 619.913 372.862 606.785 322.019 T
583.856 408.832 619.913 372.862 574.889 358.931 T
759.916 194.574 813.446 202.72 789.782 158.873 T
832.218 158.873 813.446 202.72 862.084 194.574 T
789.782 158.873 813.446 202.72 832.218 158.873 T
862.084 675.426 808.554 667.28 832.218 711.127 T
789.782 711.127 808.554 667.28 759.916 675.426 T
832.218 711.127 808.554 667.28 789.782 711.127 T
994.968 271.733 1015.22 322.019 1041.15 280.013 T
1062.8 315.316 1015.22 322.019 1047.11 358.931 T
1041.15 280.013 1015.22 322.019 1062.8 315.316 T
627.032 598.267 606.785 547.981 580.854 589.987 T
559.205 554.684 606.785 547.981 574.889 511.069 T
580.854 589.987 606.785 547.981 559.205 554.684 T
1015.22 547.981 994.968 598.267 1041.15 589.987 T
1062.8 554.684 1015.22 547.981 1041.15 589.987 T
1047.11 511.069 1015.22 547.981 1062.8 554.684 T
606.785 322.019 627.032 271.733 580.854 280.013 T
559.205 315.316 606.785 322.019 580.854 280.013 T
574.889 358.931 606.785 322.019 559.205 315.316 T
1062.8 554.684 1041.15 589.987 1082.06 590.357 T
1041.15 280.013 1062.8 315.316 1082.06 279.643 T
789.782 158.873 832.218 158.873 811 124.286 T
559.205 315.316 580.854 280.013 539.945 279.643 T
580.854 589.987 559.205 554.684 539.945 590.357 T
832.218 711.127 789.782 711.127 811 745.714 T
1 W
0.0236323 0.0236323 0.0236323 C
751.561 378.454 LS
743.83 329.919 L
783.453 351.643 L
751.561 378.454 LE
805.623 387.238 LS
751.561 378.454 L
783.453 351.643 L
805.623 387.238 LE
795.23 429.508 LS
751.561 378.454 L
805.623 387.238 L
795.23 429.508 LE
749.385 441.112 LS
751.561 378.454 L
795.23 429.508 L
749.385 441.112 LE
714.048 400.479 LS
751.561 378.454 L
749.385 441.112 L
714.048 400.479 LE
743.83 329.919 LS
751.561 378.454 L
702.024 356.424 L
743.83 329.919 LE
702.024 356.424 LS
751.561 378.454 L
714.048 400.479 L
702.024 356.424 LE
841.536 415.206 LS
795.23 429.508 L
805.623 387.238 L
841.536 415.206 L
805.623 387.238 L
840.435 351.889 L
841.536 415.206 LE
840.435 351.889 LS
805.623 387.238 L
783.453 351.643 L
840.435 351.889 LE
883.868 397.084 LS
841.536 415.206 L
840.435 351.889 L
883.868 397.084 LE
881.191 329.467 LS
883.868 397.084 L
840.435 351.889 L
881.191 329.467 LE
812.551 318.54 LS
840.435 351.889 L
783.453 351.643 L
812.551 318.54 LE
881.191 329.467 LS
840.435 351.889 L
853.352 294.513 L
881.191 329.467 LE
853.352 294.513 LS
840.435 351.889 L
812.551 318.54 L
853.352 294.513 LE
812.551 318.54 LS
783.453 351.643 L
771.856 293.806 L
812.551 318.54 LE
771.856 293.806 LS
783.453 351.643 L
743.83 329.919 L
771.856 293.806 LE
853.352 294.513 LS
812.551 318.54 L
812.504 261.506 L
853.352 294.513 LE
812.504 261.506 LS
812.551 318.54 L
771.856 293.806 L
812.504 261.506 LE
701.973 312.353 LS
743.83 329.919 L
702.024 356.424 L
701.973 312.353 LE
771.856 293.806 LS
743.83 329.919 L
729.559 273.241 L
771.856 293.806 LE
729.559 273.241 LS
743.83 329.919 L
701.973 312.353 L
729.559 273.241 LE
812.504 261.506 LS
771.856 293.806 L
774.718 238.777 L
812.504 261.506 LE
774.718 238.777 LS
771.856 293.806 L
729.559 273.241 L
774.718 238.777 LE
721.026 227.716 LS
774.718 238.777 L
729.559 273.241 L
721.026 227.716 L
729.559 273.241 L
675.295 254.293 L
721.026 227.716 LE
675.295 254.293 LS
729.559 273.241 L
701.973 312.353 L
675.295 254.293 LE
658.117 306.53 LS
675.295 254.293 L
701.973 312.353 L
658.117 306.53 L
701.973 312.353 L
658.173 350.524 L
658.117 306.53 LE
658.173 350.524 LS
701.973 312.353 L
702.024 356.424 L
658.173 350.524 L
702.024 356.424 L
665.955 402.144 L
658.173 350.524 LE
665.955 402.144 LS
702.024 356.424 L
714.048 400.479 L
665.955 402.144 L
714.048 400.479 L
705.179 455.544 L
665.955 402.144 LE
705.179 455.544 LS
714.048 400.479 L
749.385 441.112 L
705.179 455.544 LE
661.748 461.323 LS
665.955 402.144 L
705.179 455.544 L
661.748 461.323 LE
701.151 503.698 LS
661.748 461.323 L
705.179 455.544 L
701.151 503.698 L
705.179 455.544 L
746.161 488.844 L
701.151 503.698 LE
746.161 488.844 LS
705.179 455.544 L
749.385 441.112 L
746.161 488.844 L
749.385 441.112 L
792.335 477.665 L
746.161 488.844 LE
792.335 477.665 LS
749.385 441.112 L
795.23 429.508 L
792.335 477.665 L
795.23 429.508 L
838.862 463.485 L
792.335 477.665 LE
838.862 463.485 LS
795.23 429.508 L
841.536 415.206 L
838.862 463.485 L
841.536 415.206 L
884.43 451.834 L
838.862 463.485 LE
884.43 451.834 LS
841.536 415.206 L
883.868 397.084 L
884.43 451.834 LE
920.849 366.302 LS
883.868 397.084 L
881.191 329.467 L
920.849 366.302 LE
884.43 451.834 LS
883.868 397.084 L
924.474 434.364 L
884.43 451.834 LE
924.474 434.364 LS
883.868 397.084 L
920.849 366.302 L
924.474 434.364 LE
960.252 408.677 LS
924.474 434.364 L
920.849 366.302 L
960.252 408.677 LE
956.045 467.856 LS
924.474 434.364 L
960.252 408.677 L
956.045 467.856 LE
884.43 451.834 LS
924.474 434.364 L
914.436 491.062 L
884.43 451.834 LE
914.436 491.062 LS
924.474 434.364 L
956.045 467.856 L
914.436 491.062 LE
838.862 463.485 LS
884.43 451.834 L
869.857 502.294 L
838.862 463.485 LE
869.857 502.294 LS
884.43 451.834 L
914.436 491.062 L
869.857 502.294 LE
792.335 477.665 LS
838.862 463.485 L
823.22 517.299 L
792.335 477.665 LE
823.22 517.299 LS
838.862 463.485 L
869.857 502.294 L
823.22 517.299 LE
746.161 488.844 LS
792.335 477.665 L
780.505 527.272 L
746.161 488.844 LE
780.505 527.272 LS
792.335 477.665 L
823.22 517.299 L
780.505 527.272 LE
701.151 503.698 LS
746.161 488.844 L
740.809 540.533 L
701.151 503.698 LE
740.809 540.533 LS
746.161 488.844 L
780.505 527.272 L
740.809 540.533 LE
768.648 575.487 LS
740.809 540.533 L
780.505 527.272 L
768.648 575.487 L
780.505 527.272 L
820.042 563.666 L
768.648 575.487 LE
820.042 563.666 LS
780.505 527.272 L
823.22 517.299 L
820.042 563.666 L
823.22 517.299 L
869.793 549.08 L
820.042 563.666 LE
869.793 549.08 LS
823.22 517.299 L
869.857 502.294 L
869.793 549.08 LE
809.496 608.494 LS
768.648 575.487 L
820.042 563.666 L
809.496 608.494 L
820.042 563.666 L
867.119 595.964 L
809.496 608.494 LE
867.119 595.964 LS
820.042 563.666 L
869.793 549.08 L
867.119 595.964 LE
869.793 549.08 LS
869.857 502.294 L
915.106 538.628 L
869.793 549.08 LE
915.106 538.628 LS
869.857 502.294 L
914.436 491.062 L
915.106 538.628 L
914.436 491.062 L
963.827 519.476 L
915.106 538.628 LE
963.827 519.476 LS
914.436 491.062 L
956.045 467.856 L
963.827 519.476 LE
867.119 595.964 LS
869.793 549.08 L
912.381 585.721 L
867.119 595.964 LE
912.381 585.721 LS
869.793 549.08 L
915.106 538.628 L
912.381 585.721 L
915.106 538.628 L
963.883 563.469 L
912.381 585.721 LE
963.883 563.469 LS
915.106 538.628 L
963.827 519.476 L
963.883 563.469 LE
946.705 615.707 LS
912.381 585.721 L
963.883 563.469 L
946.705 615.707 LE
867.119 595.964 LS
912.381 585.721 L
900.974 642.284 L
867.119 595.964 LE
900.974 642.284 LS
912.381 585.721 L
946.705 615.707 L
900.974 642.284 LE
809.496 608.494 LS
867.119 595.964 L
847.282 631.223 L
809.496 608.494 LE
847.282 631.223 LS
867.119 595.964 L
900.974 642.284 L
847.282 631.223 LE
963.827 350.524 LS
960.252 408.677 L
920.849 366.302 L
963.827 350.524 L
920.849 366.302 L
922.688 308.816 L
963.827 350.524 LE
922.688 308.816 LS
920.849 366.302 L
881.191 329.467 L
922.688 308.816 L
881.191 329.467 L
895.413 273.173 L
922.688 308.816 LE
895.413 273.173 LS
881.191 329.467 L
853.352 294.513 L
895.413 273.173 L
853.352 294.513 L
851.045 240.169 L
895.413 273.173 LE
851.045 240.169 LS
853.352 294.513 L
812.504 261.506 L
851.045 240.169 LE
963.883 306.53 LS
963.827 350.524 L
922.688 308.816 L
963.883 306.53 L
922.688 308.816 L
946.705 254.293 L
963.883 306.53 LE
946.705 254.293 LS
922.688 308.816 L
895.413 273.173 L
946.705 254.293 L
895.413 273.173 L
900.974 227.716 L
946.705 254.293 LE
900.974 227.716 LS
895.413 273.173 L
851.045 240.169 L
900.974 227.716 LE
658.173 519.476 LS
661.748 461.323 L
701.151 503.698 L
658.173 519.476 L
701.151 503.698 L
699.312 561.184 L
658.173 519.476 LE
699.312 561.184 LS
701.151 503.698 L
740.809 540.533 L
699.312 561.184 L
740.809 540.533 L
726.587 596.827 L
699.312 561.184 LE
726.587 596.827 LS
740.809 540.533 L
768.648 575.487 L
726.587 596.827 L
768.648 575.487 L
770.955 629.831 L
726.587 596.827 LE
770.955 629.831 LS
768.648 575.487 L
809.496 608.494 L
770.955 629.831 LE
658.117 563.469 LS
658.173 519.476 L
699.312 561.184 L
658.117 563.469 L
699.312 561.184 L
675.295 615.707 L
658.117 563.469 LE
675.295 615.707 LS
699.312 561.184 L
726.587 596.827 L
675.295 615.707 L
726.587 596.827 L
721.026 642.284 L
675.295 615.707 LE
721.026 642.284 LS
726.587 596.827 L
770.955 629.831 L
721.026 642.284 LE
995.915 442.608 LS
956.045 467.856 L
960.252 408.677 L
995.915 442.608 L
960.252 408.677 L
1002.09 372.862 L
995.915 442.608 LE
1002.09 372.862 LS
960.252 408.677 L
963.827 350.524 L
1002.09 372.862 LE
963.827 519.476 LS
956.045 467.856 L
1002.09 497.138 L
963.827 519.476 LE
1002.09 497.138 LS
956.045 467.856 L
995.915 442.608 L
1002.09 497.138 LE
1038.14 408.832 LS
995.915 442.608 L
1002.09 372.862 L
1038.14 408.832 LE
1002.09 497.138 LS
995.915 442.608 L
1038.14 461.168 L
1002.09 497.138 LE
1038.14 461.168 LS
995.915 442.608 L
1038.14 408.832 L
1038.14 461.168 LE
626.085 427.392 LS
665.955 402.144 L
661.748 461.323 L
626.085 427.392 L
661.748 461.323 L
619.913 497.138 L
626.085 427.392 LE
619.913 497.138 LS
661.748 461.323 L
658.173 519.476 L
619.913 497.138 LE
658.173 350.524 LS
665.955 402.144 L
619.913 372.862 L
658.173 350.524 LE
619.913 372.862 LS
665.955 402.144 L
626.085 427.392 L
619.913 372.862 LE
583.856 461.168 LS
626.085 427.392 L
619.913 497.138 L
583.856 461.168 LE
619.913 372.862 LS
626.085 427.392 L
583.856 408.832 L
619.913 372.862 LE
583.856 408.832 LS
626.085 427.392 L
583.856 461.168 L
583.856 408.832 LE
1002.09 372.862 LS
963.827 350.524 L
1015.22 322.019 L
1002.09 372.862 LE
1015.22 322.019 LS
963.827 350.524 L
963.883 306.53 L
1015.22 322.019 L
963.883 306.53 L
994.968 271.733 L
1015.22 322.019 LE
994.968 271.733 LS
963.883 306.53 L
946.705 254.293 L
994.968 271.733 LE
619.913 497.138 LS
658.173 519.476 L
606.785 547.981 L
619.913 497.138 LE
606.785 547.981 LS
658.173 519.476 L
658.117 563.469 L
606.785 547.981 L
658.117 563.469 L
627.032 598.267 L
606.785 547.981 LE
627.032 598.267 LS
658.117 563.469 L
675.295 615.707 L
627.032 598.267 LE
963.883 563.469 LS
963.827 519.476 L
1015.22 547.981 L
963.883 563.469 LE
1015.22 547.981 LS
963.827 519.476 L
1002.09 497.138 L
1015.22 547.981 LE
946.705 615.707 LS
963.883 563.469 L
994.968 598.267 L
946.705 615.707 LE
994.968 598.267 LS
963.883 563.469 L
1015.22 547.981 L
994.968 598.267 LE
658.117 306.53 LS
658.173 350.524 L
606.785 322.019 L
658.117 306.53 LE
606.785 322.019 LS
658.173 350.524 L
619.913 372.862 L
606.785 322.019 LE
675.295 254.293 LS
658.117 306.53 L
627.032 271.733 L
675.295 254.293 LE
627.032 271.733 LS
658.117 306.53 L
606.785 322.019 L
627.032 271.733 LE
851.045 240.169 LS
812.504 261.506 L
813.446 202.72 L
851.045 240.169 LE
813.446 202.72 LS
812.504 261.506 L
774.718 238.777 L
813.446 202.72 L
774.718 238.777 L
759.916 194.574 L
813.446 202.72 LE
759.916 194.574 LS
774.718 238.777 L
721.026 227.716 L
759.916 194.574 LE
770.955 629.831 LS
809.496 608.494 L
808.554 667.28 L
770.955 629.831 LE
808.554 667.28 LS
809.496 608.494 L
847.282 631.223 L
808.554 667.28 L
847.282 631.223 L
862.084 675.426 L
808.554 667.28 LE
862.084 675.426 LS
847.282 631.223 L
900.974 642.284 L
862.084 675.426 LE
900.974 227.716 LS
851.045 240.169 L
862.084 194.574 L
900.974 227.716 LE
862.084 194.574 LS
851.045 240.169 L
813.446 202.72 L
862.084 194.574 LE
721.026 642.284 LS
770.955 629.831 L
759.916 675.426 L
721.026 642.284 LE
759.916 675.426 LS
770.955 629.831 L
808.554 667.28 L
759.916 675.426 LE
1038.14 408.832 LS
1002.09 372.862 L
1047.11 358.931 L
1038.14 408.832 LE
1047.11 358.931 LS
1002.09 372.862 L
1015.22 322.019 L
1047.11 358.931 LE
583.856 461.168 LS
619.913 497.138 L
574.889 511.069 L
583.856 461.168 LE
574.889 511.069 LS
619.913 497.138 L
606.785 547.981 L
574.889 511.069 LE
1015.22 547.981 LS
1002.09 497.138 L
1047.11 511.069 L
1015.22 547.981 LE
1047.11 511.069 LS
1002.09 497.138 L
1038.14 461.168 L
1047.11 511.069 LE
606.785 322.019 LS
619.913 372.862 L
574.889 358.931 L
606.785 322.019 LE
574.889 358.931 LS
619.913 372.862 L
583.856 408.832 L
574.889 358.931 LE
789.782 158.873 LS
813.446 202.72 L
759.916 194.574 L
789.782 158.873 LE
862.084 194.574 LS
813.446 202.72 L
832.218 158.873 L
862.084 194.574 LE
832.218 158.873 LS
813.446 202.72 L
789.782 158.873 L
832.218 158.873 LE
832.218 711.127 LS
808.554 667.28 L
862.084 675.426 L
832.218 711.127 LE
759.916 675.426 LS
808.554 667.28 L
789.782 711.127 L
759.916 675.426 LE
789.782 711.127 LS
808.554 667.28 L
832.218 711.127 L
789.782 711.127 LE
1041.15 280.013 LS
1015.22 322.019 L
994.968 271.733 L
1041.15 280.013 LE
1047.11 358.931 LS
1015.22 322.019 L
1062.8 315.316 L
1047.11 358.931 LE
1062.8 315.316 LS
1015.22 322.019 L
1041.15 280.013 L
1062.8 315.316 LE
580.854 589.987 LS
606.785 547.981 L
627.032 598.267 L
580.854 589.987 LE
574.889 511.069 LS
606.785 547.981 L
559.205 554.684 L
574.889 511.069 LE
559.205 554.684 LS
606.785 547.981 L
580.854 589.987 L
559.205 554.684 LE
1041.15 589.987 LS
994.968 598.267 L
1015.22 547.981 L
1041.15 589.987 L
1015.22 547.981 L
1062.8 554.684 L
1041.15 589.987 LE
1062.8 554.684 LS
1015.22 547.981 L
1047.11 511.069 L
1062.8 554.684 LE
580.854 280.013 LS
627.032 271.733 L
606.785 322.019 L
580.854 280.013 L
606.785 322.019 L
559.205 315.316 L
580.854 280.013 LE
559.205 315.316 LS
606.785 322.019 L
574.889 358.931 L
559.205 315.316 LE
1082.06 590.357 LS
1041.15 589.987 L
1062.8 554.684 L
1082.06 590.357 LE
1082.06 279.643 LS
1062.8 315.316 L
1041.15 280.013 L
1082.06 279.643 LE
811 124.286 LS
832.218 158.873 L
789.782 158.873 L
811 124.286 LE
539.945 279.643 LS
580.854 280.013 L
559.205 315.316 L
539.945 279.643 LE
539.945 590.357 LS
559.205 554.684 L
580.854 589.987 L
539.945 590.357 LE
811 745.714 LS
789.782 711.127 L
832.218 711.127 L
811 745.714 LE
(A) 1055 605 15 /Helvetica S
(B) 765 720 15 /Helvetica S
(C) 550 605 15 /Helvetica S
(D) 550 250 15 /Helvetica S
(E) 765 130 15 /Helvetica S
(F) 1055 250 15 /Helvetica S
grestore
showpage
cleartomark
%%PageTrailer
%%Trailer
end
%%EOF
