$MeshFormat
4.1 0 4
$EndMeshFormat
$Nodes
1 105 1 105
2 0 0 105
1
2
3
4
5
6
7
8
9
10
11
12
13
14
15
16
17
18
19
20
21
22
23
24
25
26
27
28
29
30
31
32
33
34
35
36
37
38
39
40
41
42
43
44
45
46
47
48
49
50
51
52
53
54
55
56
57
58
59
60
61
62
63
64
65
66
67
68
69
70
71
72
73
74
75
76
77
78
79
80
81
82
83
84
85
86
87
88
89
90
91
92
93
94
95
96
97
98
99
100
101
102
103
104
105
0.0601387 0.65001 0.453999
0.00593821 0.693052 0.45566
0.0489571 0.714149 0.469049
0.00752887 0.749295 0.3814
-0.0273582 0.720819 0.426059
-0.0127424 0.634515 0.441238
-0.195799 0.644961 0.502675
-0.0632608 0.607796 0.509564
-0.116431 0.658407 0.512548
-0.0535043 0.684801 0.484458
0.033879 0.608264 0.506947
0.00470838 0.572856 0.575859
-0.147545 0.613618 0.575031
-0.0665556 0.623759 0.587642
0.1223 0.618648 0.485272
0.0907976 0.55558 0.577868
0.0586877 0.629445 0.583428
0.0833537 0.670271 0.527481
-0.106053 0.577866 0.642989
-0.0741326 0.529296 0.697611
0.307552 0.511953 0.495245
-0.0227181 0.584064 0.646746
-0.0219224 0.493838 0.752243
0.00539724 0.539478 0.707581
0.0669802 0.493836 0.752072
0.162478 0.432786 0.684453
0.0611188 0.580798 0.643363
0.0879231 0.535945 0.705683
0.209761 0.424356 0.658283
0.267085 0.437179 0.608486
0.261355 0.494125 0.556322
0.174884 0.517528 0.539833
0.229145 0.763204 0.137674
0.267092 0.665958 0.263165
0.268139 0.739206 0.207009
0.351312 0.772907 0.231592
0.323387 0.706849 0.232766
0.391474 0.675199 0.231055
0.396143 0.642879 0.307129
0.328216 0.682326 0.299412
0.18813 0.760408 0.212719
0.139022 0.763504 0.279534
0.0943033 0.755895 0.336209
0.065869 0.729367 0.396436
0.231473 0.728708 0.283815
0.185227 0.728197 0.349976
0.107405 0.691811 0.468423
0.136051 0.719631 0.405896
0.275322 0.689579 0.357342
0.230377 0.682441 0.415714
0.176552 0.678258 0.467775
0.234278 0.564178 0.515067
0.183287 0.641517 0.526719
0.11998 0.628339 0.573077
0.345572 0.655947 0.376412
0.403746 0.593854 0.393676
0.380646 0.585072 0.471251
0.251081 0.62963 0.493484
0.317557 0.633787 0.430817
0.324847 0.597424 0.501812
0.167588 0.515681 0.691182
0.186001 0.597917 0.585969
0.196726 0.512735 0.615186
0.145398 0.563001 0.643273
0.247982 0.837638 0.0674298
0.301381 0.810368 0.148443
0.145913 0.862722 0.071714
0.200753 0.842489 0.153132
-0.240325 0.84008 0.0665877
-0.148436 0.862175 0.073025
-0.0540077 0.873896 0.0743431
0.040366 0.87506 0.0683934
0.0965013 0.862631 0.148339
0.00289849 0.86698 0.158702
-0.0903927 0.861108 0.164306
-0.18474 0.845238 0.161298
-0.277352 0.819108 0.151339
0.149485 0.839627 0.233799
0.0568701 0.849064 0.246113
-0.0352133 0.848686 0.253334
-0.129319 0.839151 0.252027
-0.222193 0.820002 0.243562
-0.314479 0.790092 0.230005
0.0907313 0.824684 0.326409
0.0495901 0.795064 0.420465
-0.00350881 0.826721 0.337062
-0.0989538 0.820228 0.337462
-0.19314 0.804624 0.329397
-0.287856 0.777999 0.315905
-0.381237 0.739694 0.297157
-0.425882 0.687862 0.366268
-0.330426 0.732623 0.389988
-0.234914 0.764647 0.406196
-0.139104 0.784903 0.417279
-0.0451318 0.794267 0.423109
-0.0873855 0.751966 0.506024
-0.180857 0.738655 0.496915
-0.375405 0.678159 0.455619
-0.276186 0.714216 0.482061
-0.327006 0.654612 0.543658
-0.22337 0.685224 0.567178
-0.266708 0.622976 0.630686
-0.168257 0.643755 0.650522
-0.117717 0.589524 0.728022
-0.20716 0.5838 0.705916
$EndNodes
$Elements
1 175 1 175
2 0 2 175
1 44 3 1
2 44 1 47
3 15 1 11
4 15 11 18
5 15 47 1
6 11 1 6
7 6 1 2
8 2 1 3
9 6 2 5
10 6 5 10
11 5 2 3
12 86 95 4
13 86 4 85
14 3 4 5
15 44 85 4
16 44 4 3
17 4 95 5
18 95 96 5
19 5 96 10
20 11 6 8
21 8 6 10
22 97 7 9
23 9 7 13
24 13 7 101
25 101 7 97
26 11 8 12
27 12 8 14
28 14 8 9
29 9 8 10
30 97 9 96
31 13 14 9
32 10 96 9
33 12 17 11
34 18 11 17
35 16 17 12
36 16 12 27
37 22 12 14
38 27 12 22
39 101 103 13
40 14 13 19
41 19 13 103
42 19 22 14
43 54 15 18
44 47 15 51
45 51 15 53
46 53 15 54
47 64 16 27
48 17 16 54
49 54 16 64
50 18 17 54
51 103 104 19
52 22 19 20
53 20 19 104
54 22 20 24
55 23 24 20
56 31 21 52
57 52 21 60
58 27 22 24
59 27 24 28
60 28 24 25
61 25 24 23
62 29 63 26
63 63 61 26
64 64 27 28
65 64 28 61
66 63 29 30
67 63 30 31
68 62 32 52
69 52 32 31
70 31 32 63
71 63 32 62
72 66 33 35
73 35 33 41
74 41 33 68
75 68 33 66
76 45 34 35
77 35 34 37
78 37 34 40
79 40 34 49
80 49 34 45
81 66 35 36
82 41 45 35
83 37 36 35
84 40 38 37
85 40 39 38
86 56 39 55
87 55 39 40
88 55 40 49
89 68 78 41
90 45 41 42
91 42 41 78
92 45 42 46
93 78 84 42
94 46 42 43
95 43 42 84
96 46 43 48
97 48 43 44
98 84 85 43
99 43 85 44
100 47 48 44
101 49 45 46
102 49 46 50
103 50 46 48
104 50 48 51
105 51 48 47
106 55 49 59
107 59 49 50
108 59 50 58
109 58 50 51
110 58 51 53
111 62 52 53
112 53 52 58
113 58 52 60
114 62 53 54
115 62 54 64
116 57 56 59
117 59 56 55
118 57 59 60
119 60 59 58
120 61 63 64
121 64 63 62
122 67 68 65
123 68 66 65
124 72 73 67
125 73 68 67
126 73 78 68
127 77 76 69
128 76 70 69
129 76 75 70
130 75 71 70
131 75 74 71
132 74 72 71
133 74 73 72
134 74 79 73
135 79 78 73
136 75 80 74
137 80 79 74
138 76 81 75
139 81 80 75
140 77 82 76
141 82 81 76
142 83 82 77
143 79 84 78
144 80 86 79
145 86 84 79
146 81 87 80
147 87 86 80
148 82 88 81
149 88 87 81
150 83 89 82
151 89 88 82
152 90 89 83
153 86 85 84
154 87 95 86
155 88 94 87
156 94 95 87
157 89 93 88
158 93 94 88
159 90 92 89
160 92 93 89
161 91 92 90
162 98 92 91
163 98 99 92
164 99 93 92
165 99 97 93
166 97 94 93
167 97 96 94
168 96 95 94
169 99 101 97
170 98 100 99
171 100 101 99
172 102 101 100
173 102 103 101
174 102 105 103
175 105 104 103
$EndElements
