%!PS-Adobe-3.0 EPSF-3.0
%%Title: triangle-Dirichlet
%%Creator: GL2PS 1.4.3, (C) 1999-2020 C. Geuzaine
%%For: Gmsh
%%CreationDate: Thu Aug 08 10:13:27 2024
%%LanguageLevel: 3
%%DocumentData: Clean7Bit
%%Pages: 1
%%BoundingBox: 437 121 1182 752
%%EndComments
%%BeginProlog
/gl2psdict 64 dict def gl2psdict begin
/tryPS3shading false def % set to false to force subdivision
/rThreshold 0.0666667 def % red component subdivision threshold
/gThreshold 0.05 def % green component subdivision threshold
/bThreshold 0.1 def % blue component subdivision threshold
/BD { bind def } bind def
/C  { setrgbcolor } BD
/G  { 0.082 mul exch 0.6094 mul add exch 0.3086 mul add neg 1.0 add setgray } BD
/W  { setlinewidth } BD
/LC  { setlinecap } BD
/LJ  { setlinejoin } BD
/FC { findfont exch /SH exch def SH scalefont setfont } BD
/SW { dup stringwidth pop } BD
/S  { FC moveto show } BD
/SBC{ FC moveto SW -2 div 0 rmoveto show } BD
/SBR{ FC moveto SW neg 0 rmoveto show } BD
/SCL{ FC moveto 0 SH -2 div rmoveto show } BD
/SCC{ FC moveto SW -2 div SH -2 div rmoveto show } BD
/SCR{ FC moveto SW neg SH -2 div rmoveto show } BD
/STL{ FC moveto 0 SH neg rmoveto show } BD
/STC{ FC moveto SW -2 div SH neg rmoveto show } BD
/STR{ FC moveto SW neg SH neg rmoveto show } BD
/FCT { FC translate 0 0 } BD
/SR  { gsave FCT moveto rotate show grestore } BD
/SBCR{ gsave FCT moveto rotate SW -2 div 0 rmoveto show grestore } BD
/SBRR{ gsave FCT moveto rotate SW neg 0 rmoveto show grestore } BD
/SCLR{ gsave FCT moveto rotate 0 SH -2 div rmoveto show grestore} BD
/SCCR{ gsave FCT moveto rotate SW -2 div SH -2 div rmoveto show grestore} BD
/SCRR{ gsave FCT moveto rotate SW neg SH -2 div rmoveto show grestore} BD
/STLR{ gsave FCT moveto rotate 0 SH neg rmoveto show grestore } BD
/STCR{ gsave FCT moveto rotate SW -2 div SH neg rmoveto show grestore } BD
/STRR{ gsave FCT moveto rotate SW neg SH neg rmoveto show grestore } BD
/P  { newpath 0.0 360.0 arc closepath fill } BD
/R  { newpath moveto lineto lineto lineto closepath fill } BD
/LS { newpath moveto } BD
/L  { lineto } BD
/LE { lineto stroke } BD
/T  { newpath moveto lineto lineto closepath fill } BD
/STshfill {
      /b1 exch def /g1 exch def /r1 exch def /y1 exch def /x1 exch def
      /b2 exch def /g2 exch def /r2 exch def /y2 exch def /x2 exch def
      /b3 exch def /g3 exch def /r3 exch def /y3 exch def /x3 exch def
      gsave << /ShadingType 4 /ColorSpace [/DeviceRGB]
      /DataSource [ 0 x1 y1 r1 g1 b1 0 x2 y2 r2 g2 b2 0 x3 y3 r3 g3 b3 ] >>
      shfill grestore } BD
/Tm { 3 -1 roll 8 -1 roll 13 -1 roll add add 3 div
      3 -1 roll 7 -1 roll 11 -1 roll add add 3 div
      3 -1 roll 6 -1 roll 9 -1 roll add add 3 div C T } BD
/STsplit {
      4 index 15 index add 0.5 mul
      4 index 15 index add 0.5 mul
      4 index 15 index add 0.5 mul
      4 index 15 index add 0.5 mul
      4 index 15 index add 0.5 mul
      5 copy 5 copy 25 15 roll
      9 index 30 index add 0.5 mul
      9 index 30 index add 0.5 mul
      9 index 30 index add 0.5 mul
      9 index 30 index add 0.5 mul
      9 index 30 index add 0.5 mul
      5 copy 5 copy 35 5 roll 25 5 roll 15 5 roll
      4 index 10 index add 0.5 mul
      4 index 10 index add 0.5 mul
      4 index 10 index add 0.5 mul
      4 index 10 index add 0.5 mul
      4 index 10 index add 0.5 mul
      5 copy 5 copy 40 5 roll 25 5 roll 15 5 roll 25 5 roll
      STnoshfill STnoshfill STnoshfill STnoshfill } BD
/STnoshfill {
      2 index 8 index sub abs rThreshold gt
      { STsplit }
      { 1 index 7 index sub abs gThreshold gt
        { STsplit }
        { dup 6 index sub abs bThreshold gt
          { STsplit }
          { 2 index 13 index sub abs rThreshold gt
            { STsplit }
            { 1 index 12 index sub abs gThreshold gt
              { STsplit }
              { dup 11 index sub abs bThreshold gt
                { STsplit }
                { 7 index 13 index sub abs rThreshold gt
                  { STsplit }
                  { 6 index 12 index sub abs gThreshold gt
                    { STsplit }
                    { 5 index 11 index sub abs bThreshold gt
                      { STsplit }
                      { Tm }
                      ifelse }
                    ifelse }
                  ifelse }
                ifelse }
              ifelse }
            ifelse }
          ifelse }
        ifelse }
      ifelse } BD
tryPS3shading
{ /shfill where
  { /ST { STshfill } BD }
  { /ST { STnoshfill } BD }
  ifelse }
{ /ST { STnoshfill } BD }
ifelse
end
%%EndProlog
%%BeginSetup
/DeviceRGB setcolorspace
gl2psdict begin
%%EndSetup
%%Page: 1 1
%%BeginPageSetup
%%EndPageSetup
mark
gsave
1.0 1.0 scale
1 W
0.721244 1 0.579288 C
811 745.714 LS
792.717 714.643 L
829.283 714.643 L
811 745.714 LE
847.566 683.571 LS
829.283 714.643 L
811 683.571 L
847.566 683.571 LE
811 683.571 LS
829.283 714.643 L
792.717 714.643 L
811 683.571 L
792.717 714.643 L
774.434 683.571 L
811 683.571 LE
865.849 652.5 LS
847.566 683.571 L
829.283 652.5 L
865.849 652.5 LE
829.283 652.5 LS
847.566 683.571 L
811 683.571 L
829.283 652.5 L
811 683.571 L
792.717 652.5 L
829.283 652.5 LE
792.717 652.5 LS
811 683.571 L
774.434 683.571 L
792.717 652.5 L
774.434 683.571 L
756.151 652.5 L
792.717 652.5 LE
884.132 621.429 LS
865.849 652.5 L
847.566 621.429 L
884.132 621.429 LE
847.566 621.429 LS
865.849 652.5 L
829.283 652.5 L
847.566 621.429 L
829.283 652.5 L
811 621.429 L
847.566 621.429 LE
811 621.429 LS
829.283 652.5 L
792.717 652.5 L
811 621.429 L
792.717 652.5 L
774.434 621.429 L
811 621.429 LE
774.434 621.429 LS
792.717 652.5 L
756.151 652.5 L
774.434 621.429 L
756.151 652.5 L
737.868 621.429 L
774.434 621.429 LE
902.415 590.357 LS
884.132 621.429 L
865.849 590.357 L
902.415 590.357 LE
865.849 590.357 LS
884.132 621.429 L
847.566 621.429 L
865.849 590.357 L
847.566 621.429 L
829.283 590.357 L
865.849 590.357 LE
829.283 590.357 LS
847.566 621.429 L
811 621.429 L
829.283 590.357 L
811 621.429 L
792.717 590.357 L
829.283 590.357 LE
792.717 590.357 LS
811 621.429 L
774.434 621.429 L
792.717 590.357 L
774.434 621.429 L
756.151 590.357 L
792.717 590.357 LE
756.151 590.357 LS
774.434 621.429 L
737.868 621.429 L
756.151 590.357 L
737.868 621.429 L
719.585 590.357 L
756.151 590.357 LE
920.698 559.286 LS
902.415 590.357 L
884.132 559.286 L
920.698 559.286 LE
884.132 559.286 LS
902.415 590.357 L
865.849 590.357 L
884.132 559.286 L
865.849 590.357 L
847.566 559.286 L
884.132 559.286 LE
847.566 559.286 LS
865.849 590.357 L
829.283 590.357 L
847.566 559.286 L
829.283 590.357 L
811 559.286 L
847.566 559.286 LE
811 559.286 LS
829.283 590.357 L
792.717 590.357 L
811 559.286 L
792.717 590.357 L
774.434 559.286 L
811 559.286 LE
774.434 559.286 LS
792.717 590.357 L
756.151 590.357 L
774.434 559.286 L
756.151 590.357 L
737.868 559.286 L
774.434 559.286 LE
737.868 559.286 LS
756.151 590.357 L
719.585 590.357 L
737.868 559.286 L
719.585 590.357 L
701.302 559.286 L
737.868 559.286 LE
938.981 528.214 LS
920.698 559.286 L
902.415 528.214 L
938.981 528.214 LE
902.415 528.214 LS
920.698 559.286 L
884.132 559.286 L
902.415 528.214 L
884.132 559.286 L
865.849 528.214 L
902.415 528.214 LE
865.849 528.214 LS
884.132 559.286 L
847.566 559.286 L
865.849 528.214 L
847.566 559.286 L
829.283 528.214 L
865.849 528.214 LE
829.283 528.214 LS
847.566 559.286 L
811 559.286 L
829.283 528.214 L
811 559.286 L
792.717 528.214 L
829.283 528.214 LE
792.717 528.214 LS
811 559.286 L
774.434 559.286 L
792.717 528.214 L
774.434 559.286 L
756.151 528.214 L
792.717 528.214 LE
756.151 528.214 LS
774.434 559.286 L
737.868 559.286 L
756.151 528.214 L
737.868 559.286 L
719.585 528.214 L
756.151 528.214 LE
719.585 528.214 LS
737.868 559.286 L
701.302 559.286 L
719.585 528.214 L
701.302 559.286 L
683.019 528.214 L
719.585 528.214 LE
957.264 497.143 LS
938.981 528.214 L
920.698 497.143 L
957.264 497.143 LE
920.698 497.143 LS
938.981 528.214 L
902.415 528.214 L
920.698 497.143 L
902.415 528.214 L
884.132 497.143 L
920.698 497.143 LE
884.132 497.143 LS
902.415 528.214 L
865.849 528.214 L
884.132 497.143 L
865.849 528.214 L
847.566 497.143 L
884.132 497.143 LE
847.566 497.143 LS
865.849 528.214 L
829.283 528.214 L
847.566 497.143 L
829.283 528.214 L
811 497.143 L
847.566 497.143 LE
811 497.143 LS
829.283 528.214 L
792.717 528.214 L
811 497.143 L
792.717 528.214 L
774.434 497.143 L
811 497.143 LE
774.434 497.143 LS
792.717 528.214 L
756.151 528.214 L
774.434 497.143 L
756.151 528.214 L
737.868 497.143 L
774.434 497.143 LE
737.868 497.143 LS
756.151 528.214 L
719.585 528.214 L
737.868 497.143 L
719.585 528.214 L
701.302 497.143 L
737.868 497.143 LE
701.302 497.143 LS
719.585 528.214 L
683.019 528.214 L
701.302 497.143 L
683.019 528.214 L
664.736 497.143 L
701.302 497.143 LE
975.547 466.071 LS
957.264 497.143 L
938.981 466.071 L
975.547 466.071 LE
938.981 466.071 LS
957.264 497.143 L
920.698 497.143 L
938.981 466.071 L
920.698 497.143 L
902.415 466.071 L
938.981 466.071 LE
902.415 466.071 LS
920.698 497.143 L
884.132 497.143 L
902.415 466.071 L
884.132 497.143 L
865.849 466.071 L
902.415 466.071 LE
865.849 466.071 LS
884.132 497.143 L
847.566 497.143 L
865.849 466.071 L
847.566 497.143 L
829.283 466.071 L
865.849 466.071 LE
829.283 466.071 LS
847.566 497.143 L
811 497.143 L
829.283 466.071 L
811 497.143 L
792.717 466.071 L
829.283 466.071 LE
792.717 466.071 LS
811 497.143 L
774.434 497.143 L
792.717 466.071 L
774.434 497.143 L
756.151 466.071 L
792.717 466.071 LE
756.151 466.071 LS
774.434 497.143 L
737.868 497.143 L
756.151 466.071 L
737.868 497.143 L
719.585 466.071 L
756.151 466.071 LE
719.585 466.071 LS
737.868 497.143 L
701.302 497.143 L
719.585 466.071 L
701.302 497.143 L
683.019 466.071 L
719.585 466.071 LE
683.019 466.071 LS
701.302 497.143 L
664.736 497.143 L
683.019 466.071 L
664.736 497.143 L
646.453 466.071 L
683.019 466.071 LE
993.829 435 LS
975.547 466.071 L
957.264 435 L
993.829 435 LE
957.264 435 LS
975.547 466.071 L
938.981 466.071 L
957.264 435 L
938.981 466.071 L
920.698 435 L
957.264 435 LE
920.698 435 LS
938.981 466.071 L
902.415 466.071 L
920.698 435 L
902.415 466.071 L
884.132 435 L
920.698 435 LE
884.132 435 LS
902.415 466.071 L
865.849 466.071 L
884.132 435 L
865.849 466.071 L
847.566 435 L
884.132 435 LE
847.566 435 LS
865.849 466.071 L
829.283 466.071 L
847.566 435 L
829.283 466.071 L
811 435 L
847.566 435 LE
811 435 LS
829.283 466.071 L
792.717 466.071 L
811 435 L
792.717 466.071 L
774.434 435 L
811 435 LE
774.434 435 LS
792.717 466.071 L
756.151 466.071 L
774.434 435 L
756.151 466.071 L
737.868 435 L
774.434 435 LE
737.868 435 LS
756.151 466.071 L
719.585 466.071 L
737.868 435 L
719.585 466.071 L
701.302 435 L
737.868 435 LE
701.302 435 LS
719.585 466.071 L
683.019 466.071 L
701.302 435 L
683.019 466.071 L
664.736 435 L
701.302 435 LE
664.736 435 LS
683.019 466.071 L
646.453 466.071 L
664.736 435 L
646.453 466.071 L
628.171 435 L
664.736 435 LE
1012.11 403.929 LS
993.829 435 L
975.547 403.929 L
1012.11 403.929 LE
975.547 403.929 LS
993.829 435 L
957.264 435 L
975.547 403.929 L
957.264 435 L
938.981 403.929 L
975.547 403.929 LE
938.981 403.929 LS
957.264 435 L
920.698 435 L
938.981 403.929 L
920.698 435 L
902.415 403.929 L
938.981 403.929 LE
902.415 403.929 LS
920.698 435 L
884.132 435 L
902.415 403.929 L
884.132 435 L
865.849 403.929 L
902.415 403.929 LE
865.849 403.929 LS
884.132 435 L
847.566 435 L
865.849 403.929 L
847.566 435 L
829.283 403.929 L
865.849 403.929 LE
829.283 403.929 LS
847.566 435 L
811 435 L
829.283 403.929 L
811 435 L
792.717 403.929 L
829.283 403.929 LE
792.717 403.929 LS
811 435 L
774.434 435 L
792.717 403.929 L
774.434 435 L
756.151 403.929 L
792.717 403.929 LE
756.151 403.929 LS
774.434 435 L
737.868 435 L
756.151 403.929 L
737.868 435 L
719.585 403.929 L
756.151 403.929 LE
719.585 403.929 LS
737.868 435 L
701.302 435 L
719.585 403.929 L
701.302 435 L
683.019 403.929 L
719.585 403.929 LE
683.019 403.929 LS
701.302 435 L
664.736 435 L
683.019 403.929 L
664.736 435 L
646.453 403.929 L
683.019 403.929 LE
646.453 403.929 LS
664.736 435 L
628.171 435 L
646.453 403.929 L
628.171 435 L
609.888 403.929 L
646.453 403.929 LE
1030.4 372.857 LS
1012.11 403.929 L
993.829 372.857 L
1030.4 372.857 LE
993.829 372.857 LS
1012.11 403.929 L
975.547 403.929 L
993.829 372.857 L
975.547 403.929 L
957.264 372.857 L
993.829 372.857 LE
957.264 372.857 LS
975.547 403.929 L
938.981 403.929 L
957.264 372.857 L
938.981 403.929 L
920.698 372.857 L
957.264 372.857 LE
920.698 372.857 LS
938.981 403.929 L
902.415 403.929 L
920.698 372.857 L
902.415 403.929 L
884.132 372.857 L
920.698 372.857 LE
884.132 372.857 LS
902.415 403.929 L
865.849 403.929 L
884.132 372.857 L
865.849 403.929 L
847.566 372.857 L
884.132 372.857 LE
847.566 372.857 LS
865.849 403.929 L
829.283 403.929 L
847.566 372.857 L
829.283 403.929 L
811 372.857 L
847.566 372.857 LE
811 372.857 LS
829.283 403.929 L
792.717 403.929 L
811 372.857 L
792.717 403.929 L
774.434 372.857 L
811 372.857 LE
774.434 372.857 LS
792.717 403.929 L
756.151 403.929 L
774.434 372.857 L
756.151 403.929 L
737.868 372.857 L
774.434 372.857 LE
737.868 372.857 LS
756.151 403.929 L
719.585 403.929 L
737.868 372.857 L
719.585 403.929 L
701.302 372.857 L
737.868 372.857 LE
701.302 372.857 LS
719.585 403.929 L
683.019 403.929 L
701.302 372.857 L
683.019 403.929 L
664.736 372.857 L
701.302 372.857 LE
664.736 372.857 LS
683.019 403.929 L
646.453 403.929 L
664.736 372.857 L
646.453 403.929 L
628.171 372.857 L
664.736 372.857 LE
628.171 372.857 LS
646.453 403.929 L
609.888 403.929 L
628.171 372.857 L
609.888 403.929 L
591.605 372.857 L
628.171 372.857 LE
1048.68 341.786 LS
1030.4 372.857 L
1012.11 341.786 L
1048.68 341.786 LE
1012.11 341.786 LS
1030.4 372.857 L
993.829 372.857 L
1012.11 341.786 L
993.829 372.857 L
975.547 341.786 L
1012.11 341.786 LE
975.547 341.786 LS
993.829 372.857 L
957.264 372.857 L
975.547 341.786 L
957.264 372.857 L
938.981 341.786 L
975.547 341.786 LE
938.981 341.786 LS
957.264 372.857 L
920.698 372.857 L
938.981 341.786 L
920.698 372.857 L
902.415 341.786 L
938.981 341.786 LE
902.415 341.786 LS
920.698 372.857 L
884.132 372.857 L
902.415 341.786 L
884.132 372.857 L
865.849 341.786 L
902.415 341.786 LE
865.849 341.786 LS
884.132 372.857 L
847.566 372.857 L
865.849 341.786 L
847.566 372.857 L
829.283 341.786 L
865.849 341.786 LE
829.283 341.786 LS
847.566 372.857 L
811 372.857 L
829.283 341.786 L
811 372.857 L
792.717 341.786 L
829.283 341.786 LE
792.717 341.786 LS
811 372.857 L
774.434 372.857 L
792.717 341.786 L
774.434 372.857 L
756.151 341.786 L
792.717 341.786 LE
756.151 341.786 LS
774.434 372.857 L
737.868 372.857 L
756.151 341.786 L
737.868 372.857 L
719.585 341.786 L
756.151 341.786 LE
719.585 341.786 LS
737.868 372.857 L
701.302 372.857 L
719.585 341.786 L
701.302 372.857 L
683.019 341.786 L
719.585 341.786 LE
683.019 341.786 LS
701.302 372.857 L
664.736 372.857 L
683.019 341.786 L
664.736 372.857 L
646.453 341.786 L
683.019 341.786 LE
646.453 341.786 LS
664.736 372.857 L
628.171 372.857 L
646.453 341.786 L
628.171 372.857 L
609.888 341.786 L
646.453 341.786 LE
609.888 341.786 LS
628.171 372.857 L
591.605 372.857 L
609.888 341.786 L
591.605 372.857 L
573.322 341.786 L
609.888 341.786 LE
1066.96 310.714 LS
1048.68 341.786 L
1030.4 310.714 L
1066.96 310.714 LE
1030.4 310.714 LS
1048.68 341.786 L
1012.11 341.786 L
1030.4 310.714 L
1012.11 341.786 L
993.829 310.714 L
1030.4 310.714 LE
993.829 310.714 LS
1012.11 341.786 L
975.547 341.786 L
993.829 310.714 L
975.547 341.786 L
957.264 310.714 L
993.829 310.714 LE
957.264 310.714 LS
975.547 341.786 L
938.981 341.786 L
957.264 310.714 L
938.981 341.786 L
920.698 310.714 L
957.264 310.714 LE
920.698 310.714 LS
938.981 341.786 L
902.415 341.786 L
920.698 310.714 L
902.415 341.786 L
884.132 310.714 L
920.698 310.714 LE
884.132 310.714 LS
902.415 341.786 L
865.849 341.786 L
884.132 310.714 L
865.849 341.786 L
847.566 310.714 L
884.132 310.714 LE
847.566 310.714 LS
865.849 341.786 L
829.283 341.786 L
847.566 310.714 L
829.283 341.786 L
811 310.714 L
847.566 310.714 LE
811 310.714 LS
829.283 341.786 L
792.717 341.786 L
811 310.714 L
792.717 341.786 L
774.434 310.714 L
811 310.714 LE
774.434 310.714 LS
792.717 341.786 L
756.151 341.786 L
774.434 310.714 L
756.151 341.786 L
737.868 310.714 L
774.434 310.714 LE
737.868 310.714 LS
756.151 341.786 L
719.585 341.786 L
737.868 310.714 L
719.585 341.786 L
701.302 310.714 L
737.868 310.714 LE
701.302 310.714 LS
719.585 341.786 L
683.019 341.786 L
701.302 310.714 L
683.019 341.786 L
664.736 310.714 L
701.302 310.714 LE
664.736 310.714 LS
683.019 341.786 L
646.453 341.786 L
664.736 310.714 L
646.453 341.786 L
628.171 310.714 L
664.736 310.714 LE
628.171 310.714 LS
646.453 341.786 L
609.888 341.786 L
628.171 310.714 L
609.888 341.786 L
591.605 310.714 L
628.171 310.714 LE
591.605 310.714 LS
609.888 341.786 L
573.322 341.786 L
591.605 310.714 L
573.322 341.786 L
555.039 310.714 L
591.605 310.714 LE
1085.24 279.643 LS
1066.96 310.714 L
1048.68 279.643 L
1085.24 279.643 LE
1048.68 279.643 LS
1066.96 310.714 L
1030.4 310.714 L
1048.68 279.643 L
1030.4 310.714 L
1012.11 279.643 L
1048.68 279.643 LE
1012.11 279.643 LS
1030.4 310.714 L
993.829 310.714 L
1012.11 279.643 L
993.829 310.714 L
975.547 279.643 L
1012.11 279.643 LE
975.547 279.643 LS
993.829 310.714 L
957.264 310.714 L
975.547 279.643 L
957.264 310.714 L
938.981 279.643 L
975.547 279.643 LE
938.981 279.643 LS
957.264 310.714 L
920.698 310.714 L
938.981 279.643 L
920.698 310.714 L
902.415 279.643 L
938.981 279.643 LE
902.415 279.643 LS
920.698 310.714 L
884.132 310.714 L
902.415 279.643 L
884.132 310.714 L
865.849 279.643 L
902.415 279.643 LE
865.849 279.643 LS
884.132 310.714 L
847.566 310.714 L
865.849 279.643 L
847.566 310.714 L
829.283 279.643 L
865.849 279.643 LE
829.283 279.643 LS
847.566 310.714 L
811 310.714 L
829.283 279.643 L
811 310.714 L
792.717 279.643 L
829.283 279.643 LE
792.717 279.643 LS
811 310.714 L
774.434 310.714 L
792.717 279.643 L
774.434 310.714 L
756.151 279.643 L
792.717 279.643 LE
756.151 279.643 LS
774.434 310.714 L
737.868 310.714 L
756.151 279.643 L
737.868 310.714 L
719.585 279.643 L
756.151 279.643 LE
719.585 279.643 LS
737.868 310.714 L
701.302 310.714 L
719.585 279.643 L
701.302 310.714 L
683.019 279.643 L
719.585 279.643 LE
683.019 279.643 LS
701.302 310.714 L
664.736 310.714 L
683.019 279.643 L
664.736 310.714 L
646.453 279.643 L
683.019 279.643 LE
646.453 279.643 LS
664.736 310.714 L
628.171 310.714 L
646.453 279.643 L
628.171 310.714 L
609.888 279.643 L
646.453 279.643 LE
609.888 279.643 LS
628.171 310.714 L
591.605 310.714 L
609.888 279.643 L
591.605 310.714 L
573.322 279.643 L
609.888 279.643 LE
573.322 279.643 LS
591.605 310.714 L
555.039 310.714 L
573.322 279.643 L
555.039 310.714 L
536.756 279.643 L
573.322 279.643 LE
1103.53 248.571 LS
1085.24 279.643 L
1066.96 248.571 L
1103.53 248.571 LE
1066.96 248.571 LS
1085.24 279.643 L
1048.68 279.643 L
1066.96 248.571 L
1048.68 279.643 L
1030.4 248.571 L
1066.96 248.571 LE
1030.4 248.571 LS
1048.68 279.643 L
1012.11 279.643 L
1030.4 248.571 L
1012.11 279.643 L
993.829 248.571 L
1030.4 248.571 LE
993.829 248.571 LS
1012.11 279.643 L
975.547 279.643 L
993.829 248.571 L
975.547 279.643 L
957.264 248.571 L
993.829 248.571 LE
957.264 248.571 LS
975.547 279.643 L
938.981 279.643 L
957.264 248.571 L
938.981 279.643 L
920.698 248.571 L
957.264 248.571 LE
920.698 248.571 LS
938.981 279.643 L
902.415 279.643 L
920.698 248.571 L
902.415 279.643 L
884.132 248.571 L
920.698 248.571 LE
884.132 248.571 LS
902.415 279.643 L
865.849 279.643 L
884.132 248.571 L
865.849 279.643 L
847.566 248.571 L
884.132 248.571 LE
847.566 248.571 LS
865.849 279.643 L
829.283 279.643 L
847.566 248.571 L
829.283 279.643 L
811 248.571 L
847.566 248.571 LE
811 248.571 LS
829.283 279.643 L
792.717 279.643 L
811 248.571 L
792.717 279.643 L
774.434 248.571 L
811 248.571 LE
774.434 248.571 LS
792.717 279.643 L
756.151 279.643 L
774.434 248.571 L
756.151 279.643 L
737.868 248.571 L
774.434 248.571 LE
737.868 248.571 LS
756.151 279.643 L
719.585 279.643 L
737.868 248.571 L
719.585 279.643 L
701.302 248.571 L
737.868 248.571 LE
701.302 248.571 LS
719.585 279.643 L
683.019 279.643 L
701.302 248.571 L
683.019 279.643 L
664.736 248.571 L
701.302 248.571 LE
664.736 248.571 LS
683.019 279.643 L
646.453 279.643 L
664.736 248.571 L
646.453 279.643 L
628.171 248.571 L
664.736 248.571 LE
628.171 248.571 LS
646.453 279.643 L
609.888 279.643 L
628.171 248.571 L
609.888 279.643 L
591.605 248.571 L
628.171 248.571 LE
591.605 248.571 LS
609.888 279.643 L
573.322 279.643 L
591.605 248.571 L
573.322 279.643 L
555.039 248.571 L
591.605 248.571 LE
555.039 248.571 LS
573.322 279.643 L
536.756 279.643 L
555.039 248.571 L
536.756 279.643 L
518.473 248.571 L
555.039 248.571 LE
1121.81 217.5 LS
1103.53 248.571 L
1085.24 217.5 L
1121.81 217.5 LE
1085.24 217.5 LS
1103.53 248.571 L
1066.96 248.571 L
1085.24 217.5 L
1066.96 248.571 L
1048.68 217.5 L
1085.24 217.5 LE
1048.68 217.5 LS
1066.96 248.571 L
1030.4 248.571 L
1048.68 217.5 L
1030.4 248.571 L
1012.11 217.5 L
1048.68 217.5 LE
1012.11 217.5 LS
1030.4 248.571 L
993.829 248.571 L
1012.11 217.5 L
993.829 248.571 L
975.547 217.5 L
1012.11 217.5 LE
975.547 217.5 LS
993.829 248.571 L
957.264 248.571 L
975.547 217.5 L
957.264 248.571 L
938.981 217.5 L
975.547 217.5 LE
938.981 217.5 LS
957.264 248.571 L
920.698 248.571 L
938.981 217.5 L
920.698 248.571 L
902.415 217.5 L
938.981 217.5 LE
902.415 217.5 LS
920.698 248.571 L
884.132 248.571 L
902.415 217.5 L
884.132 248.571 L
865.849 217.5 L
902.415 217.5 LE
865.849 217.5 LS
884.132 248.571 L
847.566 248.571 L
865.849 217.5 L
847.566 248.571 L
829.283 217.5 L
865.849 217.5 LE
829.283 217.5 LS
847.566 248.571 L
811 248.571 L
829.283 217.5 L
811 248.571 L
792.717 217.5 L
829.283 217.5 LE
792.717 217.5 LS
811 248.571 L
774.434 248.571 L
792.717 217.5 L
774.434 248.571 L
756.151 217.5 L
792.717 217.5 LE
756.151 217.5 LS
774.434 248.571 L
737.868 248.571 L
756.151 217.5 L
737.868 248.571 L
719.585 217.5 L
756.151 217.5 LE
719.585 217.5 LS
737.868 248.571 L
701.302 248.571 L
719.585 217.5 L
701.302 248.571 L
683.019 217.5 L
719.585 217.5 LE
683.019 217.5 LS
701.302 248.571 L
664.736 248.571 L
683.019 217.5 L
664.736 248.571 L
646.453 217.5 L
683.019 217.5 LE
646.453 217.5 LS
664.736 248.571 L
628.171 248.571 L
646.453 217.5 L
628.171 248.571 L
609.888 217.5 L
646.453 217.5 LE
609.888 217.5 LS
628.171 248.571 L
591.605 248.571 L
609.888 217.5 L
591.605 248.571 L
573.322 217.5 L
609.888 217.5 LE
573.322 217.5 LS
591.605 248.571 L
555.039 248.571 L
573.322 217.5 L
555.039 248.571 L
536.756 217.5 L
573.322 217.5 LE
536.756 217.5 LS
555.039 248.571 L
518.473 248.571 L
536.756 217.5 L
518.473 248.571 L
500.19 217.5 L
536.756 217.5 LE
1140.09 186.429 LS
1121.81 217.5 L
1103.53 186.429 L
1140.09 186.429 LE
1103.53 186.429 LS
1121.81 217.5 L
1085.24 217.5 L
1103.53 186.429 L
1085.24 217.5 L
1066.96 186.429 L
1103.53 186.429 LE
1066.96 186.429 LS
1085.24 217.5 L
1048.68 217.5 L
1066.96 186.429 L
1048.68 217.5 L
1030.4 186.429 L
1066.96 186.429 LE
1030.4 186.429 LS
1048.68 217.5 L
1012.11 217.5 L
1030.4 186.429 L
1012.11 217.5 L
993.829 186.429 L
1030.4 186.429 LE
993.829 186.429 LS
1012.11 217.5 L
975.547 217.5 L
993.829 186.429 L
975.547 217.5 L
957.264 186.429 L
993.829 186.429 LE
957.264 186.429 LS
975.547 217.5 L
938.981 217.5 L
957.264 186.429 L
938.981 217.5 L
920.698 186.429 L
957.264 186.429 LE
920.698 186.429 LS
938.981 217.5 L
902.415 217.5 L
920.698 186.429 L
902.415 217.5 L
884.132 186.429 L
920.698 186.429 LE
884.132 186.429 LS
902.415 217.5 L
865.849 217.5 L
884.132 186.429 L
865.849 217.5 L
847.566 186.429 L
884.132 186.429 LE
847.566 186.429 LS
865.849 217.5 L
829.283 217.5 L
847.566 186.429 L
829.283 217.5 L
811 186.429 L
847.566 186.429 LE
811 186.429 LS
829.283 217.5 L
792.717 217.5 L
811 186.429 L
792.717 217.5 L
774.434 186.429 L
811 186.429 LE
774.434 186.429 LS
792.717 217.5 L
756.151 217.5 L
774.434 186.429 L
756.151 217.5 L
737.868 186.429 L
774.434 186.429 LE
737.868 186.429 LS
756.151 217.5 L
719.585 217.5 L
737.868 186.429 L
719.585 217.5 L
701.302 186.429 L
737.868 186.429 LE
701.302 186.429 LS
719.585 217.5 L
683.019 217.5 L
701.302 186.429 L
683.019 217.5 L
664.736 186.429 L
701.302 186.429 LE
664.736 186.429 LS
683.019 217.5 L
646.453 217.5 L
664.736 186.429 L
646.453 217.5 L
628.171 186.429 L
664.736 186.429 LE
628.171 186.429 LS
646.453 217.5 L
609.888 217.5 L
628.171 186.429 L
609.888 217.5 L
591.605 186.429 L
628.171 186.429 LE
591.605 186.429 LS
609.888 217.5 L
573.322 217.5 L
591.605 186.429 L
573.322 217.5 L
555.039 186.429 L
591.605 186.429 LE
555.039 186.429 LS
573.322 217.5 L
536.756 217.5 L
555.039 186.429 L
536.756 217.5 L
518.473 186.429 L
555.039 186.429 LE
518.473 186.429 LS
536.756 217.5 L
500.19 217.5 L
518.473 186.429 L
500.19 217.5 L
481.907 186.429 L
518.473 186.429 LE
1158.38 155.357 LS
1140.09 186.429 L
1121.81 155.357 L
1158.38 155.357 LE
1121.81 155.357 LS
1140.09 186.429 L
1103.53 186.429 L
1121.81 155.357 L
1103.53 186.429 L
1085.24 155.357 L
1121.81 155.357 LE
1085.24 155.357 LS
1103.53 186.429 L
1066.96 186.429 L
1085.24 155.357 L
1066.96 186.429 L
1048.68 155.357 L
1085.24 155.357 LE
1048.68 155.357 LS
1066.96 186.429 L
1030.4 186.429 L
1048.68 155.357 L
1030.4 186.429 L
1012.11 155.357 L
1048.68 155.357 LE
1012.11 155.357 LS
1030.4 186.429 L
993.829 186.429 L
1012.11 155.357 L
993.829 186.429 L
975.547 155.357 L
1012.11 155.357 LE
975.547 155.357 LS
993.829 186.429 L
957.264 186.429 L
975.547 155.357 L
957.264 186.429 L
938.981 155.357 L
975.547 155.357 LE
938.981 155.357 LS
957.264 186.429 L
920.698 186.429 L
938.981 155.357 L
920.698 186.429 L
902.415 155.357 L
938.981 155.357 LE
902.415 155.357 LS
920.698 186.429 L
884.132 186.429 L
902.415 155.357 L
884.132 186.429 L
865.849 155.357 L
902.415 155.357 LE
865.849 155.357 LS
884.132 186.429 L
847.566 186.429 L
865.849 155.357 L
847.566 186.429 L
829.283 155.357 L
865.849 155.357 LE
829.283 155.357 LS
847.566 186.429 L
811 186.429 L
829.283 155.357 L
811 186.429 L
792.717 155.357 L
829.283 155.357 LE
792.717 155.357 LS
811 186.429 L
774.434 186.429 L
792.717 155.357 L
774.434 186.429 L
756.151 155.357 L
792.717 155.357 LE
756.151 155.357 LS
774.434 186.429 L
737.868 186.429 L
756.151 155.357 L
737.868 186.429 L
719.585 155.357 L
756.151 155.357 LE
719.585 155.357 LS
737.868 186.429 L
701.302 186.429 L
719.585 155.357 L
701.302 186.429 L
683.019 155.357 L
719.585 155.357 LE
683.019 155.357 LS
701.302 186.429 L
664.736 186.429 L
683.019 155.357 L
664.736 186.429 L
646.453 155.357 L
683.019 155.357 LE
646.453 155.357 LS
664.736 186.429 L
628.171 186.429 L
646.453 155.357 L
628.171 186.429 L
609.888 155.357 L
646.453 155.357 LE
609.888 155.357 LS
628.171 186.429 L
591.605 186.429 L
609.888 155.357 L
591.605 186.429 L
573.322 155.357 L
609.888 155.357 LE
573.322 155.357 LS
591.605 186.429 L
555.039 186.429 L
573.322 155.357 L
555.039 186.429 L
536.756 155.357 L
573.322 155.357 LE
536.756 155.357 LS
555.039 186.429 L
518.473 186.429 L
536.756 155.357 L
518.473 186.429 L
500.19 155.357 L
536.756 155.357 LE
500.19 155.357 LS
518.473 186.429 L
481.907 186.429 L
500.19 155.357 L
481.907 186.429 L
463.624 155.357 L
500.19 155.357 LE
1176.66 124.286 LS
1158.38 155.357 L
1140.09 124.286 L
1176.66 124.286 LE
1140.09 124.286 LS
1158.38 155.357 L
1121.81 155.357 L
1140.09 124.286 L
1121.81 155.357 L
1103.53 124.286 L
1140.09 124.286 LE
1103.53 124.286 LS
1121.81 155.357 L
1085.24 155.357 L
1103.53 124.286 L
1085.24 155.357 L
1066.96 124.286 L
1103.53 124.286 LE
1066.96 124.286 LS
1085.24 155.357 L
1048.68 155.357 L
1066.96 124.286 L
1048.68 155.357 L
1030.4 124.286 L
1066.96 124.286 LE
1030.4 124.286 LS
1048.68 155.357 L
1012.11 155.357 L
1030.4 124.286 L
1012.11 155.357 L
993.829 124.286 L
1030.4 124.286 LE
993.829 124.286 LS
1012.11 155.357 L
975.547 155.357 L
993.829 124.286 L
975.547 155.357 L
957.264 124.286 L
993.829 124.286 LE
957.264 124.286 LS
975.547 155.357 L
938.981 155.357 L
957.264 124.286 L
938.981 155.357 L
920.698 124.286 L
957.264 124.286 LE
920.698 124.286 LS
938.981 155.357 L
902.415 155.357 L
920.698 124.286 L
902.415 155.357 L
884.132 124.286 L
920.698 124.286 LE
884.132 124.286 LS
902.415 155.357 L
865.849 155.357 L
884.132 124.286 L
865.849 155.357 L
847.566 124.286 L
884.132 124.286 LE
847.566 124.286 LS
865.849 155.357 L
829.283 155.357 L
847.566 124.286 L
829.283 155.357 L
811 124.286 L
847.566 124.286 LE
811 124.286 LS
829.283 155.357 L
792.717 155.357 L
811 124.286 L
792.717 155.357 L
774.434 124.286 L
811 124.286 LE
774.434 124.286 LS
792.717 155.357 L
756.151 155.357 L
774.434 124.286 L
756.151 155.357 L
737.868 124.286 L
774.434 124.286 LE
737.868 124.286 LS
756.151 155.357 L
719.585 155.357 L
737.868 124.286 L
719.585 155.357 L
701.302 124.286 L
737.868 124.286 LE
701.302 124.286 LS
719.585 155.357 L
683.019 155.357 L
701.302 124.286 L
683.019 155.357 L
664.736 124.286 L
701.302 124.286 LE
664.736 124.286 LS
683.019 155.357 L
646.453 155.357 L
664.736 124.286 L
646.453 155.357 L
628.171 124.286 L
664.736 124.286 LE
628.171 124.286 LS
646.453 155.357 L
609.888 155.357 L
628.171 124.286 L
609.888 155.357 L
591.605 124.286 L
628.171 124.286 LE
591.605 124.286 LS
609.888 155.357 L
573.322 155.357 L
591.605 124.286 L
573.322 155.357 L
555.039 124.286 L
591.605 124.286 LE
555.039 124.286 LS
573.322 155.357 L
536.756 155.357 L
555.039 124.286 L
536.756 155.357 L
518.473 124.286 L
555.039 124.286 LE
518.473 124.286 LS
536.756 155.357 L
500.19 155.357 L
518.473 124.286 L
500.19 155.357 L
481.907 124.286 L
518.473 124.286 LE
481.907 124.286 LS
500.19 155.357 L
463.624 155.357 L
481.907 124.286 L
463.624 155.357 L
445.341 124.286 L
481.907 124.286 LE
0.717188 0.0236323 0.0236323 C
801.042 728.792 LS
820.958 728.792 LE
0.506282 0.0236323 0.0236323 C
811 745.714 LS
811 745.714 LE
1 0.125029 0.0236323 C
841.741 693.471 LS
817.287 694.256 LE
0.944317 0.0236323 0.0236323 C
831.037 711.661 LS
827.594 711.772 LE
1 0.125029 0.0236323 C
817.287 694.256 LS
804.713 694.256 LE
0.944317 0.0236323 0.0236323 C
827.594 711.772 LS
794.406 711.772 LE
1 0.125029 0.0236323 C
804.713 694.256 LS
780.259 693.471 LE
0.944317 0.0236323 0.0236323 C
794.406 711.772 LS
790.963 711.661 LE
1 0.563064 0.0236323 C
864.407 654.95 LS
832.018 657.148 LE
1 0.335935 0.0236323 C
852.838 674.611 LS
842.698 675.299 LE
1 0.563064 0.0236323 C
832.018 657.148 LS
826.439 657.334 LE
1 0.335935 0.0236323 C
842.698 675.299 LS
815.332 676.21 LE
1 0.563064 0.0236323 C
826.439 657.334 LS
795.561 657.334 LE
1 0.335935 0.0236323 C
815.332 676.21 LS
806.668 676.21 LE
1 0.563064 0.0236323 C
795.561 657.334 LS
789.982 657.148 LE
1 0.335935 0.0236323 C
806.668 676.21 LS
779.302 675.299 LE
1 0.563064 0.0236323 C
789.982 657.148 LS
757.593 654.95 LE
1 0.335935 0.0236323 C
779.302 675.299 LS
769.162 674.611 LE
1 0.77397 0.0236323 C
876.868 633.773 LS
856.147 636.012 L
838.242 637.275 L
820.696 637.907 L
801.304 637.907 L
783.758 637.275 L
765.853 636.012 L
745.132 633.773 LE
0.928094 1 0.181812 C
888.734 590.357 LS
867.744 593.578 LE
1 1 0.0236323 C
889.97 611.507 LS
879.26 613.15 LE
0.928094 1 0.181812 C
867.744 593.578 LS
863.685 594.034 LE
1 1 0.0236323 C
879.26 613.15 LS
850.535 616.383 LE
0.928094 1 0.181812 C
863.685 594.034 LS
832.84 596.403 LE
1 1 0.0236323 C
850.535 616.383 LS
844.854 616.82 LE
0.928094 1 0.181812 C
832.84 596.403 LS
825.565 596.676 LE
1 1 0.0236323 C
844.854 616.82 LS
813.009 618.014 LE
0.928094 1 0.181812 C
825.565 596.676 LS
796.434 596.674 LE
1 1 0.0236323 C
813.009 618.014 LS
808.991 618.014 LE
0.928094 1 0.181812 C
796.434 596.674 LS
789.16 596.401 LE
1 1 0.0236323 C
808.991 618.014 LS
777.146 616.819 LE
0.928094 1 0.181812 C
789.16 596.401 LS
758.315 594.034 LE
1 1 0.0236323 C
777.146 616.819 LS
771.465 616.383 LE
0.928094 1 0.181812 C
758.315 594.034 LS
754.256 593.578 LE
1 1 0.0236323 C
771.465 616.383 LS
742.74 613.15 LE
0.928094 1 0.181812 C
754.256 593.578 LS
733.266 590.357 LE
1 1 0.0236323 C
742.74 613.15 LS
732.03 611.507 LE
0.717188 1 0.392717 C
919.196 561.838 LS
889.25 567.984 LE
0.928094 1 0.181812 C
903.918 587.803 LS
901.236 588.353 LE
0.717188 1 0.392717 C
889.25 567.984 LS
877.948 569.795 LE
0.928094 1 0.181812 C
901.236 588.353 LS
888.734 590.357 LE
0.717188 1 0.392717 C
877.948 569.795 LS
855.385 572.574 L
838.973 573.89 L
820.05 574.666 L
801.95 574.666 L
783.027 573.889 L
766.615 572.574 L
744.052 569.795 L
732.75 567.984 LE
0.928094 1 0.181812 C
720.764 588.353 LS
733.266 590.357 LE
0.717188 1 0.392717 C
732.75 567.984 LS
702.804 561.838 LE
0.928094 1 0.181812 C
720.764 588.353 LS
718.082 587.803 LE
0.490059 1 0.619847 C
936.122 533.072 LS
909.431 540.139 L
893.365 543.594 L
876.636 546.547 L
853.289 549.559 L
842.408 550.519 L
815.477 551.678 L
806.523 551.678 L
779.592 550.519 L
768.711 549.559 L
745.364 546.547 L
728.635 543.594 L
712.569 540.139 L
685.878 533.072 LE
0.279153 1 0.830752 C
955.163 500.712 LS
928.113 509.745 L
910.377 514.683 L
896.412 518.013 L
868.84 523.131 LE
0.0641911 1 1 C
865.041 497.143 LS
848.923 499.449 LE
0.279153 1 0.830752 C
868.84 523.131 LS
863.322 523.921 LE
0.0641911 1 1 C
848.923 499.449 LS
846.052 499.716 LE
0.279153 1 0.830752 C
863.322 523.921 LS
829.989 527.014 LE
0.0641911 1 1 C
846.052 499.716 LS
813.43 501.272 LE
0.279153 1 0.830752 C
829.989 527.014 LS
828.615 527.08 LE
0.0641911 1 1 C
813.43 501.272 LS
808.57 501.272 LE
0.279153 1 0.830752 C
828.615 527.08 LS
793.385 527.08 LE
0.0641911 1 1 C
808.57 501.272 LS
775.948 499.716 LE
0.279153 1 0.830752 C
793.385 527.08 LS
792.011 527.014 LE
0.0641911 1 1 C
775.948 499.716 LS
773.077 499.449 LE
0.279153 1 0.830752 C
792.011 527.014 LS
758.678 523.921 LE
0.0641911 1 1 C
773.077 499.449 LS
756.959 497.143 LE
0.279153 1 0.830752 C
758.678 523.921 LS
753.16 523.131 L
725.588 518.013 L
711.623 514.683 L
693.887 509.745 L
666.837 500.712 LE
0.0641911 1 1 C
970.069 466.071 LS
945.086 476.447 L
929.679 481.88 L
914.499 486.608 L
886.125 493.755 LE
0.0236323 0.871311 1 C
880.39 466.071 LS
867.432 468.762 LE
0.0641911 1 1 C
886.125 493.755 LS
882.573 494.493 LE
0.0236323 0.871311 1 C
867.432 468.762 LS
863.956 469.288 LE
0.0641911 1 1 C
882.573 494.493 LS
865.041 497.143 LE
0.0236323 0.871311 1 C
863.956 469.288 LS
833.063 472.495 L
825.272 472.888 L
796.728 472.888 L
788.937 472.495 L
758.044 469.288 L
754.568 468.762 LE
0.0641911 1 1 C
739.427 494.493 LS
756.959 497.143 LE
0.0236323 0.871311 1 C
754.568 468.762 LS
741.61 466.071 LE
0.0641911 1 1 C
739.427 494.493 LS
735.875 493.755 L
707.501 486.608 L
692.321 481.88 L
676.914 476.447 L
651.931 466.071 LE
0.0236323 0.871311 1 C
969.506 435 LS
960.1 439.82 LE
0.0641911 1 1 C
977.649 462.499 LS
974.418 464.154 LE
0.0236323 0.871311 1 C
960.1 439.82 LS
952.441 443.196 LE
0.0641911 1 1 C
974.418 464.154 LS
970.069 466.071 LE
0.0236323 0.871311 1 C
952.441 443.196 LS
930.635 451.888 L
905.961 460.045 L
899.886 461.775 L
880.39 466.071 LE
0.0236323 0.660406 1 C
881.726 435 LS
850.686 440.303 L
844.013 441.038 L
815.508 442.661 L
806.492 442.661 L
777.987 441.038 L
771.314 440.303 L
740.274 435 LE
0.0236323 0.871311 1 C
722.114 461.775 LS
741.61 466.071 LE
722.114 461.775 LS
716.039 460.045 L
691.365 451.888 L
669.559 443.196 L
661.9 439.82 LE
0.0641911 1 1 C
647.582 464.154 LS
651.931 466.071 LE
0.0236323 0.871311 1 C
661.9 439.82 LS
652.494 435 LE
0.0641911 1 1 C
647.582 464.154 LS
644.351 462.499 LE
0.0236323 0.871311 1 C
1006.74 413.057 LS
987.906 424.933 L
969.506 435 LE
0.0236323 0.660406 1 C
963.115 403.929 LS
944.504 413.316 L
929.767 419.587 L
914.931 425.199 L
884.446 434.466 LE
0.0236323 0.433276 1 C
866.485 403.929 LS
865.931 404.068 LE
0.0236323 0.660406 1 C
884.446 434.466 LS
883.899 434.604 LE
0.0236323 0.433276 1 C
865.931 404.068 LS
865.747 404.102 LE
0.0236323 0.660406 1 C
883.899 434.604 LS
881.726 435 LE
0.0236323 0.433276 1 C
865.747 404.102 LS
831.897 408.37 L
826.475 408.7 L
795.525 408.7 L
790.103 408.37 L
756.253 404.102 L
756.069 404.068 LE
0.0236323 0.660406 1 C
738.101 434.604 LS
740.274 435 LE
0.0236323 0.433276 1 C
756.069 404.068 LS
755.515 403.929 LE
0.0236323 0.660406 1 C
738.101 434.604 LS
737.554 434.466 L
707.069 425.199 L
692.233 419.587 L
677.496 413.316 L
658.885 403.929 LE
0.0236323 0.871311 1 C
634.094 424.933 LS
652.494 435 LE
634.094 424.933 LS
615.259 413.057 LE
0.0236323 0.660406 1 C
1009.83 372.857 LS
998.848 381.386 L
982.148 392.709 L
972.539 398.817 L
963.115 403.929 LE
0.0236323 0.433276 1 C
949.961 372.857 LS
927.292 384.064 L
909.953 391.117 L
897.47 395.525 L
866.485 403.929 LE
724.53 395.525 LS
755.515 403.929 LE
724.53 395.525 LS
712.047 391.117 L
694.708 384.064 L
672.039 372.857 LE
0.0236323 0.660406 1 C
649.461 398.817 LS
658.885 403.929 LE
649.461 398.817 LS
639.852 392.709 L
623.152 381.386 L
612.173 372.857 LE
1043.8 341.786 LS
1023.58 361.267 L
1009.83 372.857 LE
0.0236323 0.433276 1 C
994.523 341.786 LS
981.634 352.13 L
961.143 366.264 L
955.511 369.88 L
949.961 372.857 LE
0.0236323 0.22237 1 C
926.664 341.786 LS
907.769 350.885 L
893.943 356.183 L
877.438 361.482 L
850.633 367.645 L
845.028 368.544 L
812.051 371.072 L
809.949 371.072 L
776.972 368.544 L
771.367 367.645 L
744.562 361.482 L
728.057 356.183 L
714.231 350.885 L
695.336 341.786 LE
0.0236323 0.433276 1 C
666.488 369.88 LS
672.039 372.857 LE
666.488 369.88 LS
660.857 366.264 L
640.366 352.13 L
627.477 341.786 LE
0.0236323 0.660406 1 C
598.424 361.267 LS
612.173 372.857 LE
598.424 361.267 LS
578.197 341.786 LE
1059.75 322.974 LS
1046.81 338.608 L
1043.8 341.786 LE
0.0236323 0.433276 1 C
1026.51 310.714 LS
1006.11 331.578 L
994.523 341.786 LE
0.0236323 0.22237 1 C
971.978 310.714 LS
962.117 318.963 L
945.529 330.657 L
936.058 336.819 L
926.664 341.786 LE
0.0236323 0.0236323 1 C
887.138 310.714 LS
884.777 311.811 L
883.148 312.385 L
853.426 320.673 L
840.35 322.978 L
819.364 324.928 L
802.636 324.928 L
781.65 322.978 L
768.574 320.673 L
738.852 312.385 L
737.223 311.811 L
734.862 310.714 LE
0.0236323 0.22237 1 C
685.942 336.819 LS
695.336 341.786 LE
685.942 336.819 LS
676.471 330.657 L
659.883 318.963 L
650.022 310.714 LE
0.0236323 0.433276 1 C
615.894 331.578 LS
627.477 341.786 LE
615.894 331.578 LS
595.487 310.714 LE
0.0236323 0.660406 1 C
575.192 338.608 LS
578.197 341.786 LE
575.192 338.608 LS
562.253 322.974 LE
0.0236323 0.433276 1 C
1050.06 279.643 LS
1049.34 280.762 L
1042.97 289.337 L
1028.84 308.065 L
1026.51 310.714 LE
0.0236323 0.22237 1 C
1002.31 279.643 LS
986.085 297.553 L
971.978 310.714 LE
0.0236323 0.0236323 1 C
939.477 279.643 LS
939.15 279.931 L
938.558 280.361 L
912.855 297.385 L
887.138 310.714 LE
709.145 297.385 LS
734.862 310.714 LE
709.145 297.385 LS
683.442 280.361 L
682.85 279.931 L
682.523 279.643 LE
0.0236323 0.22237 1 C
635.915 297.553 LS
650.022 310.714 LE
635.915 297.553 LS
619.691 279.643 LE
0.0236323 0.433276 1 C
593.163 308.065 LS
595.487 310.714 LE
593.163 308.065 LS
579.026 289.337 L
572.663 280.762 L
571.938 279.643 LE
1067.65 248.571 LS
1067.34 249.209 L
1050.06 279.643 LE
0.0236323 0.22237 1 C
1023.98 248.571 LS
1007.94 272.555 L
1002.31 279.643 LE
0.0236323 0.0236323 1 C
968.888 248.571 LS
962.128 256.839 L
939.477 279.643 LE
0.0236323 0.0236323 0.814529 C
879.872 248.571 LS
853.817 259.195 L
839.142 262.888 L
820.884 265.369 L
801.116 265.369 L
782.858 262.888 L
768.183 259.195 L
742.128 248.571 LE
0.0236323 0.0236323 1 C
659.872 256.839 LS
682.523 279.643 LE
659.872 256.839 LS
653.112 248.571 LE
0.0236323 0.22237 1 C
614.058 272.555 LS
619.691 279.643 LE
614.058 272.555 LS
598.015 248.571 LE
0.0236323 0.433276 1 C
554.664 249.209 LS
571.938 279.643 LE
554.664 249.209 LS
554.351 248.571 LE
0.0236323 0.660406 1 C
1106.35 243.777 LS
1115.64 217.5 LE
0.0236323 0.433276 1 C
1069.31 244.574 LS
1067.65 248.571 LE
1069.31 244.574 LS
1080.25 217.5 LE
0.0236323 0.22237 1 C
1039.17 217.5 LS
1027.13 243.027 L
1023.98 248.571 LE
0.0236323 0.0236323 1 C
988.961 217.5 LS
982.385 229.122 L
968.888 248.571 LE
0.0236323 0.0236323 0.814529 C
917.395 217.5 LS
908.171 227.282 L
886.408 244.704 L
883.193 246.976 L
879.872 248.571 LE
738.807 246.976 LS
742.128 248.571 LE
738.807 246.976 LS
735.592 244.704 L
713.829 227.282 L
704.605 217.5 LE
0.0236323 0.0236323 1 C
639.615 229.122 LS
653.112 248.571 LE
639.615 229.122 LS
633.039 217.5 LE
0.0236323 0.22237 1 C
594.867 243.027 LS
598.015 248.571 LE
594.867 243.027 LS
582.832 217.5 LE
0.0236323 0.433276 1 C
541.745 217.5 LS
552.686 244.574 L
554.351 248.571 LE
0.0236323 0.660406 1 C
506.36 217.5 LS
515.652 243.777 LE
1123.24 186.429 LS
1117.65 210.428 L
1115.64 217.5 LE
0.0236323 0.433276 1 C
1088.78 186.429 LS
1082.03 212.035 L
1080.25 217.5 LE
0.0236323 0.22237 1 C
1049.36 186.429 LS
1042.89 207.668 L
1039.17 217.5 LE
0.0236323 0.0236323 1 C
1002.24 186.429 LS
999.051 195.302 L
988.961 217.5 LE
0.0236323 0.0236323 0.814529 C
938.043 186.429 LS
929.544 201.463 L
917.395 217.5 LE
692.456 201.463 LS
704.605 217.5 LE
692.456 201.463 LS
683.957 186.429 LE
0.0236323 0.0236323 1 C
622.949 195.302 LS
633.039 217.5 LE
622.949 195.302 LS
619.757 186.429 LE
0.0236323 0.22237 1 C
579.107 207.668 LS
582.832 217.5 LE
579.107 207.668 LS
572.642 186.429 LE
0.0236323 0.433276 1 C
539.971 212.035 LS
541.745 217.5 LE
539.971 212.035 LS
533.216 186.429 LE
0.0236323 0.660406 1 C
504.351 210.428 LS
506.36 217.5 LE
504.351 210.428 LS
498.765 186.429 LE
1128.07 155.357 LS
1126.97 164.123 L
1123.24 186.429 LE
0.0236323 0.433276 1 C
1094.09 155.357 LS
1092.38 167.481 L
1088.78 186.429 LE
0.0236323 0.22237 1 C
1055.62 155.357 LS
1054.13 164.622 L
1049.36 186.429 LE
0.0236323 0.0236323 1 C
1008.84 160.916 LS
1002.24 186.429 LE
1008.84 160.916 LS
1010.1 155.357 LE
0.0236323 0.0236323 0.814529 C
949.21 155.357 LS
945.895 167.109 L
938.043 186.429 LE
676.105 167.109 LS
683.957 186.429 LE
676.105 167.109 LS
672.79 155.357 LE
0.0236323 0.0236323 1 C
611.904 155.357 LS
613.158 160.916 L
619.757 186.429 LE
0.0236323 0.22237 1 C
567.87 164.622 LS
572.642 186.429 LE
567.87 164.622 LS
566.377 155.357 LE
0.0236323 0.433276 1 C
529.622 167.481 LS
533.216 186.429 LE
529.622 167.481 LS
527.912 155.357 LE
0.0236323 0.660406 1 C
495.032 164.123 LS
498.765 186.429 LE
495.032 164.123 LS
493.933 155.357 LE
0.0236323 0.871311 1 C
1158.96 154.357 LS
1159.84 124.286 LE
0.0236323 0.660406 1 C
1128.83 143.435 LS
1128.07 155.357 LE
1128.83 143.435 LS
1129.45 124.286 LE
0.0236323 0.433276 1 C
1095.31 138.248 LS
1094.09 155.357 LE
1095.31 138.248 LS
1095.83 124.286 LE
0.0236323 0.22237 1 C
1056.74 141.65 LS
1055.62 155.357 LE
1056.74 141.65 LS
1057.49 124.286 LE
0.0236323 0.0236323 1 C
1011.85 124.286 LS
1010.42 152.488 L
1010.1 155.357 LE
0.0236323 0.0236323 0.814529 C
952.496 132.388 LS
949.21 155.357 LE
952.496 132.388 LS
953.14 124.286 LE
0.0236323 0.0236323 0.603623 C
811 124.286 LS
811 124.286 L
811 124.286 L
811 124.286 LE
0.0236323 0.0236323 0.814529 C
668.86 124.286 LS
669.504 132.388 L
672.79 155.357 LE
0.0236323 0.0236323 1 C
611.576 152.488 LS
611.904 155.357 LE
611.576 152.488 LS
610.15 124.286 LE
0.0236323 0.22237 1 C
564.513 124.286 LS
565.256 141.65 L
566.377 155.357 LE
0.0236323 0.433276 1 C
526.171 124.286 LS
526.689 138.248 L
527.912 155.357 LE
0.0236323 0.660406 1 C
492.548 124.286 LS
493.175 143.435 L
493.933 155.357 LE
0.0236323 0.871311 1 C
462.155 124.286 LS
463.035 154.357 LE
grestore
showpage
cleartomark
%%PageTrailer
%%Trailer
end
%%EOF
