%!PS-Adobe-3.0 EPSF-3.0
%%Title:                     fill-blue
%%BoundingBox:     55   20   145   70
%%EndComments


1 setlinecap

gsave 0 setlinewidth 0.9 setgray
60 30 moveto
85 35 lineto
120 35 lineto
140 30 lineto
135 23 129 23 125 22 curveto
119 22 115 23 111 22 curveto
104 21 99 21 94 22 curveto
89 23 84 21 78 22 curveto
71 24 65 25 60 30 curveto
closepath fill grestore

1.3 setlinewidth
1 0.5 0 setrgbcolor
60 30 moveto
85 35 lineto
120 35 lineto
140 30 lineto
stroke

0.8 setlinewidth

40 60 moveto

85 35 moveto 78 22 lineto stroke
85 35 moveto 94 22 lineto stroke
120 35 moveto 111 22 lineto stroke
120 35 moveto 125 22 lineto stroke

gsave
[3 3] 0 setdash
1 setlinewidth
0.9 0.4 0.4 setrgbcolor
120 35 moveto 105 65 lineto  % P
85 35 lineto stroke
grestore

/Helvetica findfont 10 scalefont setfont	
81 40 moveto (A) show
122 39 moveto (B) show
108 65 moveto (P) show


showpage
%%Trailer
%EOF
