%!PS-Adobe-3.0 EPSF-3.0
%%Title: rectangle-irregular
%%Creator: GL2PS 1.4.3, (C) 1999-2020 C. Geuzaine
%%For: Gmsh
%%CreationDate: Mon Nov 18 09:06:11 2024
%%LanguageLevel: 3
%%DocumentData: Clean7Bit
%%Pages: 1
%%BoundingBox: 150 305 920 567
%%EndComments
%%BeginProlog
/gl2psdict 64 dict def gl2psdict begin
/tryPS3shading false def % set to false to force subdivision
/rThreshold 0.0666667 def % red component subdivision threshold
/gThreshold 0.05 def % green component subdivision threshold
/bThreshold 0.1 def % blue component subdivision threshold
/BD { bind def } bind def
/C  { setrgbcolor } BD
/G  { 0.082 mul exch 0.6094 mul add exch 0.3086 mul add neg 1.0 add setgray } BD
/W  { setlinewidth } BD
/LC  { setlinecap } BD
/LJ  { setlinejoin } BD
/FC { findfont exch /SH exch def SH scalefont setfont } BD
/SW { dup stringwidth pop } BD
/S  { FC moveto show } BD
/SBC{ FC moveto SW -2 div 0 rmoveto show } BD
/SBR{ FC moveto SW neg 0 rmoveto show } BD
/SCL{ FC moveto 0 SH -2 div rmoveto show } BD
/SCC{ FC moveto SW -2 div SH -2 div rmoveto show } BD
/SCR{ FC moveto SW neg SH -2 div rmoveto show } BD
/STL{ FC moveto 0 SH neg rmoveto show } BD
/STC{ FC moveto SW -2 div SH neg rmoveto show } BD
/STR{ FC moveto SW neg SH neg rmoveto show } BD
/FCT { FC translate 0 0 } BD
/SR  { gsave FCT moveto rotate show grestore } BD
/SBCR{ gsave FCT moveto rotate SW -2 div 0 rmoveto show grestore } BD
/SBRR{ gsave FCT moveto rotate SW neg 0 rmoveto show grestore } BD
/SCLR{ gsave FCT moveto rotate 0 SH -2 div rmoveto show grestore} BD
/SCCR{ gsave FCT moveto rotate SW -2 div SH -2 div rmoveto show grestore} BD
/SCRR{ gsave FCT moveto rotate SW neg SH -2 div rmoveto show grestore} BD
/STLR{ gsave FCT moveto rotate 0 SH neg rmoveto show grestore } BD
/STCR{ gsave FCT moveto rotate SW -2 div SH neg rmoveto show grestore } BD
/STRR{ gsave FCT moveto rotate SW neg SH neg rmoveto show grestore } BD
/P  { newpath 0.0 360.0 arc closepath fill } BD
/R  { newpath moveto lineto lineto lineto closepath fill } BD
/LS { newpath moveto } BD
/L  { lineto } BD
/LE { lineto stroke } BD
/T  { newpath moveto lineto lineto closepath fill } BD
/STshfill {
      /b1 exch def /g1 exch def /r1 exch def /y1 exch def /x1 exch def
      /b2 exch def /g2 exch def /r2 exch def /y2 exch def /x2 exch def
      /b3 exch def /g3 exch def /r3 exch def /y3 exch def /x3 exch def
      gsave << /ShadingType 4 /ColorSpace [/DeviceRGB]
      /DataSource [ 0 x1 y1 r1 g1 b1 0 x2 y2 r2 g2 b2 0 x3 y3 r3 g3 b3 ] >>
      shfill grestore } BD
/Tm { 3 -1 roll 8 -1 roll 13 -1 roll add add 3 div
      3 -1 roll 7 -1 roll 11 -1 roll add add 3 div
      3 -1 roll 6 -1 roll 9 -1 roll add add 3 div C T } BD
/STsplit {
      4 index 15 index add 0.5 mul
      4 index 15 index add 0.5 mul
      4 index 15 index add 0.5 mul
      4 index 15 index add 0.5 mul
      4 index 15 index add 0.5 mul
      5 copy 5 copy 25 15 roll
      9 index 30 index add 0.5 mul
      9 index 30 index add 0.5 mul
      9 index 30 index add 0.5 mul
      9 index 30 index add 0.5 mul
      9 index 30 index add 0.5 mul
      5 copy 5 copy 35 5 roll 25 5 roll 15 5 roll
      4 index 10 index add 0.5 mul
      4 index 10 index add 0.5 mul
      4 index 10 index add 0.5 mul
      4 index 10 index add 0.5 mul
      4 index 10 index add 0.5 mul
      5 copy 5 copy 40 5 roll 25 5 roll 15 5 roll 25 5 roll
      STnoshfill STnoshfill STnoshfill STnoshfill } BD
/STnoshfill {
      2 index 8 index sub abs rThreshold gt
      { STsplit }
      { 1 index 7 index sub abs gThreshold gt
        { STsplit }
        { dup 6 index sub abs bThreshold gt
          { STsplit }
          { 2 index 13 index sub abs rThreshold gt
            { STsplit }
            { 1 index 12 index sub abs gThreshold gt
              { STsplit }
              { dup 11 index sub abs bThreshold gt
                { STsplit }
                { 7 index 13 index sub abs rThreshold gt
                  { STsplit }
                  { 6 index 12 index sub abs gThreshold gt
                    { STsplit }
                    { 5 index 11 index sub abs bThreshold gt
                      { STsplit }
                      { Tm }
                      ifelse }
                    ifelse }
                  ifelse }
                ifelse }
              ifelse }
            ifelse }
          ifelse }
        ifelse }
      ifelse } BD
tryPS3shading
{ /shfill where
  { /ST { STshfill } BD }
  { /ST { STnoshfill } BD }
  ifelse }
{ /ST { STnoshfill } BD }
ifelse
end
%%EndProlog
%%BeginSetup
/DeviceRGB setcolorspace
gl2psdict begin
%%EndSetup
%%Page: 1 1
%%BeginPageSetup
%%EndPageSetup
mark
gsave
1.0 1.0 scale
1 W
1 0.510338 0.0236323 C
918 532.022 LS
918 562.5 L
841.383 562.5 L
878.643 534.587 L
918 532.022 LE
878.643 534.587 LS
841.383 562.5 L
771.732 562.5 L
803.773 540.424 L
878.643 534.587 LE
803.773 540.424 LS
771.732 562.5 L
708.41 562.5 L
728.415 543.211 L
803.773 540.424 LE
728.415 543.211 LS
708.41 562.5 L
650.849 562.5 L
663.916 544.283 L
728.415 543.211 LE
663.916 544.283 LS
650.849 562.5 L
598.518 562.5 L
607.764 544.751 L
663.916 544.283 LE
607.764 544.751 LS
598.518 562.5 L
550.945 562.5 L
557.95 544.985 L
607.764 544.751 LE
557.95 544.985 LS
550.945 562.5 L
507.697 562.5 L
513.297 545.115 L
557.95 544.985 LE
513.297 545.115 LS
507.697 562.5 L
468.379 562.5 L
473.061 545.192 L
513.297 545.115 LE
473.061 545.192 LS
468.379 562.5 L
432.638 562.5 L
436.693 545.24 L
473.061 545.192 LE
436.693 545.24 LS
432.638 562.5 L
400.145 562.5 L
403.773 545.269 L
436.693 545.24 LE
403.773 545.269 LS
400.145 562.5 L
370.606 562.5 L
373.946 545.286 L
403.773 545.269 LE
373.946 545.286 LS
370.606 562.5 L
343.752 562.5 L
346.91 545.294 L
373.946 545.286 LE
346.91 545.294 LS
343.752 562.5 L
319.339 562.5 L
322.403 545.294 L
346.91 545.294 LE
322.403 545.294 LS
319.339 562.5 L
297.146 562.5 L
300.196 545.286 L
322.403 545.294 LE
300.196 545.286 LS
297.146 562.5 L
276.971 562.5 L
280.088 545.269 L
300.196 545.286 LE
280.088 545.269 LS
276.971 562.5 L
258.629 562.5 L
261.908 545.24 L
280.088 545.269 LE
261.908 545.24 LS
258.629 562.5 L
241.955 562.5 L
245.516 545.192 L
261.908 545.24 LE
245.516 545.192 LS
241.955 562.5 L
226.797 562.5 L
230.807 545.115 L
245.516 545.192 LE
230.807 545.115 LS
226.797 562.5 L
213.017 562.5 L
217.735 544.985 L
230.807 545.115 LE
217.735 544.985 LS
213.017 562.5 L
200.489 562.5 L
206.35 544.751 L
217.735 544.985 LE
206.35 544.751 LS
200.489 562.5 L
189.1 562.5 L
196.891 544.283 L
206.35 544.751 LE
196.891 544.283 LS
189.1 562.5 L
178.747 562.5 L
189.965 543.211 L
196.891 544.283 LE
189.965 543.211 LS
178.747 562.5 L
169.335 562.5 L
186.233 540.424 L
189.965 543.211 LE
186.233 540.424 LS
169.335 562.5 L
160.779 562.5 L
179.257 534.587 L
186.233 540.424 LE
179.257 534.587 LS
160.779 562.5 L
153 562.5 L
153 532.022 L
179.257 534.587 LE
918 504.315 LS
918 532.022 L
878.643 534.587 L
885.771 505.171 L
918 504.315 LE
885.771 505.171 LS
878.643 534.587 L
803.773 540.424 L
839.333 509.281 L
885.771 505.171 LE
839.333 509.281 LS
803.773 540.424 L
728.415 543.211 L
775.218 514.783 L
839.333 509.281 LE
775.218 514.783 LS
728.415 543.211 L
663.916 544.283 L
707.1 519.102 L
775.218 514.783 LE
707.1 519.102 LS
663.916 544.283 L
607.764 544.751 L
644.074 521.882 L
707.1 519.102 LE
644.074 521.882 LS
607.764 544.751 L
557.95 544.985 L
588.135 523.597 L
644.074 521.882 LE
588.135 523.597 LS
557.95 544.985 L
513.297 545.115 L
538.774 524.667 L
588.135 523.597 LE
538.774 524.667 LS
513.297 545.115 L
473.061 545.192 L
495.06 525.35 L
538.774 524.667 LE
495.06 525.35 LS
473.061 545.192 L
436.693 545.24 L
456.159 525.79 L
495.06 525.35 LE
456.159 525.79 LS
436.693 545.24 L
403.773 545.269 L
421.418 526.071 L
456.159 525.79 LE
421.418 526.071 LS
403.773 545.269 L
373.946 545.286 L
390.315 526.239 L
421.418 526.071 LE
390.315 526.239 LS
373.946 545.286 L
346.91 545.294 L
362.442 526.317 L
390.315 526.239 LE
362.442 526.317 LS
346.91 545.294 L
322.403 545.294 L
337.471 526.317 L
362.442 526.317 LE
337.471 526.317 LS
322.403 545.294 L
300.196 545.286 L
315.141 526.239 L
337.471 526.317 LE
315.141 526.239 LS
300.196 545.286 L
280.088 545.269 L
295.248 526.071 L
315.141 526.239 LE
295.248 526.071 LS
280.088 545.269 L
261.908 545.24 L
277.648 525.79 L
295.248 526.071 LE
277.648 525.79 LS
261.908 545.24 L
245.516 545.192 L
262.254 525.35 L
277.648 525.79 LE
262.254 525.35 LS
245.516 545.192 L
230.807 545.115 L
249.047 524.667 L
262.254 525.35 LE
249.047 524.667 LS
230.807 545.115 L
217.735 544.985 L
238.07 523.597 L
249.047 524.667 LE
238.07 523.597 LS
217.735 544.985 L
206.35 544.751 L
229.36 521.882 L
238.07 523.597 LE
229.36 521.882 LS
206.35 544.751 L
196.891 544.283 L
222.636 519.102 L
229.36 521.882 LE
222.636 519.102 LS
196.891 544.283 L
189.965 543.211 L
216.21 514.783 L
222.636 519.102 LE
216.21 514.783 LS
189.965 543.211 L
186.233 540.424 L
204.988 509.281 L
216.21 514.783 LE
204.988 509.281 LS
186.233 540.424 L
179.257 534.587 L
182.792 505.171 L
204.988 509.281 LE
182.792 505.171 LS
179.257 534.587 L
153 532.022 L
153 504.315 L
182.792 505.171 LE
918 479.126 LS
918 504.315 L
885.771 505.171 L
886.773 479.568 L
918 479.126 LE
886.773 479.568 LS
885.771 505.171 L
839.333 509.281 L
849.255 481.998 L
886.773 479.568 LE
849.255 481.998 LS
839.333 509.281 L
775.218 514.783 L
799.899 486.355 L
849.255 481.998 LE
799.899 486.355 LS
775.218 514.783 L
707.1 519.102 L
741.734 491.174 L
799.899 486.355 LE
741.734 491.174 LS
707.1 519.102 L
644.074 521.882 L
681.758 495.313 L
741.734 491.174 LE
681.758 495.313 LS
644.074 521.882 L
588.135 523.597 L
624.872 498.454 L
681.758 495.313 LE
624.872 498.454 LS
588.135 523.597 L
538.774 524.667 L
573.056 500.71 L
624.872 498.454 LE
573.056 500.71 LS
538.774 524.667 L
495.06 525.35 L
526.644 502.291 L
573.056 500.71 LE
526.644 502.291 LS
495.06 525.35 L
456.159 525.79 L
485.313 503.378 L
526.644 502.291 LE
485.313 503.378 LS
456.159 525.79 L
421.418 526.071 L
448.568 504.1 L
485.313 503.378 LE
448.568 504.1 LS
421.418 526.071 L
390.315 526.239 L
415.915 504.541 L
448.568 504.1 LE
415.915 504.541 LS
390.315 526.239 L
362.442 526.317 L
386.919 504.75 L
415.915 504.541 LE
386.919 504.75 LS
362.442 526.317 L
337.471 526.317 L
361.216 504.75 L
386.919 504.75 LE
361.216 504.75 LS
337.471 526.317 L
315.141 526.239 L
338.514 504.541 L
361.216 504.75 LE
338.514 504.541 LS
315.141 526.239 L
295.248 526.071 L
318.577 504.1 L
338.514 504.541 LE
318.577 504.1 LS
295.248 526.071 L
277.648 525.79 L
301.221 503.378 L
318.577 504.1 LE
301.221 503.378 LS
277.648 525.79 L
262.254 525.35 L
286.286 502.291 L
301.221 503.378 LE
286.286 502.291 LS
262.254 525.35 L
249.047 524.667 L
273.592 500.71 L
286.286 502.291 LE
273.592 500.71 LS
249.047 524.667 L
238.07 523.597 L
262.818 498.454 L
273.592 500.71 LE
262.818 498.454 LS
238.07 523.597 L
229.36 521.882 L
253.245 495.313 L
262.818 498.454 LE
253.245 495.313 LS
229.36 521.882 L
222.636 519.102 L
243.285 491.174 L
253.245 495.313 LE
243.285 491.174 LS
222.636 519.102 L
216.21 514.783 L
230.051 486.355 L
243.285 491.174 LE
230.051 486.355 LS
216.21 514.783 L
204.988 509.281 L
210.22 481.998 L
230.051 486.355 LE
210.22 481.998 LS
204.988 509.281 L
182.792 505.171 L
183.289 479.568 L
210.22 481.998 LE
183.289 479.568 LS
182.792 505.171 L
153 504.315 L
153 479.126 L
183.289 479.568 LE
918 456.228 LS
918 479.126 L
886.773 479.568 L
887.053 456.515 L
918 456.228 LE
887.053 456.515 LS
886.773 479.568 L
849.255 481.998 L
852.496 458.165 L
887.053 456.515 LE
852.496 458.165 LS
849.255 481.998 L
799.899 486.355 L
810.176 461.434 L
852.496 458.165 LE
810.176 461.434 LS
799.899 486.355 L
741.734 491.174 L
760.124 465.607 L
810.176 461.434 LE
760.124 465.607 LS
741.734 491.174 L
681.758 495.313 L
706.085 469.772 L
760.124 465.607 LE
706.085 469.772 LS
681.758 495.313 L
624.872 498.454 L
652.221 473.372 L
706.085 469.772 LE
652.221 473.372 LS
624.872 498.454 L
573.056 500.71 L
601.275 476.237 L
652.221 473.372 LE
601.275 476.237 LS
573.056 500.71 L
526.644 502.291 L
554.521 478.404 L
601.275 476.237 LE
554.521 478.404 LS
526.644 502.291 L
485.313 503.378 L
512.305 479.978 L
554.521 478.404 LE
512.305 479.978 LS
485.313 503.378 L
448.568 504.1 L
474.519 481.064 L
512.305 479.978 LE
474.519 481.064 LS
448.568 504.1 L
415.915 504.541 L
440.862 481.744 L
474.519 481.064 LE
440.862 481.744 LS
415.915 504.541 L
386.919 504.75 L
410.989 482.071 L
440.862 481.744 LE
410.989 482.071 LS
386.919 504.75 L
361.216 504.75 L
384.568 482.071 L
410.989 482.071 LE
384.568 482.071 LS
361.216 504.75 L
338.514 504.541 L
361.289 481.744 L
384.568 482.071 LE
361.289 481.744 LS
338.514 504.541 L
318.577 504.1 L
340.874 481.064 L
361.289 481.744 LE
340.874 481.064 LS
318.577 504.1 L
301.221 503.378 L
323.047 479.978 L
340.874 481.064 LE
323.047 479.978 LS
301.221 503.378 L
286.286 502.291 L
307.498 478.404 L
323.047 479.978 LE
307.498 478.404 LS
286.286 502.291 L
273.592 500.71 L
293.795 476.237 L
307.498 478.404 LE
293.795 476.237 LS
273.592 500.71 L
262.818 498.454 L
281.24 473.372 L
293.795 476.237 LE
281.24 473.372 LS
262.818 498.454 L
253.245 495.313 L
268.661 469.772 L
281.24 473.372 LE
268.661 469.772 LS
253.245 495.313 L
243.285 491.174 L
254.25 465.607 L
268.661 469.772 LE
254.25 465.607 LS
243.285 491.174 L
230.051 486.355 L
235.814 461.434 L
254.25 465.607 LE
235.814 461.434 LS
230.051 486.355 L
210.22 481.998 L
211.929 458.165 L
235.814 461.434 LE
211.929 458.165 LS
210.22 481.998 L
183.289 479.568 L
183.428 456.515 L
211.929 458.165 LE
183.428 456.515 LS
183.289 479.568 L
153 479.126 L
153 456.228 L
183.428 456.515 LE
918 435.411 LS
918 456.228 L
887.053 456.515 L
887.163 435.627 L
918 435.411 LE
887.163 435.627 LS
887.053 456.515 L
852.496 458.165 L
853.817 436.886 L
887.163 435.627 LE
853.817 436.886 LS
852.496 458.165 L
810.176 461.434 L
814.786 439.49 L
853.817 436.886 LE
814.786 439.49 LS
810.176 461.434 L
760.124 465.607 L
769.378 443.035 L
814.786 439.49 LE
769.378 443.035 LS
760.124 465.607 L
706.085 469.772 L
719.75 446.851 L
769.378 443.035 LE
719.75 446.851 LS
706.085 469.772 L
652.221 473.372 L
669.077 450.398 L
719.75 446.851 LE
669.077 450.398 LS
652.221 473.372 L
601.275 476.237 L
619.971 453.403 L
669.077 450.398 LE
619.971 453.403 LS
601.275 476.237 L
554.521 478.404 L
574.018 455.792 L
619.971 453.403 LE
574.018 455.792 LS
554.521 478.404 L
512.305 479.978 L
531.933 457.595 L
574.018 455.792 LE
531.933 457.595 LS
512.305 479.978 L
474.519 481.064 L
493.897 458.874 L
531.933 457.595 LE
493.897 458.874 LS
474.519 481.064 L
440.862 481.744 L
459.803 459.69 L
493.897 458.874 LE
459.803 459.69 LS
440.862 481.744 L
410.989 482.071 L
429.415 460.086 L
459.803 459.69 LE
429.415 460.086 LS
410.989 482.071 L
384.568 482.071 L
402.443 460.086 L
429.415 460.086 LE
402.443 460.086 LS
384.568 482.071 L
361.289 481.744 L
378.584 459.69 L
402.443 460.086 LE
378.584 459.69 LS
361.289 481.744 L
340.874 481.064 L
357.525 458.874 L
378.584 459.69 LE
357.525 458.874 LS
340.874 481.064 L
323.047 479.978 L
338.917 457.595 L
357.525 458.874 LE
338.917 457.595 LS
323.047 479.978 L
307.498 478.404 L
322.334 455.792 L
338.917 457.595 LE
322.334 455.792 LS
307.498 478.404 L
293.795 476.237 L
307.182 453.403 L
322.334 455.792 LE
307.182 453.403 LS
293.795 476.237 L
281.24 473.372 L
292.595 450.398 L
307.182 453.403 LE
292.595 450.398 LS
281.24 473.372 L
268.661 469.772 L
277.322 446.851 L
292.595 450.398 LE
277.322 446.851 LS
268.661 469.772 L
254.25 465.607 L
259.767 443.035 L
277.322 446.851 LE
259.767 443.035 LS
254.25 465.607 L
235.814 461.434 L
238.399 439.49 L
259.767 443.035 LE
238.399 439.49 LS
235.814 461.434 L
211.929 458.165 L
212.627 436.886 L
238.399 439.49 LE
212.627 436.886 LS
211.929 458.165 L
183.428 456.515 L
183.483 435.627 L
212.627 436.886 LE
183.483 435.627 LS
183.428 456.515 L
153 456.228 L
153 435.411 L
183.483 435.627 LE
918 416.486 LS
918 435.411 L
887.163 435.627 L
887.211 416.666 L
918 416.486 LE
887.211 416.666 LS
887.163 435.627 L
853.817 436.886 L
854.416 417.72 L
887.211 416.666 LE
854.416 417.72 LS
853.817 436.886 L
814.786 439.49 L
816.954 419.941 L
854.416 417.72 LE
816.954 419.941 LS
814.786 439.49 L
769.378 443.035 L
773.976 423.061 L
816.954 419.941 LE
773.976 423.061 LS
769.378 443.035 L
719.75 446.851 L
726.946 426.546 L
773.976 423.061 LE
726.946 426.546 LS
719.75 446.851 L
669.077 450.398 L
678.435 429.913 L
726.946 426.546 LE
678.435 429.913 LS
669.077 450.398 L
619.971 453.403 L
630.822 432.865 L
678.435 429.913 LE
630.822 432.865 LS
619.971 453.403 L
574.018 455.792 L
585.735 435.282 L
630.822 432.865 LE
585.735 435.282 LS
574.018 455.792 L
531.933 457.595 L
544.04 437.147 L
585.735 435.282 LE
544.04 437.147 LS
531.933 457.595 L
493.897 458.874 L
506.073 438.493 L
544.04 437.147 LE
506.073 438.493 LS
493.897 458.874 L
459.803 459.69 L
471.844 439.362 L
506.073 438.493 LE
471.844 439.362 LS
459.803 459.69 L
429.415 460.086 L
441.193 439.786 L
471.844 439.362 LE
441.193 439.786 LS
429.415 460.086 L
402.443 460.086 L
413.868 439.786 L
441.193 439.786 LE
413.868 439.786 LS
402.443 460.086 L
378.584 459.69 L
389.576 439.362 L
413.868 439.786 LE
389.576 439.362 LS
378.584 459.69 L
357.525 458.874 L
367.985 438.493 L
389.576 439.362 LE
367.985 438.493 LS
357.525 458.874 L
338.917 457.595 L
348.706 437.147 L
367.985 438.493 LE
348.706 437.147 LS
338.917 457.595 L
322.334 455.792 L
331.248 435.282 L
348.706 437.147 LE
331.248 435.282 LS
322.334 455.792 L
307.182 453.403 L
314.951 432.865 L
331.248 435.282 LE
314.951 432.865 LS
307.182 453.403 L
292.595 450.398 L
298.9 429.913 L
314.951 432.865 LE
298.9 429.913 LS
292.595 450.398 L
277.322 446.851 L
281.883 426.546 L
298.9 429.913 LE
281.883 426.546 LS
277.322 446.851 L
259.767 443.035 L
262.508 423.061 L
281.883 426.546 LE
262.508 423.061 LS
259.767 443.035 L
238.399 439.49 L
239.615 419.941 L
262.508 423.061 LE
239.615 419.941 LS
238.399 439.49 L
212.627 436.886 L
212.942 417.72 L
239.615 419.941 LE
212.942 417.72 LS
212.627 436.886 L
183.483 435.627 L
183.507 416.666 L
212.942 417.72 LE
183.507 416.666 LS
183.483 435.627 L
153 435.411 L
153 416.486 L
183.507 416.666 LE
918 399.282 LS
918 416.486 L
887.211 416.666 L
887.232 399.444 L
918 399.282 LE
887.232 399.444 LS
887.211 416.666 L
854.416 417.72 L
854.655 400.397 L
887.232 399.444 LE
854.655 400.397 LS
854.416 417.72 L
816.954 419.941 L
817.841 402.42 L
854.655 400.397 LE
817.841 402.42 LS
816.954 419.941 L
773.976 423.061 L
775.909 405.298 L
817.841 402.42 LE
775.909 405.298 LS
773.976 423.061 L
726.946 426.546 L
730.055 408.564 L
775.909 405.298 LE
730.055 408.564 LS
726.946 426.546 L
678.435 429.913 L
682.587 411.771 L
730.055 408.564 LE
682.587 411.771 LS
678.435 429.913 L
630.822 432.865 L
635.748 414.627 L
682.587 411.771 LE
635.748 414.627 LS
630.822 432.865 L
585.735 435.282 L
591.154 416.995 L
635.748 414.627 LE
591.154 416.995 LS
585.735 435.282 L
544.04 437.147 L
549.719 418.843 L
591.154 416.995 LE
549.719 418.843 LS
544.04 437.147 L
506.073 438.493 L
511.846 420.186 L
549.719 418.843 LE
511.846 420.186 LS
506.073 438.493 L
471.844 439.362 L
477.592 421.058 L
511.846 420.186 LE
477.592 421.058 LS
471.844 439.362 L
441.193 439.786 L
446.834 421.486 L
477.592 421.058 LE
446.834 421.486 LS
441.193 439.786 L
413.868 439.786 L
419.34 421.486 L
446.834 421.486 LE
419.34 421.486 LS
413.868 439.786 L
389.576 439.362 L
394.824 421.058 L
419.34 421.486 LE
394.824 421.058 LS
389.576 439.362 L
367.985 438.493 L
372.945 420.186 L
394.824 421.058 LE
372.945 420.186 LS
367.985 438.493 L
348.706 437.147 L
353.299 418.843 L
372.945 420.186 LE
353.299 418.843 LS
348.706 437.147 L
331.248 435.282 L
335.371 416.995 L
353.299 418.843 LE
335.371 416.995 LS
331.248 435.282 L
314.951 432.865 L
318.477 414.627 L
335.371 416.995 LE
318.477 414.627 LS
314.951 432.865 L
298.9 429.913 L
301.696 411.771 L
318.477 414.627 LE
301.696 411.771 LS
298.9 429.913 L
281.883 426.546 L
283.853 408.564 L
301.696 411.771 LE
283.853 408.564 LS
281.883 426.546 L
262.508 423.061 L
263.66 405.298 L
283.853 408.564 LE
263.66 405.298 LS
262.508 423.061 L
239.615 419.941 L
240.113 402.42 L
263.66 405.298 LE
240.113 402.42 LS
239.615 419.941 L
212.942 417.72 L
213.069 400.397 L
240.113 402.42 LE
213.069 400.397 LS
212.942 417.72 L
183.507 416.666 L
183.517 399.444 L
213.069 400.397 LE
183.517 399.444 LS
183.507 416.666 L
153 416.486 L
153 399.282 L
183.517 399.444 LE
918 383.642 LS
918 399.282 L
887.232 399.444 L
887.232 383.799 L
918 383.642 LE
887.232 383.799 LS
887.232 399.444 L
854.655 400.397 L
854.655 384.723 L
887.232 383.799 LE
854.655 384.723 LS
854.655 400.397 L
817.841 402.42 L
817.841 386.683 L
854.655 384.723 LE
817.841 386.683 LS
817.841 402.42 L
775.909 405.298 L
775.909 389.473 L
817.841 386.683 LE
775.909 389.473 LS
775.909 405.298 L
730.055 408.564 L
730.055 392.638 L
775.909 389.473 LE
730.055 392.638 LS
730.055 408.564 L
682.587 411.771 L
682.587 395.747 L
730.055 392.638 LE
682.587 395.747 LS
682.587 411.771 L
635.748 414.627 L
635.748 398.515 L
682.587 395.747 LE
635.748 398.515 LS
635.748 414.627 L
591.154 416.995 L
591.154 400.81 L
635.748 398.515 LE
591.154 400.81 LS
591.154 416.995 L
549.719 418.843 L
549.719 402.601 L
591.154 400.81 LE
549.719 402.601 LS
549.719 418.843 L
511.846 420.186 L
511.846 403.903 L
549.719 402.601 LE
511.846 403.903 LS
511.846 420.186 L
477.592 421.058 L
477.592 404.748 L
511.846 403.903 LE
477.592 404.748 LS
477.592 421.058 L
446.834 421.486 L
446.834 405.163 L
477.592 404.748 LE
446.834 405.163 LS
446.834 421.486 L
419.34 421.486 L
419.34 405.163 L
446.834 405.163 LE
419.34 405.163 LS
419.34 421.486 L
394.824 421.058 L
394.824 404.748 L
419.34 405.163 LE
394.824 404.748 LS
394.824 421.058 L
372.945 420.186 L
372.945 403.903 L
394.824 404.748 LE
372.945 403.903 LS
372.945 420.186 L
353.299 418.843 L
353.299 402.601 L
372.945 403.903 LE
353.299 402.601 LS
353.299 418.843 L
335.371 416.995 L
335.371 400.81 L
353.299 402.601 LE
335.371 400.81 LS
335.371 416.995 L
318.477 414.627 L
318.477 398.515 L
335.371 400.81 LE
318.477 398.515 LS
318.477 414.627 L
301.696 411.771 L
301.696 395.747 L
318.477 398.515 LE
301.696 395.747 LS
301.696 411.771 L
283.853 408.564 L
283.853 392.638 L
301.696 395.747 LE
283.853 392.638 LS
283.853 408.564 L
263.66 405.298 L
263.66 389.473 L
283.853 392.638 LE
263.66 389.473 LS
263.66 405.298 L
240.113 402.42 L
240.113 386.683 L
263.66 389.473 LE
240.113 386.683 LS
240.113 402.42 L
213.069 400.397 L
213.069 384.723 L
240.113 386.683 LE
213.069 384.723 LS
213.069 400.397 L
183.517 399.444 L
183.517 383.799 L
213.069 384.723 LE
183.517 383.799 LS
183.517 399.444 L
153 399.282 L
153 383.642 L
183.517 383.799 LE
918 369.424 LS
918 383.642 L
887.232 383.799 L
887.211 369.587 L
918 369.424 LE
887.211 369.587 LS
887.232 383.799 L
854.655 384.723 L
854.416 370.547 L
887.211 369.587 LE
854.416 370.547 LS
854.655 384.723 L
817.841 386.683 L
816.954 372.57 L
854.416 370.547 LE
816.954 372.57 LS
817.841 386.683 L
775.909 389.473 L
773.976 375.411 L
816.954 372.57 LE
773.976 375.411 LS
775.909 389.473 L
730.055 392.638 L
726.946 378.584 L
773.976 375.411 LE
726.946 378.584 LS
730.055 392.638 L
682.587 395.747 L
678.435 381.65 L
726.946 378.584 LE
678.435 381.65 LS
682.587 395.747 L
635.748 398.515 L
630.822 384.338 L
678.435 381.65 LE
630.822 384.338 LS
635.748 398.515 L
591.154 400.81 L
585.735 386.538 L
630.822 384.338 LE
585.735 386.538 LS
591.154 400.81 L
549.719 402.601 L
544.04 388.237 L
585.735 386.538 LE
544.04 388.237 LS
549.719 402.601 L
511.846 403.903 L
506.073 389.462 L
544.04 388.237 LE
506.073 389.462 LS
511.846 403.903 L
477.592 404.748 L
471.844 390.253 L
506.073 389.462 LE
471.844 390.253 LS
477.592 404.748 L
446.834 405.163 L
441.193 390.639 L
471.844 390.253 LE
441.193 390.639 LS
446.834 405.163 L
419.34 405.163 L
413.868 390.639 L
441.193 390.639 LE
413.868 390.639 LS
419.34 405.163 L
394.824 404.748 L
389.576 390.253 L
413.868 390.639 LE
389.576 390.253 LS
394.824 404.748 L
372.945 403.903 L
367.985 389.462 L
389.576 390.253 LE
367.985 389.462 LS
372.945 403.903 L
353.299 402.601 L
348.706 388.237 L
367.985 389.462 LE
348.706 388.237 LS
353.299 402.601 L
335.371 400.81 L
331.248 386.538 L
348.706 388.237 LE
331.248 386.538 LS
335.371 400.81 L
318.477 398.515 L
314.951 384.338 L
331.248 386.538 LE
314.951 384.338 LS
318.477 398.515 L
301.696 395.747 L
298.9 381.65 L
314.951 384.338 LE
298.9 381.65 LS
301.696 395.747 L
283.853 392.638 L
281.883 378.584 L
298.9 381.65 LE
281.883 378.584 LS
283.853 392.638 L
263.66 389.473 L
262.508 375.411 L
281.883 378.584 LE
262.508 375.411 LS
263.66 389.473 L
240.113 386.683 L
239.615 372.57 L
262.508 375.411 LE
239.615 372.57 LS
240.113 386.683 L
213.069 384.723 L
212.942 370.547 L
239.615 372.57 LE
212.942 370.547 LS
213.069 384.723 L
183.517 383.799 L
183.507 369.587 L
212.942 370.547 LE
183.507 369.587 LS
183.517 383.799 L
153 383.642 L
153 369.424 L
183.507 369.587 LE
918 356.499 LS
918 369.424 L
887.211 369.587 L
887.163 356.683 L
918 356.499 LE
887.163 356.683 LS
887.211 369.587 L
854.416 370.547 L
853.817 357.76 L
887.163 356.683 LE
853.817 357.76 LS
854.416 370.547 L
816.954 372.57 L
814.786 359.987 L
853.817 357.76 LE
814.786 359.987 LS
816.954 372.57 L
773.976 375.411 L
769.378 363.02 L
814.786 359.987 LE
769.378 363.02 LS
773.976 375.411 L
726.946 378.584 L
719.75 366.284 L
769.378 363.02 LE
719.75 366.284 LS
726.946 378.584 L
678.435 381.65 L
669.077 369.318 L
719.75 366.284 LE
669.077 369.318 LS
678.435 381.65 L
630.822 384.338 L
619.971 371.888 L
669.077 369.318 LE
619.971 371.888 LS
630.822 384.338 L
585.735 386.538 L
574.018 373.932 L
619.971 371.888 LE
574.018 373.932 LS
585.735 386.538 L
544.04 388.237 L
531.933 375.474 L
574.018 373.932 LE
531.933 375.474 LS
544.04 388.237 L
506.073 389.462 L
493.897 376.568 L
531.933 375.474 LE
493.897 376.568 LS
506.073 389.462 L
471.844 390.253 L
459.803 377.266 L
493.897 376.568 LE
459.803 377.266 LS
471.844 390.253 L
441.193 390.639 L
429.415 377.605 L
459.803 377.266 LE
429.415 377.605 LS
441.193 390.639 L
413.868 390.639 L
402.443 377.605 L
429.415 377.605 LE
402.443 377.605 LS
413.868 390.639 L
389.576 390.253 L
378.584 377.266 L
402.443 377.605 LE
378.584 377.266 LS
389.576 390.253 L
367.985 389.462 L
357.525 376.568 L
378.584 377.266 LE
357.525 376.568 LS
367.985 389.462 L
348.706 388.237 L
338.917 375.474 L
357.525 376.568 LE
338.917 375.474 LS
348.706 388.237 L
331.248 386.538 L
322.334 373.932 L
338.917 375.474 LE
322.334 373.932 LS
331.248 386.538 L
314.951 384.338 L
307.182 371.888 L
322.334 373.932 LE
307.182 371.888 LS
314.951 384.338 L
298.9 381.65 L
292.595 369.318 L
307.182 371.888 LE
292.595 369.318 LS
298.9 381.65 L
281.883 378.584 L
277.322 366.284 L
292.595 369.318 LE
277.322 366.284 LS
281.883 378.584 L
262.508 375.411 L
259.767 363.02 L
277.322 366.284 LE
259.767 363.02 LS
262.508 375.411 L
239.615 372.57 L
238.399 359.987 L
259.767 363.02 LE
238.399 359.987 LS
239.615 372.57 L
212.942 370.547 L
212.627 357.76 L
238.399 359.987 LE
212.627 357.76 LS
212.942 370.547 L
183.507 369.587 L
183.483 356.683 L
212.627 357.76 LE
183.483 356.683 LS
183.507 369.587 L
153 369.424 L
153 356.499 L
183.483 356.683 LE
918 344.748 LS
918 356.499 L
887.163 356.683 L
887.053 344.979 L
918 344.748 LE
887.053 344.979 LS
887.163 356.683 L
853.817 357.76 L
852.496 346.304 L
887.053 344.979 LE
852.496 346.304 LS
853.817 357.76 L
814.786 359.987 L
810.176 348.931 L
852.496 346.304 LE
810.176 348.931 LS
814.786 359.987 L
769.378 363.02 L
760.124 352.284 L
810.176 348.931 LE
760.124 352.284 LS
769.378 363.02 L
719.75 366.284 L
706.085 355.63 L
760.124 352.284 LE
706.085 355.63 LS
719.75 366.284 L
669.077 369.318 L
652.221 358.523 L
706.085 355.63 LE
652.221 358.523 LS
669.077 369.318 L
619.971 371.888 L
601.275 360.826 L
652.221 358.523 LE
601.275 360.826 LS
619.971 371.888 L
574.018 373.932 L
554.521 362.566 L
601.275 360.826 LE
554.521 362.566 LS
574.018 373.932 L
531.933 375.474 L
512.305 363.831 L
554.521 362.566 LE
512.305 363.831 LS
531.933 375.474 L
493.897 376.568 L
474.519 364.704 L
512.305 363.831 LE
474.519 364.704 LS
493.897 376.568 L
459.803 377.266 L
440.862 365.251 L
474.519 364.704 LE
440.862 365.251 LS
459.803 377.266 L
429.415 377.605 L
410.989 365.513 L
440.862 365.251 LE
410.989 365.513 LS
429.415 377.605 L
402.443 377.605 L
384.568 365.513 L
410.989 365.513 LE
384.568 365.513 LS
402.443 377.605 L
378.584 377.266 L
361.289 365.251 L
384.568 365.513 LE
361.289 365.251 LS
378.584 377.266 L
357.525 376.568 L
340.874 364.704 L
361.289 365.251 LE
340.874 364.704 LS
357.525 376.568 L
338.917 375.474 L
323.047 363.831 L
340.874 364.704 LE
323.047 363.831 LS
338.917 375.474 L
322.334 373.932 L
307.498 362.566 L
323.047 363.831 LE
307.498 362.566 LS
322.334 373.932 L
307.182 371.888 L
293.795 360.826 L
307.498 362.566 LE
293.795 360.826 LS
307.182 371.888 L
292.595 369.318 L
281.24 358.523 L
293.795 360.826 LE
281.24 358.523 LS
292.595 369.318 L
277.322 366.284 L
268.661 355.63 L
281.24 358.523 LE
268.661 355.63 LS
277.322 366.284 L
259.767 363.02 L
254.25 352.284 L
268.661 355.63 LE
254.25 352.284 LS
259.767 363.02 L
238.399 359.987 L
235.814 348.931 L
254.25 352.284 LE
235.814 348.931 LS
238.399 359.987 L
212.627 357.76 L
211.929 346.304 L
235.814 348.931 LE
211.929 346.304 LS
212.627 357.76 L
183.483 356.683 L
183.428 344.979 L
211.929 346.304 LE
183.428 344.979 LS
183.483 356.683 L
153 356.499 L
153 344.748 L
183.428 344.979 LE
918 334.065 LS
918 344.748 L
887.053 344.979 L
886.773 334.399 L
918 334.065 LE
886.773 334.399 LS
887.053 344.979 L
852.496 346.304 L
849.255 336.233 L
886.773 334.399 LE
849.255 336.233 LS
852.496 346.304 L
810.176 348.931 L
799.899 339.522 L
849.255 336.233 LE
799.899 339.522 LS
810.176 348.931 L
760.124 352.284 L
741.734 343.158 L
799.899 339.522 LE
741.734 343.158 LS
760.124 352.284 L
706.085 355.63 L
681.758 346.283 L
741.734 343.158 LE
681.758 346.283 LS
706.085 355.63 L
652.221 358.523 L
624.872 348.653 L
681.758 346.283 LE
624.872 348.653 LS
652.221 358.523 L
601.275 360.826 L
573.056 350.356 L
624.872 348.653 LE
573.056 350.356 LS
601.275 360.826 L
554.521 362.566 L
526.644 351.549 L
573.056 350.356 LE
526.644 351.549 LS
554.521 362.566 L
512.305 363.831 L
485.313 352.37 L
526.644 351.549 LE
485.313 352.37 LS
512.305 363.831 L
474.519 364.704 L
448.568 352.915 L
485.313 352.37 LE
448.568 352.915 LS
474.519 364.704 L
440.862 365.251 L
415.915 353.248 L
448.568 352.915 LE
415.915 353.248 LS
440.862 365.251 L
410.989 365.513 L
386.919 353.406 L
415.915 353.248 LE
386.919 353.406 LS
410.989 365.513 L
384.568 365.513 L
361.216 353.406 L
386.919 353.406 LE
361.216 353.406 LS
384.568 365.513 L
361.289 365.251 L
338.514 353.248 L
361.216 353.406 LE
338.514 353.248 LS
361.289 365.251 L
340.874 364.704 L
318.577 352.915 L
338.514 353.248 LE
318.577 352.915 LS
340.874 364.704 L
323.047 363.831 L
301.221 352.37 L
318.577 352.915 LE
301.221 352.37 LS
323.047 363.831 L
307.498 362.566 L
286.286 351.549 L
301.221 352.37 LE
286.286 351.549 LS
307.498 362.566 L
293.795 360.826 L
273.592 350.356 L
286.286 351.549 LE
273.592 350.356 LS
293.795 360.826 L
281.24 358.523 L
262.818 348.653 L
273.592 350.356 LE
262.818 348.653 LS
281.24 358.523 L
268.661 355.63 L
253.245 346.283 L
262.818 348.653 LE
253.245 346.283 LS
268.661 355.63 L
254.25 352.284 L
243.285 343.158 L
253.245 346.283 LE
243.285 343.158 LS
254.25 352.284 L
235.814 348.931 L
230.051 339.522 L
243.285 343.158 LE
230.051 339.522 LS
235.814 348.931 L
211.929 346.304 L
210.22 336.233 L
230.051 339.522 LE
210.22 336.233 LS
211.929 346.304 L
183.428 344.979 L
183.289 334.399 L
210.22 336.233 LE
183.289 334.399 LS
183.428 344.979 L
153 344.748 L
153 334.065 L
183.289 334.399 LE
918 324.354 LS
918 334.065 L
886.773 334.399 L
885.771 324.961 L
918 324.354 LE
885.771 324.961 LS
886.773 334.399 L
849.255 336.233 L
839.333 327.875 L
885.771 324.961 LE
839.333 327.875 LS
849.255 336.233 L
799.899 339.522 L
775.218 331.776 L
839.333 327.875 LE
775.218 331.776 LS
799.899 339.522 L
741.734 343.158 L
707.1 334.837 L
775.218 331.776 LE
707.1 334.837 LS
741.734 343.158 L
681.758 346.283 L
644.074 336.808 L
707.1 334.837 LE
644.074 336.808 LS
681.758 346.283 L
624.872 348.653 L
588.135 338.024 L
644.074 336.808 LE
588.135 338.024 LS
624.872 348.653 L
573.056 350.356 L
538.774 338.783 L
588.135 338.024 LE
538.774 338.783 LS
573.056 350.356 L
526.644 351.549 L
495.06 339.267 L
538.774 338.783 LE
495.06 339.267 LS
526.644 351.549 L
485.313 352.37 L
456.159 339.579 L
495.06 339.267 LE
456.159 339.579 LS
485.313 352.37 L
448.568 352.915 L
421.418 339.778 L
456.159 339.579 LE
421.418 339.778 LS
448.568 352.915 L
415.915 353.248 L
390.315 339.897 L
421.418 339.778 LE
390.315 339.897 LS
415.915 353.248 L
386.919 353.406 L
362.442 339.952 L
390.315 339.897 LE
362.442 339.952 LS
386.919 353.406 L
361.216 353.406 L
337.471 339.952 L
362.442 339.952 LE
337.471 339.952 LS
361.216 353.406 L
338.514 353.248 L
315.141 339.897 L
337.471 339.952 LE
315.141 339.897 LS
338.514 353.248 L
318.577 352.915 L
295.248 339.778 L
315.141 339.897 LE
295.248 339.778 LS
318.577 352.915 L
301.221 352.37 L
277.648 339.579 L
295.248 339.778 LE
277.648 339.579 LS
301.221 352.37 L
286.286 351.549 L
262.254 339.267 L
277.648 339.579 LE
262.254 339.267 LS
286.286 351.549 L
273.592 350.356 L
249.047 338.783 L
262.254 339.267 LE
249.047 338.783 LS
273.592 350.356 L
262.818 348.653 L
238.07 338.024 L
249.047 338.783 LE
238.07 338.024 LS
262.818 348.653 L
253.245 346.283 L
229.36 336.808 L
238.07 338.024 LE
229.36 336.808 LS
253.245 346.283 L
243.285 343.158 L
222.636 334.837 L
229.36 336.808 LE
222.636 334.837 LS
243.285 343.158 L
230.051 339.522 L
216.21 331.776 LE
0.298039 0.140254 0 C
216.21 331.776 LS
222.636 334.837 LE
1 0.510338 0.0236323 C
216.21 331.776 LS
230.051 339.522 L
210.22 336.233 L
204.988 327.875 L
216.21 331.776 LE
204.988 327.875 LS
210.22 336.233 L
183.289 334.399 L
182.792 324.961 L
204.988 327.875 LE
182.792 324.961 LS
183.289 334.399 L
153 334.065 L
153 324.354 L
182.792 324.961 LE
918 315.526 LS
918 324.354 L
885.771 324.961 L
878.643 317.234 L
918 315.526 LE
878.643 317.234 LS
885.771 324.961 L
839.333 327.875 L
803.773 321.12 L
878.643 317.234 LE
803.773 321.12 LS
839.333 327.875 L
775.218 331.776 L
728.415 322.976 L
803.773 321.12 LE
728.415 322.976 LS
775.218 331.776 L
707.1 334.837 L
663.916 323.69 L
728.415 322.976 LE
663.916 323.69 LS
707.1 334.837 L
644.074 336.808 L
607.764 324.002 L
663.916 323.69 LE
607.764 324.002 LS
644.074 336.808 L
588.135 338.024 L
557.95 324.157 L
607.764 324.002 LE
557.95 324.157 LS
588.135 338.024 L
538.774 338.783 L
513.297 324.244 L
557.95 324.157 LE
513.297 324.244 LS
538.774 338.783 L
495.06 339.267 L
473.061 324.295 L
513.297 324.244 LE
473.061 324.295 LS
495.06 339.267 L
456.159 339.579 L
436.693 324.327 L
473.061 324.295 LE
436.693 324.327 LS
456.159 339.579 L
421.418 339.778 L
403.773 324.346 L
436.693 324.327 LE
403.773 324.346 LS
421.418 339.778 L
390.315 339.897 L
373.946 324.358 L
403.773 324.346 LE
373.946 324.358 LS
390.315 339.897 L
362.442 339.952 L
346.91 324.363 L
373.946 324.358 LE
346.91 324.363 LS
362.442 339.952 L
337.471 339.952 L
322.403 324.363 L
346.91 324.363 LE
322.403 324.363 LS
337.471 339.952 L
315.141 339.897 L
300.196 324.358 L
322.403 324.363 LE
300.196 324.358 LS
315.141 339.897 L
295.248 339.778 L
280.088 324.346 L
300.196 324.358 LE
280.088 324.346 LS
295.248 339.778 L
277.648 339.579 L
261.908 324.327 L
280.088 324.346 LE
261.908 324.327 LS
277.648 339.579 L
262.254 339.267 L
245.516 324.295 L
261.908 324.327 LE
245.516 324.295 LS
262.254 339.267 L
249.047 338.783 L
230.807 324.244 L
245.516 324.295 LE
230.807 324.244 LS
249.047 338.783 L
238.07 338.024 L
217.735 324.157 L
230.807 324.244 LE
217.735 324.157 LS
238.07 338.024 L
229.36 336.808 L
206.35 324.002 L
217.735 324.157 LE
206.35 324.002 LS
229.36 336.808 L
222.636 334.837 L
196.891 323.69 L
206.35 324.002 LE
0.298039 0.140254 0 C
196.891 323.69 LS
222.636 334.837 L
216.21 331.776 LE
1 0.510338 0.0236323 C
216.21 331.776 LS
189.965 322.976 L
196.891 323.69 LE
0.298039 0.140254 0 C
189.965 322.976 LS
216.21 331.776 LE
1 0.510338 0.0236323 C
216.21 331.776 LS
204.988 327.875 LE
0.298039 0.140254 0 C
204.988 327.875 LS
186.233 321.12 L
189.965 322.976 LE
1 0.510338 0.0236323 C
186.233 321.12 LS
204.988 327.875 L
182.792 324.961 L
179.257 317.234 LE
0.298039 0.140254 0 C
179.257 317.234 LS
186.233 321.12 LE
1 0.510338 0.0236323 C
179.257 317.234 LS
182.792 324.961 L
153 324.354 L
153 315.526 L
179.257 317.234 LE
918 307.5 LS
918 315.526 L
878.643 317.234 L
841.383 307.5 L
918 307.5 LE
841.383 307.5 LS
878.643 317.234 L
803.773 321.12 L
771.732 307.5 L
841.383 307.5 LE
771.732 307.5 LS
803.773 321.12 L
728.415 322.976 L
708.41 307.5 L
771.732 307.5 LE
708.41 307.5 LS
728.415 322.976 L
663.916 323.69 L
650.849 307.5 L
708.41 307.5 LE
650.849 307.5 LS
663.916 323.69 L
607.764 324.002 L
598.518 307.5 L
650.849 307.5 LE
598.518 307.5 LS
607.764 324.002 L
557.95 324.157 L
550.945 307.5 L
598.518 307.5 LE
550.945 307.5 LS
557.95 324.157 L
513.297 324.244 L
507.697 307.5 L
550.945 307.5 LE
507.697 307.5 LS
513.297 324.244 L
473.061 324.295 L
468.379 307.5 L
507.697 307.5 LE
468.379 307.5 LS
473.061 324.295 L
436.693 324.327 L
432.638 307.5 L
468.379 307.5 LE
432.638 307.5 LS
436.693 324.327 L
403.773 324.346 L
400.145 307.5 L
432.638 307.5 LE
400.145 307.5 LS
403.773 324.346 L
373.946 324.358 L
370.606 307.5 L
400.145 307.5 LE
370.606 307.5 LS
373.946 324.358 L
346.91 324.363 L
343.752 307.5 L
370.606 307.5 LE
343.752 307.5 LS
346.91 324.363 L
322.403 324.363 L
319.339 307.5 L
343.752 307.5 LE
319.339 307.5 LS
322.403 324.363 L
300.196 324.358 L
297.146 307.5 L
319.339 307.5 LE
297.146 307.5 LS
300.196 324.358 L
280.088 324.346 L
276.971 307.5 L
297.146 307.5 LE
276.971 307.5 LS
280.088 324.346 L
261.908 324.327 L
258.629 307.5 L
276.971 307.5 LE
258.629 307.5 LS
261.908 324.327 L
245.516 324.295 L
241.955 307.5 L
258.629 307.5 LE
241.955 307.5 LS
245.516 324.295 L
230.807 324.244 L
226.797 307.5 L
241.955 307.5 LE
226.797 307.5 LS
230.807 324.244 L
217.735 324.157 L
213.017 307.5 L
226.797 307.5 LE
213.017 307.5 LS
217.735 324.157 L
206.35 324.002 L
200.489 307.5 L
213.017 307.5 LE
200.489 307.5 LS
206.35 324.002 L
196.891 323.69 L
189.1 307.5 L
200.489 307.5 LE
189.1 307.5 LS
196.891 323.69 L
189.965 322.976 L
178.747 307.5 L
189.1 307.5 LE
178.747 307.5 LS
189.965 322.976 L
186.233 321.12 L
169.335 307.5 L
178.747 307.5 LE
169.335 307.5 LS
186.233 321.12 LE
0.298039 0.140254 0 C
186.233 321.12 LS
179.257 317.234 LE
1 0.510338 0.0236323 C
179.257 317.234 LS
160.779 307.5 L
169.335 307.5 LE
160.779 307.5 LS
179.257 317.234 L
153 315.526 L
153 307.5 L
160.779 307.5 LE
grestore
showpage
cleartomark
%%PageTrailer
%%Trailer
end
%%EOF
