%!PS-Adobe-3.0 EPSF-3.0
%%Title: square-extrude
%%Creator: GL2PS 1.4.3, (C) 1999-2020 C. Geuzaine
%%For: Gmsh
%%CreationDate: Sat Nov 23 12:50:55 2024
%%LanguageLevel: 3
%%DocumentData: Clean7Bit
%%Pages: 1
%%BoundingBox: 155 95 1010 560
%%EndComments
%%BeginProlog
/gl2psdict 64 dict def gl2psdict begin
/tryPS3shading false def % set to false to force subdivision
/rThreshold 0.0666667 def % red component subdivision threshold
/gThreshold 0.05 def % green component subdivision threshold
/bThreshold 0.1 def % blue component subdivision threshold
/BD { bind def } bind def
/C  { setrgbcolor } BD
/G  { 0.082 mul exch 0.6094 mul add exch 0.3086 mul add neg 1.0 add setgray } BD
/W  { setlinewidth } BD
/LC  { setlinecap } BD
/LJ  { setlinejoin } BD
/FC { findfont exch /SH exch def SH scalefont setfont } BD
/SW { dup stringwidth pop } BD
/S  { FC moveto show } BD
/SBC{ FC moveto SW -2 div 0 rmoveto show } BD
/SBR{ FC moveto SW neg 0 rmoveto show } BD
/SCL{ FC moveto 0 SH -2 div rmoveto show } BD
/SCC{ FC moveto SW -2 div SH -2 div rmoveto show } BD
/SCR{ FC moveto SW neg SH -2 div rmoveto show } BD
/STL{ FC moveto 0 SH neg rmoveto show } BD
/STC{ FC moveto SW -2 div SH neg rmoveto show } BD
/STR{ FC moveto SW neg SH neg rmoveto show } BD
/FCT { FC translate 0 0 } BD
/SR  { gsave FCT moveto rotate show grestore } BD
/SBCR{ gsave FCT moveto rotate SW -2 div 0 rmoveto show grestore } BD
/SBRR{ gsave FCT moveto rotate SW neg 0 rmoveto show grestore } BD
/SCLR{ gsave FCT moveto rotate 0 SH -2 div rmoveto show grestore} BD
/SCCR{ gsave FCT moveto rotate SW -2 div SH -2 div rmoveto show grestore} BD
/SCRR{ gsave FCT moveto rotate SW neg SH -2 div rmoveto show grestore} BD
/STLR{ gsave FCT moveto rotate 0 SH neg rmoveto show grestore } BD
/STCR{ gsave FCT moveto rotate SW -2 div SH neg rmoveto show grestore } BD
/STRR{ gsave FCT moveto rotate SW neg SH neg rmoveto show grestore } BD
/P  { newpath 0.0 360.0 arc closepath fill } BD
/R  { newpath moveto lineto lineto lineto closepath fill } BD
/LS { newpath moveto } BD
/L  { lineto } BD
/LE { lineto stroke } BD
/T  { newpath moveto lineto lineto closepath fill } BD
/STshfill {
      /b1 exch def /g1 exch def /r1 exch def /y1 exch def /x1 exch def
      /b2 exch def /g2 exch def /r2 exch def /y2 exch def /x2 exch def
      /b3 exch def /g3 exch def /r3 exch def /y3 exch def /x3 exch def
      gsave << /ShadingType 4 /ColorSpace [/DeviceRGB]
      /DataSource [ 0 x1 y1 r1 g1 b1 0 x2 y2 r2 g2 b2 0 x3 y3 r3 g3 b3 ] >>
      shfill grestore } BD
/Tm { 3 -1 roll 8 -1 roll 13 -1 roll add add 3 div
      3 -1 roll 7 -1 roll 11 -1 roll add add 3 div
      3 -1 roll 6 -1 roll 9 -1 roll add add 3 div C T } BD
/STsplit {
      4 index 15 index add 0.5 mul
      4 index 15 index add 0.5 mul
      4 index 15 index add 0.5 mul
      4 index 15 index add 0.5 mul
      4 index 15 index add 0.5 mul
      5 copy 5 copy 25 15 roll
      9 index 30 index add 0.5 mul
      9 index 30 index add 0.5 mul
      9 index 30 index add 0.5 mul
      9 index 30 index add 0.5 mul
      9 index 30 index add 0.5 mul
      5 copy 5 copy 35 5 roll 25 5 roll 15 5 roll
      4 index 10 index add 0.5 mul
      4 index 10 index add 0.5 mul
      4 index 10 index add 0.5 mul
      4 index 10 index add 0.5 mul
      4 index 10 index add 0.5 mul
      5 copy 5 copy 40 5 roll 25 5 roll 15 5 roll 25 5 roll
      STnoshfill STnoshfill STnoshfill STnoshfill } BD
/STnoshfill {
      2 index 8 index sub abs rThreshold gt
      { STsplit }
      { 1 index 7 index sub abs gThreshold gt
        { STsplit }
        { dup 6 index sub abs bThreshold gt
          { STsplit }
          { 2 index 13 index sub abs rThreshold gt
            { STsplit }
            { 1 index 12 index sub abs gThreshold gt
              { STsplit }
              { dup 11 index sub abs bThreshold gt
                { STsplit }
                { 7 index 13 index sub abs rThreshold gt
                  { STsplit }
                  { 6 index 12 index sub abs gThreshold gt
                    { STsplit }
                    { 5 index 11 index sub abs bThreshold gt
                      { STsplit }
                      { Tm }
                      ifelse }
                    ifelse }
                  ifelse }
                ifelse }
              ifelse }
            ifelse }
          ifelse }
        ifelse }
      ifelse } BD
tryPS3shading
{ /shfill where
  { /ST { STshfill } BD }
  { /ST { STnoshfill } BD }
  ifelse }
{ /ST { STnoshfill } BD }
ifelse
end
%%EndProlog
%%BeginSetup
/DeviceRGB setcolorspace
gl2psdict begin
%%EndSetup
%%Page: 1 1
%%BeginPageSetup
%%EndPageSetup
mark
gsave
1.0 1.0 scale
1 W
1.05788 0.510338 0.0236322 C
916.143 504.176 LS
971.667 504.176 L
999.429 548.595 L
943.905 548.595 L
916.143 504.176 LE
888.381 459.757 LS
943.905 459.757 L
971.667 504.176 L
916.143 504.176 L
888.381 459.757 LE
860.619 415.338 LS
916.143 415.338 L
943.905 459.757 L
888.381 459.757 L
860.619 415.338 LE
832.857 370.919 LS
888.381 370.919 L
916.143 415.338 L
860.619 415.338 L
832.857 370.919 LE
805.095 326.5 LS
860.619 326.5 L
888.381 370.919 L
832.857 370.919 L
805.095 326.5 LE
777.333 282.081 LS
832.857 282.081 L
860.619 326.5 L
805.095 326.5 L
777.333 282.081 LE
749.571 237.662 LS
805.095 237.662 L
832.857 282.081 L
777.333 282.081 L
749.571 237.662 LE
721.81 193.243 LS
777.333 193.243 L
805.095 237.662 L
749.571 237.662 L
721.81 193.243 LE
694.048 148.824 LS
749.571 148.824 L
777.333 193.243 L
721.81 193.243 L
694.048 148.824 LE
666.286 104.405 LS
721.81 104.405 L
749.571 148.824 L
694.048 148.824 L
666.286 104.405 LE
860.619 504.176 LS
916.143 504.176 L
943.905 548.595 L
888.381 548.595 L
860.619 504.176 LE
832.857 459.757 LS
888.381 459.757 L
916.143 504.176 L
860.619 504.176 L
832.857 459.757 LE
805.095 415.338 LS
860.619 415.338 L
888.381 459.757 L
832.857 459.757 L
805.095 415.338 LE
777.333 370.919 LS
832.857 370.919 L
860.619 415.338 L
805.095 415.338 L
777.333 370.919 LE
749.571 326.5 LS
805.095 326.5 L
832.857 370.919 L
777.333 370.919 L
749.571 326.5 LE
721.81 282.081 LS
777.333 282.081 L
805.095 326.5 L
749.571 326.5 L
721.81 282.081 LE
694.048 237.662 LS
749.571 237.662 L
777.333 282.081 L
721.81 282.081 L
694.048 237.662 LE
666.286 193.243 LS
721.81 193.243 L
749.571 237.662 L
694.048 237.662 L
666.286 193.243 LE
638.524 148.824 LS
694.048 148.824 L
721.81 193.243 L
666.286 193.243 L
638.524 148.824 LE
610.762 104.405 LS
666.286 104.405 L
694.048 148.824 L
638.524 148.824 L
610.762 104.405 LE
805.095 504.176 LS
860.619 504.176 L
888.381 548.595 L
832.857 548.595 L
805.095 504.176 LE
777.333 459.757 LS
832.857 459.757 L
860.619 504.176 L
805.095 504.176 L
777.333 459.757 LE
749.571 415.338 LS
805.095 415.338 L
832.857 459.757 L
777.333 459.757 L
749.571 415.338 LE
721.81 370.919 LS
777.333 370.919 L
805.095 415.338 L
749.571 415.338 L
721.81 370.919 LE
694.048 326.5 LS
749.571 326.5 L
777.333 370.919 L
721.81 370.919 L
694.048 326.5 LE
666.286 282.081 LS
721.81 282.081 L
749.571 326.5 L
694.048 326.5 L
666.286 282.081 LE
638.524 237.662 LS
694.048 237.662 L
721.81 282.081 L
666.286 282.081 L
638.524 237.662 LE
610.762 193.243 LS
666.286 193.243 L
694.048 237.662 L
638.524 237.662 L
610.762 193.243 LE
583 148.824 LS
638.524 148.824 L
666.286 193.243 L
610.762 193.243 L
583 148.824 LE
555.238 104.405 LS
610.762 104.405 L
638.524 148.824 L
583 148.824 L
555.238 104.405 LE
749.571 504.176 LS
805.095 504.176 L
832.857 548.595 L
777.333 548.595 L
749.571 504.176 LE
721.81 459.757 LS
777.333 459.757 L
805.095 504.176 L
749.571 504.176 L
721.81 459.757 LE
694.048 415.338 LS
749.571 415.338 L
777.333 459.757 L
721.81 459.757 L
694.048 415.338 LE
666.286 370.919 LS
721.81 370.919 L
749.571 415.338 L
694.048 415.338 L
666.286 370.919 LE
638.524 326.5 LS
694.048 326.5 L
721.81 370.919 L
666.286 370.919 L
638.524 326.5 LE
610.762 282.081 LS
666.286 282.081 L
694.048 326.5 L
638.524 326.5 L
610.762 282.081 LE
583 237.662 LS
638.524 237.662 L
666.286 282.081 L
610.762 282.081 L
583 237.662 LE
555.238 193.243 LS
610.762 193.243 L
638.524 237.662 L
583 237.662 L
555.238 193.243 LE
527.476 148.824 LS
583 148.824 L
610.762 193.243 L
555.238 193.243 L
527.476 148.824 LE
499.714 104.405 LS
555.238 104.405 L
583 148.824 L
527.476 148.824 L
499.714 104.405 LE
694.048 504.176 LS
749.571 504.176 L
777.333 548.595 L
721.81 548.595 L
694.048 504.176 LE
666.286 459.757 LS
721.81 459.757 L
749.571 504.176 L
694.048 504.176 L
666.286 459.757 LE
638.524 415.338 LS
694.048 415.338 L
721.81 459.757 L
666.286 459.757 L
638.524 415.338 LE
610.762 370.919 LS
666.286 370.919 L
694.048 415.338 L
638.524 415.338 L
610.762 370.919 LE
583 326.5 LS
638.524 326.5 L
666.286 370.919 L
610.762 370.919 L
583 326.5 LE
555.238 282.081 LS
610.762 282.081 L
638.524 326.5 L
583 326.5 L
555.238 282.081 LE
527.476 237.662 LS
583 237.662 L
610.762 282.081 L
555.238 282.081 L
527.476 237.662 LE
499.714 193.243 LS
555.238 193.243 L
583 237.662 L
527.476 237.662 L
499.714 193.243 LE
471.952 148.824 LS
527.476 148.824 L
555.238 193.243 L
499.714 193.243 L
471.952 148.824 LE
444.19 104.405 LS
499.714 104.405 L
527.476 148.824 L
471.952 148.824 L
444.19 104.405 LE
638.524 504.176 LS
694.048 504.176 L
721.81 548.595 L
666.286 548.595 L
638.524 504.176 LE
610.762 459.757 LS
666.286 459.757 L
694.048 504.176 L
638.524 504.176 L
610.762 459.757 LE
583 415.338 LS
638.524 415.338 L
666.286 459.757 L
610.762 459.757 L
583 415.338 LE
555.238 370.919 LS
610.762 370.919 L
638.524 415.338 L
583 415.338 L
555.238 370.919 LE
527.476 326.5 LS
583 326.5 L
610.762 370.919 L
555.238 370.919 L
527.476 326.5 LE
499.714 282.081 LS
555.238 282.081 L
583 326.5 L
527.476 326.5 L
499.714 282.081 LE
471.952 237.662 LS
527.476 237.662 L
555.238 282.081 L
499.714 282.081 L
471.952 237.662 LE
444.19 193.243 LS
499.714 193.243 L
527.476 237.662 L
471.952 237.662 L
444.19 193.243 LE
416.429 148.824 LS
471.952 148.824 L
499.714 193.243 L
444.19 193.243 L
416.429 148.824 LE
388.667 104.405 LS
444.19 104.405 L
471.952 148.824 L
416.429 148.824 L
388.667 104.405 LE
583 504.176 LS
638.524 504.176 L
666.286 548.595 L
610.762 548.595 L
583 504.176 LE
555.238 459.757 LS
610.762 459.757 L
638.524 504.176 L
583 504.176 L
555.238 459.757 LE
527.476 415.338 LS
583 415.338 L
610.762 459.757 L
555.238 459.757 L
527.476 415.338 LE
499.714 370.919 LS
555.238 370.919 L
583 415.338 L
527.476 415.338 L
499.714 370.919 LE
471.952 326.5 LS
527.476 326.5 L
555.238 370.919 L
499.714 370.919 L
471.952 326.5 LE
444.19 282.081 LS
499.714 282.081 L
527.476 326.5 L
471.952 326.5 L
444.19 282.081 LE
416.429 237.662 LS
471.952 237.662 L
499.714 282.081 L
444.19 282.081 L
416.429 237.662 LE
388.667 193.243 LS
444.19 193.243 L
471.952 237.662 L
416.429 237.662 L
388.667 193.243 LE
360.905 148.824 LS
416.429 148.824 L
444.19 193.243 L
388.667 193.243 L
360.905 148.824 LE
333.143 104.405 LS
388.667 104.405 L
416.429 148.824 L
360.905 148.824 L
333.143 104.405 LE
527.476 504.176 LS
583 504.176 L
610.762 548.595 L
555.238 548.595 L
527.476 504.176 LE
499.714 459.757 LS
555.238 459.757 L
583 504.176 L
527.476 504.176 L
499.714 459.757 LE
471.952 415.338 LS
527.476 415.338 L
555.238 459.757 L
499.714 459.757 L
471.952 415.338 LE
444.19 370.919 LS
499.714 370.919 L
527.476 415.338 L
471.952 415.338 L
444.19 370.919 LE
416.429 326.5 LS
471.952 326.5 L
499.714 370.919 L
444.19 370.919 L
416.429 326.5 LE
388.667 282.081 LS
444.19 282.081 L
471.952 326.5 L
416.429 326.5 L
388.667 282.081 LE
360.905 237.662 LS
416.429 237.662 L
444.19 282.081 L
388.667 282.081 L
360.905 237.662 LE
333.143 193.243 LS
388.667 193.243 L
416.429 237.662 L
360.905 237.662 L
333.143 193.243 LE
305.381 148.824 LS
360.905 148.824 L
388.667 193.243 L
333.143 193.243 L
305.381 148.824 LE
277.619 104.405 LS
333.143 104.405 L
360.905 148.824 L
305.381 148.824 L
277.619 104.405 LE
471.952 504.176 LS
527.476 504.176 L
555.238 548.595 L
499.714 548.595 L
471.952 504.176 LE
444.19 459.757 LS
499.714 459.757 L
527.476 504.176 L
471.952 504.176 L
444.19 459.757 LE
416.429 415.338 LS
471.952 415.338 L
499.714 459.757 L
444.19 459.757 L
416.429 415.338 LE
388.667 370.919 LS
444.19 370.919 L
471.952 415.338 L
416.429 415.338 L
388.667 370.919 LE
360.905 326.5 LS
416.429 326.5 L
444.19 370.919 L
388.667 370.919 L
360.905 326.5 LE
333.143 282.081 LS
388.667 282.081 L
416.429 326.5 L
360.905 326.5 L
333.143 282.081 LE
305.381 237.662 LS
360.905 237.662 L
388.667 282.081 L
333.143 282.081 L
305.381 237.662 LE
277.619 193.243 LS
333.143 193.243 L
360.905 237.662 L
305.381 237.662 L
277.619 193.243 LE
249.857 148.824 LS
305.381 148.824 L
333.143 193.243 L
277.619 193.243 L
249.857 148.824 LE
222.095 104.405 LS
277.619 104.405 L
305.381 148.824 L
249.857 148.824 L
222.095 104.405 LE
416.429 504.176 LS
471.952 504.176 L
499.714 548.595 L
444.19 548.595 L
416.429 504.176 LE
388.667 459.757 LS
444.19 459.757 L
471.952 504.176 L
416.429 504.176 L
388.667 459.757 LE
360.905 415.338 LS
416.429 415.338 L
444.19 459.757 L
388.667 459.757 L
360.905 415.338 LE
333.143 370.919 LS
388.667 370.919 L
416.429 415.338 L
360.905 415.338 L
333.143 370.919 LE
305.381 326.5 LS
360.905 326.5 L
388.667 370.919 L
333.143 370.919 L
305.381 326.5 LE
277.619 282.081 LS
333.143 282.081 L
360.905 326.5 L
305.381 326.5 L
277.619 282.081 LE
249.857 237.662 LS
305.381 237.662 L
333.143 282.081 L
277.619 282.081 L
249.857 237.662 LE
222.095 193.243 LS
277.619 193.243 L
305.381 237.662 L
249.857 237.662 L
222.095 193.243 LE
194.333 148.824 LS
249.857 148.824 L
277.619 193.243 L
222.095 193.243 L
194.333 148.824 LE
166.571 104.405 LS
222.095 104.405 L
249.857 148.824 L
194.333 148.824 L
166.571 104.405 LE
3 setlinewidth
1 0 0 setrgbcolor
165 104 LS 722 104 LE
0 0 1 setrgbcolor
165 104 LS 444 549 LE
(O) 135 100 15 /Helvetica S
(A) 745 100 15 /Helvetica S
(B) 405 540 15 /Helvetica S
gsave 0 setgray % 0 0.35 0 setrgbcolor
165 104 moveto
165 104 3.5 0 360 arc fill
722 104 moveto
722 104 3.5 0 360 arc fill
444 549 moveto
444 549 3.5 0 360 arc fill
grestore
grestore
showpage
cleartomark
%%PageTrailer
%%Trailer
end
%%EOF
