%!PS-Adobe-3.0 EPSF-3.0
%%Title: gelly-01
%%Creator: GL2PS 1.4.3, (C) 1999-2020 C. Geuzaine
%%For: Gmsh
%%CreationDate: Sat Nov 23 23:36:50 2024
%%LanguageLevel: 3
%%DocumentData: Clean7Bit
%%Pages: 1
%%BoundingBox: 195 87 970 565
%%EndComments
%%BeginProlog
/gl2psdict 64 dict def gl2psdict begin
/tryPS3shading false def % set to false to force subdivision
/rThreshold 0.0666667 def % red component subdivision threshold
/gThreshold 0.05 def % green component subdivision threshold
/bThreshold 0.1 def % blue component subdivision threshold
/BD { bind def } bind def
/C  { setrgbcolor } BD
/G  { 0.082 mul exch 0.6094 mul add exch 0.3086 mul add neg 1.0 add setgray } BD
/W  { setlinewidth } BD
/LC  { setlinecap } BD
/LJ  { setlinejoin } BD
/FC { findfont exch /SH exch def SH scalefont setfont } BD
/SW { dup stringwidth pop } BD
/S  { FC moveto show } BD
/SBC{ FC moveto SW -2 div 0 rmoveto show } BD
/SBR{ FC moveto SW neg 0 rmoveto show } BD
/SCL{ FC moveto 0 SH -2 div rmoveto show } BD
/SCC{ FC moveto SW -2 div SH -2 div rmoveto show } BD
/SCR{ FC moveto SW neg SH -2 div rmoveto show } BD
/STL{ FC moveto 0 SH neg rmoveto show } BD
/STC{ FC moveto SW -2 div SH neg rmoveto show } BD
/STR{ FC moveto SW neg SH neg rmoveto show } BD
/FCT { FC translate 0 0 } BD
/SR  { gsave FCT moveto rotate show grestore } BD
/SBCR{ gsave FCT moveto rotate SW -2 div 0 rmoveto show grestore } BD
/SBRR{ gsave FCT moveto rotate SW neg 0 rmoveto show grestore } BD
/SCLR{ gsave FCT moveto rotate 0 SH -2 div rmoveto show grestore} BD
/SCCR{ gsave FCT moveto rotate SW -2 div SH -2 div rmoveto show grestore} BD
/SCRR{ gsave FCT moveto rotate SW neg SH -2 div rmoveto show grestore} BD
/STLR{ gsave FCT moveto rotate 0 SH neg rmoveto show grestore } BD
/STCR{ gsave FCT moveto rotate SW -2 div SH neg rmoveto show grestore } BD
/STRR{ gsave FCT moveto rotate SW neg SH neg rmoveto show grestore } BD
/P  { newpath 0.0 360.0 arc closepath fill } BD
/R  { newpath moveto lineto lineto lineto closepath fill } BD
/LS { newpath moveto } BD
/L  { lineto } BD
/LE { lineto stroke } BD
/T  { newpath moveto lineto lineto closepath fill } BD
/STshfill {
      /b1 exch def /g1 exch def /r1 exch def /y1 exch def /x1 exch def
      /b2 exch def /g2 exch def /r2 exch def /y2 exch def /x2 exch def
      /b3 exch def /g3 exch def /r3 exch def /y3 exch def /x3 exch def
      gsave << /ShadingType 4 /ColorSpace [/DeviceRGB]
      /DataSource [ 0 x1 y1 r1 g1 b1 0 x2 y2 r2 g2 b2 0 x3 y3 r3 g3 b3 ] >>
      shfill grestore } BD
/Tm { 3 -1 roll 8 -1 roll 13 -1 roll add add 3 div
      3 -1 roll 7 -1 roll 11 -1 roll add add 3 div
      3 -1 roll 6 -1 roll 9 -1 roll add add 3 div C T } BD
/STsplit {
      4 index 15 index add 0.5 mul
      4 index 15 index add 0.5 mul
      4 index 15 index add 0.5 mul
      4 index 15 index add 0.5 mul
      4 index 15 index add 0.5 mul
      5 copy 5 copy 25 15 roll
      9 index 30 index add 0.5 mul
      9 index 30 index add 0.5 mul
      9 index 30 index add 0.5 mul
      9 index 30 index add 0.5 mul
      9 index 30 index add 0.5 mul
      5 copy 5 copy 35 5 roll 25 5 roll 15 5 roll
      4 index 10 index add 0.5 mul
      4 index 10 index add 0.5 mul
      4 index 10 index add 0.5 mul
      4 index 10 index add 0.5 mul
      4 index 10 index add 0.5 mul
      5 copy 5 copy 40 5 roll 25 5 roll 15 5 roll 25 5 roll
      STnoshfill STnoshfill STnoshfill STnoshfill } BD
/STnoshfill {
      2 index 8 index sub abs rThreshold gt
      { STsplit }
      { 1 index 7 index sub abs gThreshold gt
        { STsplit }
        { dup 6 index sub abs bThreshold gt
          { STsplit }
          { 2 index 13 index sub abs rThreshold gt
            { STsplit }
            { 1 index 12 index sub abs gThreshold gt
              { STsplit }
              { dup 11 index sub abs bThreshold gt
                { STsplit }
                { 7 index 13 index sub abs rThreshold gt
                  { STsplit }
                  { 6 index 12 index sub abs gThreshold gt
                    { STsplit }
                    { 5 index 11 index sub abs bThreshold gt
                      { STsplit }
                      { Tm }
                      ifelse }
                    ifelse }
                  ifelse }
                ifelse }
              ifelse }
            ifelse }
          ifelse }
        ifelse }
      ifelse } BD
tryPS3shading
{ /shfill where
  { /ST { STshfill } BD }
  { /ST { STnoshfill } BD }
  ifelse }
{ /ST { STnoshfill } BD }
ifelse
end
%%EndProlog
%%BeginSetup
/DeviceRGB setcolorspace
gl2psdict begin
%%EndSetup
%%Page: 1 1
%%BeginPageSetup
%%EndPageSetup
mark
gsave
1.0 1.0 scale
1 W
1.05788 0.510338 0.0236322 C
934.341 544.059 LS
959.294 545.058 L
964.88 559.714 L
939.927 558.715 L
934.341 544.059 LE
929.198 529.064 LS
954.149 530.062 L
959.294 545.058 L
934.341 544.059 L
929.198 529.064 LE
924.546 513.766 LS
949.499 514.766 L
954.149 530.062 L
929.198 529.064 L
924.546 513.766 LE
920.437 498.217 LS
945.388 499.217 L
949.499 514.766 L
924.546 513.766 L
920.437 498.217 LE
916.908 482.472 LS
941.86 483.47 L
945.388 499.217 L
920.437 498.217 L
916.908 482.472 LE
913.996 466.594 LS
938.948 467.593 L
941.86 483.47 L
916.908 482.472 L
913.996 466.594 LE
911.724 450.654 LS
936.676 451.653 L
938.948 467.593 L
913.996 466.594 L
911.724 450.654 LE
910.107 434.73 LS
935.06 435.729 L
936.676 451.653 L
911.724 450.654 L
910.107 434.73 LE
909.148 418.899 LS
934.1 419.897 L
935.06 435.729 L
910.107 434.73 L
909.148 418.899 LE
908.832 403.239 LS
933.785 404.238 L
934.1 419.897 L
909.148 418.899 L
908.832 403.239 LE
909.148 387.58 LS
934.1 388.579 L
933.785 404.238 L
908.832 403.239 L
909.148 387.58 LE
910.107 371.748 LS
935.06 372.747 L
934.1 388.579 L
909.148 387.58 L
910.107 371.748 LE
911.724 355.824 LS
936.676 356.823 L
935.06 372.747 L
910.107 371.748 L
911.724 355.824 LE
913.996 339.885 LS
938.948 340.884 L
936.676 356.823 L
911.724 355.824 L
913.996 339.885 LE
916.908 324.007 LS
941.86 325.006 L
938.948 340.884 L
913.996 339.885 L
916.908 324.007 LE
920.437 308.261 LS
945.388 309.26 L
941.86 325.006 L
916.908 324.007 L
920.437 308.261 LE
924.546 292.711 LS
949.499 293.71 L
945.388 309.26 L
920.437 308.261 L
924.546 292.711 LE
929.198 277.415 LS
954.149 278.414 L
949.499 293.71 L
924.546 292.711 L
929.198 277.415 LE
934.341 262.419 LS
959.294 263.418 L
954.149 278.414 L
929.198 277.415 L
934.341 262.419 LE
939.927 247.763 LS
964.88 248.762 L
959.294 263.418 L
934.341 262.419 L
939.927 247.763 LE
908.678 540.975 LS
934.341 544.059 L
939.927 558.715 L
914.263 555.631 L
908.678 540.975 LE
903.534 525.979 LS
929.198 529.064 L
934.341 544.059 L
908.678 540.975 L
903.534 525.979 LE
898.883 510.683 LS
924.546 513.766 L
929.198 529.064 L
903.534 525.979 L
898.883 510.683 LE
894.773 495.133 LS
920.437 498.217 L
924.546 513.766 L
898.883 510.683 L
894.773 495.133 LE
891.245 479.387 LS
916.908 482.472 L
920.437 498.217 L
894.773 495.133 L
891.245 479.387 LE
888.331 463.509 LS
913.996 466.594 L
916.908 482.472 L
891.245 479.387 L
888.331 463.509 LE
886.061 447.57 LS
911.724 450.654 L
913.996 466.594 L
888.331 463.509 L
886.061 447.57 LE
884.444 431.646 LS
910.107 434.73 L
911.724 450.654 L
886.061 447.57 L
884.444 431.646 LE
883.483 415.814 LS
909.148 418.899 L
910.107 434.73 L
884.444 431.646 L
883.483 415.814 LE
883.168 400.155 LS
908.832 403.239 L
909.148 418.899 L
883.483 415.814 L
883.168 400.155 LE
883.483 384.495 LS
909.148 387.58 L
908.832 403.239 L
883.168 400.155 L
883.483 384.495 LE
884.444 368.664 LS
910.107 371.748 L
909.148 387.58 L
883.483 384.495 L
884.444 368.664 LE
886.061 352.74 LS
911.724 355.824 L
910.107 371.748 L
884.444 368.664 L
886.061 352.74 LE
888.331 336.8 LS
913.996 339.885 L
911.724 355.824 L
886.061 352.74 L
888.331 336.8 LE
891.245 320.922 LS
916.908 324.007 L
913.996 339.885 L
888.331 336.8 L
891.245 320.922 LE
894.773 305.176 LS
920.437 308.261 L
916.908 324.007 L
891.245 320.922 L
894.773 305.176 LE
898.883 289.627 LS
924.546 292.711 L
920.437 308.261 L
894.773 305.176 L
898.883 289.627 LE
903.534 274.33 LS
929.198 277.415 L
924.546 292.711 L
898.883 289.627 L
903.534 274.33 LE
908.678 259.335 LS
934.341 262.419 L
929.198 277.415 L
903.534 274.33 L
908.678 259.335 LE
914.263 244.679 LS
939.927 247.763 L
934.341 262.419 L
908.678 259.335 L
914.263 244.679 LE
882.824 535.844 LS
908.678 540.975 L
914.263 555.631 L
888.41 550.499 L
882.824 535.844 LE
877.681 520.848 LS
903.534 525.979 L
908.678 540.975 L
882.824 535.844 L
877.681 520.848 LE
873.031 505.551 LS
898.883 510.683 L
903.534 525.979 L
877.681 520.848 L
873.031 505.551 LE
868.92 490.002 LS
894.773 495.133 L
898.883 510.683 L
873.031 505.551 L
868.92 490.002 LE
865.391 474.256 LS
891.245 479.387 L
894.773 495.133 L
868.92 490.002 L
865.391 474.256 LE
862.479 458.378 LS
888.331 463.509 L
891.245 479.387 L
865.391 474.256 L
862.479 458.378 LE
860.207 442.439 LS
886.061 447.57 L
888.331 463.509 L
862.479 458.378 L
860.207 442.439 LE
858.592 426.514 LS
884.444 431.646 L
886.061 447.57 L
860.207 442.439 L
858.592 426.514 LE
857.631 410.683 LS
883.483 415.814 L
884.444 431.646 L
858.592 426.514 L
857.631 410.683 LE
857.315 395.024 LS
883.168 400.155 L
883.483 415.814 L
857.631 410.683 L
857.315 395.024 LE
857.631 379.364 LS
883.483 384.495 L
883.168 400.155 L
857.315 395.024 L
857.631 379.364 LE
858.592 363.533 LS
884.444 368.664 L
883.483 384.495 L
857.631 379.364 L
858.592 363.533 LE
860.207 347.608 LS
886.061 352.74 L
884.444 368.664 L
858.592 363.533 L
860.207 347.608 LE
862.479 331.669 LS
888.331 336.8 L
886.061 352.74 L
860.207 347.608 L
862.479 331.669 LE
865.391 315.791 LS
891.245 320.922 L
888.331 336.8 L
862.479 331.669 L
865.391 315.791 LE
868.92 300.045 LS
894.773 305.176 L
891.245 320.922 L
865.391 315.791 L
868.92 300.045 LE
873.031 284.496 LS
898.883 289.627 L
894.773 305.176 L
868.92 300.045 L
873.031 284.496 LE
877.681 269.199 LS
903.534 274.33 L
898.883 289.627 L
873.031 284.496 L
877.681 269.199 LE
882.824 254.204 LS
908.678 259.335 L
903.534 274.33 L
877.681 269.199 L
882.824 254.204 LE
888.41 239.547 LS
914.263 244.679 L
908.678 259.335 L
882.824 254.204 L
888.41 239.547 LE
857.216 528.897 LS
882.824 535.844 L
888.41 550.499 L
862.802 543.553 L
857.216 528.897 LE
852.073 513.902 LS
877.681 520.848 L
882.824 535.844 L
857.216 528.897 L
852.073 513.902 LE
847.422 498.604 LS
873.031 505.551 L
877.681 520.848 L
852.073 513.902 L
847.422 498.604 LE
843.311 483.055 LS
868.92 490.002 L
873.031 505.551 L
847.422 498.604 L
843.311 483.055 LE
839.782 467.309 LS
865.391 474.256 L
868.92 490.002 L
843.311 483.055 L
839.782 467.309 LE
836.87 451.431 LS
862.479 458.378 L
865.391 474.256 L
839.782 467.309 L
836.87 451.431 LE
834.599 435.492 LS
860.207 442.439 L
862.479 458.378 L
836.87 451.431 L
834.599 435.492 LE
832.982 419.567 LS
858.592 426.514 L
860.207 442.439 L
834.599 435.492 L
832.982 419.567 LE
832.022 403.736 LS
857.631 410.683 L
858.592 426.514 L
832.982 419.567 L
832.022 403.736 LE
831.707 388.077 LS
857.315 395.024 L
857.631 410.683 L
832.022 403.736 L
831.707 388.077 LE
832.022 372.417 LS
857.631 379.364 L
857.315 395.024 L
831.707 388.077 L
832.022 372.417 LE
832.982 356.586 LS
858.592 363.533 L
857.631 379.364 L
832.022 372.417 L
832.982 356.586 LE
834.599 340.661 LS
860.207 347.608 L
858.592 363.533 L
832.982 356.586 L
834.599 340.661 LE
836.87 324.722 LS
862.479 331.669 L
860.207 347.608 L
834.599 340.661 L
836.87 324.722 LE
839.782 308.844 LS
865.391 315.791 L
862.479 331.669 L
836.87 324.722 L
839.782 308.844 LE
843.311 293.098 LS
868.92 300.045 L
865.391 315.791 L
839.782 308.844 L
843.311 293.098 LE
847.422 277.549 LS
873.031 284.496 L
868.92 300.045 L
843.311 293.098 L
847.422 277.549 LE
852.073 262.252 LS
877.681 269.199 L
873.031 284.496 L
847.422 277.549 L
852.073 262.252 LE
857.216 247.257 LS
882.824 254.204 L
877.681 269.199 L
852.073 262.252 L
857.216 247.257 LE
862.802 232.601 LS
888.41 239.547 L
882.824 254.204 L
857.216 247.257 L
862.802 232.601 LE
832.132 520.475 LS
857.216 528.897 L
862.802 543.553 L
837.718 535.13 L
832.132 520.475 LE
826.988 505.48 LS
852.073 513.902 L
857.216 528.897 L
832.132 520.475 L
826.988 505.48 LE
822.338 490.182 LS
847.422 498.604 L
852.073 513.902 L
826.988 505.48 L
822.338 490.182 LE
818.227 474.633 LS
843.311 483.055 L
847.422 498.604 L
822.338 490.182 L
818.227 474.633 LE
814.698 458.887 LS
839.782 467.309 L
843.311 483.055 L
818.227 474.633 L
814.698 458.887 LE
811.786 443.009 LS
836.87 451.431 L
839.782 467.309 L
814.698 458.887 L
811.786 443.009 LE
809.515 427.07 LS
834.599 435.492 L
836.87 451.431 L
811.786 443.009 L
809.515 427.07 LE
807.898 411.146 LS
832.982 419.567 L
834.599 435.492 L
809.515 427.07 L
807.898 411.146 LE
806.938 395.314 LS
832.022 403.736 L
832.982 419.567 L
807.898 411.146 L
806.938 395.314 LE
806.623 379.655 LS
831.707 388.077 L
832.022 403.736 L
806.938 395.314 L
806.623 379.655 LE
806.938 363.995 LS
832.022 372.417 L
831.707 388.077 L
806.623 379.655 L
806.938 363.995 LE
807.898 348.164 LS
832.982 356.586 L
832.022 372.417 L
806.938 363.995 L
807.898 348.164 LE
809.515 332.24 LS
834.599 340.661 L
832.982 356.586 L
807.898 348.164 L
809.515 332.24 LE
811.786 316.3 LS
836.87 324.722 L
834.599 340.661 L
809.515 332.24 L
811.786 316.3 LE
814.698 300.422 LS
839.782 308.844 L
836.87 324.722 L
811.786 316.3 L
814.698 300.422 LE
818.227 284.676 LS
843.311 293.098 L
839.782 308.844 L
814.698 300.422 L
818.227 284.676 LE
822.338 269.127 LS
847.422 277.549 L
843.311 293.098 L
818.227 284.676 L
822.338 269.127 LE
826.988 253.83 LS
852.073 262.252 L
847.422 277.549 L
822.338 269.127 L
826.988 253.83 LE
832.132 238.835 LS
857.216 247.257 L
852.073 262.252 L
826.988 253.83 L
832.132 238.835 LE
837.718 224.179 LS
862.802 232.601 L
857.216 247.257 L
832.132 238.835 L
837.718 224.179 LE
807.694 510.94 LS
832.132 520.475 L
837.718 535.13 L
813.28 525.597 L
807.694 510.94 LE
802.55 495.944 LS
826.988 505.48 L
832.132 520.475 L
807.694 510.94 L
802.55 495.944 LE
797.9 480.648 LS
822.338 490.182 L
826.988 505.48 L
802.55 495.944 L
797.9 480.648 LE
793.789 465.098 LS
818.227 474.633 L
822.338 490.182 L
797.9 480.648 L
793.789 465.098 LE
790.26 449.353 LS
814.698 458.887 L
818.227 474.633 L
793.789 465.098 L
790.26 449.353 LE
787.348 433.474 LS
811.786 443.009 L
814.698 458.887 L
790.26 449.353 L
787.348 433.474 LE
785.077 417.535 LS
809.515 427.07 L
811.786 443.009 L
787.348 433.474 L
785.077 417.535 LE
783.461 401.611 LS
807.898 411.146 L
809.515 427.07 L
785.077 417.535 L
783.461 401.611 LE
782.5 385.78 LS
806.938 395.314 L
807.898 411.146 L
783.461 401.611 L
782.5 385.78 LE
782.185 370.12 LS
806.623 379.655 L
806.938 395.314 L
782.5 385.78 L
782.185 370.12 LE
782.5 354.461 LS
806.938 363.995 L
806.623 379.655 L
782.185 370.12 L
782.5 354.461 LE
783.461 338.629 LS
807.898 348.164 L
806.938 363.995 L
782.5 354.461 L
783.461 338.629 LE
785.077 322.705 LS
809.515 332.24 L
807.898 348.164 L
783.461 338.629 L
785.077 322.705 LE
787.348 306.766 LS
811.786 316.3 L
809.515 332.24 L
785.077 322.705 L
787.348 306.766 LE
790.26 290.888 LS
814.698 300.422 L
811.786 316.3 L
787.348 306.766 L
790.26 290.888 LE
793.789 275.142 LS
818.227 284.676 L
814.698 300.422 L
790.26 290.888 L
793.789 275.142 LE
797.9 259.592 LS
822.338 269.127 L
818.227 284.676 L
793.789 275.142 L
797.9 259.592 LE
802.55 244.296 LS
826.988 253.83 L
822.338 269.127 L
797.9 259.592 L
802.55 244.296 LE
807.694 229.3 LS
832.132 238.835 L
826.988 253.83 L
802.55 244.296 L
807.694 229.3 LE
813.28 214.644 LS
837.718 224.179 L
832.132 238.835 L
807.694 229.3 L
813.28 214.644 LE
783.894 500.618 LS
807.694 510.94 L
813.28 525.597 L
789.48 515.275 L
783.894 500.618 LE
778.75 485.622 LS
802.55 495.944 L
807.694 510.94 L
783.894 500.618 L
778.75 485.622 LE
774.099 470.326 LS
797.9 480.648 L
802.55 495.944 L
778.75 485.622 L
774.099 470.326 LE
769.989 454.777 LS
793.789 465.098 L
797.9 480.648 L
774.099 470.326 L
769.989 454.777 LE
766.46 439.031 LS
790.26 449.353 L
793.789 465.098 L
769.989 454.777 L
766.46 439.031 LE
763.548 423.153 LS
787.348 433.474 L
790.26 449.353 L
766.46 439.031 L
763.548 423.153 LE
761.276 407.213 LS
785.077 417.535 L
787.348 433.474 L
763.548 423.153 L
761.276 407.213 LE
759.66 391.289 LS
783.461 401.611 L
785.077 417.535 L
761.276 407.213 L
759.66 391.289 LE
758.7 375.458 LS
782.5 385.78 L
783.461 401.611 L
759.66 391.289 L
758.7 375.458 LE
758.384 359.798 LS
782.185 370.12 L
782.5 385.78 L
758.7 375.458 L
758.384 359.798 LE
758.7 344.139 LS
782.5 354.461 L
782.185 370.12 L
758.384 359.798 L
758.7 344.139 LE
759.66 328.307 LS
783.461 338.629 L
782.5 354.461 L
758.7 344.139 L
759.66 328.307 LE
761.276 312.383 LS
785.077 322.705 L
783.461 338.629 L
759.66 328.307 L
761.276 312.383 LE
763.548 296.444 LS
787.348 306.766 L
785.077 322.705 L
761.276 312.383 L
763.548 296.444 LE
766.46 280.566 LS
790.26 290.888 L
787.348 306.766 L
763.548 296.444 L
766.46 280.566 LE
769.989 264.82 LS
793.789 275.142 L
790.26 290.888 L
766.46 280.566 L
769.989 264.82 LE
774.099 249.27 LS
797.9 259.592 L
793.789 275.142 L
769.989 264.82 L
774.099 249.27 LE
778.75 233.974 LS
802.55 244.296 L
797.9 259.592 L
774.099 249.27 L
778.75 233.974 LE
783.894 218.978 LS
807.694 229.3 L
802.55 244.296 L
778.75 233.974 L
783.894 218.978 LE
789.48 204.322 LS
813.28 214.644 L
807.694 229.3 L
783.894 218.978 L
789.48 204.322 LE
760.631 489.775 LS
783.894 500.618 L
789.48 515.275 L
766.217 504.432 L
760.631 489.775 LE
755.488 474.78 LS
778.75 485.622 L
783.894 500.618 L
760.631 489.775 L
755.488 474.78 LE
750.837 459.483 LS
774.099 470.326 L
778.75 485.622 L
755.488 474.78 L
750.837 459.483 LE
746.726 443.934 LS
769.989 454.777 L
774.099 470.326 L
750.837 459.483 L
746.726 443.934 LE
743.198 428.188 LS
766.46 439.031 L
769.989 454.777 L
746.726 443.934 L
743.198 428.188 LE
740.285 412.31 LS
763.548 423.153 L
766.46 439.031 L
743.198 428.188 L
740.285 412.31 LE
738.014 396.37 LS
761.276 407.213 L
763.548 423.153 L
740.285 412.31 L
738.014 396.37 LE
736.398 380.446 LS
759.66 391.289 L
761.276 407.213 L
738.014 396.37 L
736.398 380.446 LE
735.438 364.615 LS
758.7 375.458 L
759.66 391.289 L
736.398 380.446 L
735.438 364.615 LE
735.122 348.955 LS
758.384 359.798 L
758.7 375.458 L
735.438 364.615 L
735.122 348.955 LE
735.438 333.296 LS
758.7 344.139 L
758.384 359.798 L
735.122 348.955 L
735.438 333.296 LE
736.398 317.464 LS
759.66 328.307 L
758.7 344.139 L
735.438 333.296 L
736.398 317.464 LE
738.014 301.54 LS
761.276 312.383 L
759.66 328.307 L
736.398 317.464 L
738.014 301.54 LE
740.285 285.601 LS
763.548 296.444 L
761.276 312.383 L
738.014 301.54 L
740.285 285.601 LE
743.198 269.723 LS
766.46 280.566 L
763.548 296.444 L
740.285 285.601 L
743.198 269.723 LE
746.726 253.977 LS
769.989 264.82 L
766.46 280.566 L
743.198 269.723 L
746.726 253.977 LE
750.837 238.427 LS
774.099 249.27 L
769.989 264.82 L
746.726 253.977 L
750.837 238.427 LE
755.488 223.131 LS
778.75 233.974 L
774.099 249.27 L
750.837 238.427 L
755.488 223.131 LE
760.631 208.135 LS
783.894 218.978 L
778.75 233.974 L
755.488 223.131 L
760.631 208.135 LE
766.217 193.479 LS
789.48 204.322 L
783.894 218.978 L
760.631 208.135 L
766.217 193.479 LE
737.752 478.62 LS
760.631 489.775 L
766.217 504.432 L
743.339 493.276 L
737.752 478.62 LE
732.609 463.625 LS
755.488 474.78 L
760.631 489.775 L
737.752 478.62 L
732.609 463.625 LE
727.958 448.328 LS
750.837 459.483 L
755.488 474.78 L
732.609 463.625 L
727.958 448.328 LE
723.847 432.779 LS
746.726 443.934 L
750.837 459.483 L
727.958 448.328 L
723.847 432.779 LE
720.319 417.033 LS
743.198 428.188 L
746.726 443.934 L
723.847 432.779 L
720.319 417.033 LE
717.406 401.155 LS
740.285 412.31 L
743.198 428.188 L
720.319 417.033 L
717.406 401.155 LE
715.135 385.215 LS
738.014 396.37 L
740.285 412.31 L
717.406 401.155 L
715.135 385.215 LE
713.519 369.291 LS
736.398 380.446 L
738.014 396.37 L
715.135 385.215 L
713.519 369.291 LE
712.559 353.46 LS
735.438 364.615 L
736.398 380.446 L
713.519 369.291 L
712.559 353.46 LE
712.243 337.8 LS
735.122 348.955 L
735.438 364.615 L
712.559 353.46 L
712.243 337.8 LE
712.559 322.141 LS
735.438 333.296 L
735.122 348.955 L
712.243 337.8 L
712.559 322.141 LE
713.519 306.309 LS
736.398 317.464 L
735.438 333.296 L
712.559 322.141 L
713.519 306.309 LE
715.135 290.385 LS
738.014 301.54 L
736.398 317.464 L
713.519 306.309 L
715.135 290.385 LE
717.406 274.446 LS
740.285 285.601 L
738.014 301.54 L
715.135 290.385 L
717.406 274.446 LE
720.319 258.568 LS
743.198 269.723 L
740.285 285.601 L
717.406 274.446 L
720.319 258.568 LE
723.847 242.822 LS
746.726 253.977 L
743.198 269.723 L
720.319 258.568 L
723.847 242.822 LE
727.958 227.272 LS
750.837 238.427 L
746.726 253.977 L
723.847 242.822 L
727.958 227.272 LE
732.609 211.976 LS
755.488 223.131 L
750.837 238.427 L
727.958 227.272 L
732.609 211.976 LE
737.752 196.98 LS
760.631 208.135 L
755.488 223.131 L
732.609 211.976 L
737.752 196.98 LE
743.339 182.324 LS
766.217 193.479 L
760.631 208.135 L
737.752 196.98 L
743.339 182.324 LE
715.072 467.32 LS
737.752 478.62 L
743.339 493.276 L
720.658 481.976 L
715.072 467.32 LE
709.928 452.324 LS
732.609 463.625 L
737.752 478.62 L
715.072 467.32 L
709.928 452.324 LE
705.277 437.028 LS
727.958 448.328 L
732.609 463.625 L
709.928 452.324 L
705.277 437.028 LE
701.167 421.478 LS
723.847 432.779 L
727.958 448.328 L
705.277 437.028 L
701.167 421.478 LE
697.638 405.733 LS
720.319 417.033 L
723.847 432.779 L
701.167 421.478 L
697.638 405.733 LE
694.726 389.855 LS
717.406 401.155 L
720.319 417.033 L
697.638 405.733 L
694.726 389.855 LE
692.455 373.915 LS
715.135 385.215 L
717.406 401.155 L
694.726 389.855 L
692.455 373.915 LE
690.838 357.991 LS
713.519 369.291 L
715.135 385.215 L
692.455 373.915 L
690.838 357.991 LE
689.878 342.159 LS
712.559 353.46 L
713.519 369.291 L
690.838 357.991 L
689.878 342.159 LE
689.563 326.5 LS
712.243 337.8 L
712.559 353.46 L
689.878 342.159 L
689.563 326.5 LE
689.878 310.841 LS
712.559 322.141 L
712.243 337.8 L
689.563 326.5 L
689.878 310.841 LE
690.838 295.009 LS
713.519 306.309 L
712.559 322.141 L
689.878 310.841 L
690.838 295.009 LE
692.455 279.085 LS
715.135 290.385 L
713.519 306.309 L
690.838 295.009 L
692.455 279.085 LE
694.726 263.145 LS
717.406 274.446 L
715.135 290.385 L
692.455 279.085 L
694.726 263.145 LE
697.638 247.267 LS
720.319 258.568 L
717.406 274.446 L
694.726 263.145 L
697.638 247.267 LE
701.167 231.522 LS
723.847 242.822 L
720.319 258.568 L
697.638 247.267 L
701.167 231.522 LE
705.277 215.972 LS
727.958 227.272 L
723.847 242.822 L
701.167 231.522 L
705.277 215.972 LE
709.928 200.676 LS
732.609 211.976 L
727.958 227.272 L
705.277 215.972 L
709.928 200.676 LE
715.072 185.68 LS
737.752 196.98 L
732.609 211.976 L
709.928 200.676 L
715.072 185.68 LE
720.658 171.024 LS
743.339 182.324 L
737.752 196.98 L
715.072 185.68 L
720.658 171.024 LE
251.812 472.204 LS
232.215 481.976 L
226.629 467.32 L
246.225 457.548 L
251.812 472.204 LE
246.225 457.548 LS
226.629 467.32 L
221.486 452.324 L
241.082 442.552 L
246.225 457.548 LE
241.082 442.552 LS
221.486 452.324 L
216.834 437.028 L
236.43 427.256 L
241.082 442.552 LE
236.43 427.256 LS
216.834 437.028 L
212.723 421.478 L
232.32 411.706 L
236.43 427.256 LE
232.32 411.706 LS
212.723 421.478 L
209.196 405.733 L
228.792 395.96 L
232.32 411.706 LE
228.792 395.96 LS
209.196 405.733 L
206.284 389.855 L
225.88 380.082 L
228.792 395.96 LE
225.88 380.082 LS
206.284 389.855 L
204.012 373.915 L
223.608 364.143 L
225.88 380.082 LE
223.608 364.143 LS
204.012 373.915 L
202.395 357.991 L
221.991 348.218 L
223.608 364.143 LE
221.991 348.218 LS
202.395 357.991 L
201.436 342.159 L
221.032 332.387 L
221.991 348.218 LE
221.032 332.387 LS
201.436 342.159 L
201.12 326.5 L
220.716 316.728 L
221.032 332.387 LE
220.716 316.728 LS
201.12 326.5 L
201.436 310.841 L
221.032 301.068 L
220.716 316.728 LE
221.032 301.068 LS
201.436 310.841 L
202.395 295.009 L
221.991 285.237 L
221.032 301.068 LE
221.991 285.237 LS
202.395 295.009 L
204.012 279.085 L
223.608 269.313 L
221.991 285.237 LE
223.608 269.313 LS
204.012 279.085 L
206.284 263.145 L
225.88 253.373 L
223.608 269.313 LE
225.88 253.373 LS
206.284 263.145 L
209.196 247.267 L
228.792 237.495 L
225.88 253.373 LE
228.792 237.495 LS
209.196 247.267 L
212.723 231.522 L
232.32 221.749 L
228.792 237.495 LE
232.32 221.749 LS
212.723 231.522 L
216.834 215.972 L
236.43 206.2 L
232.32 221.749 LE
236.43 206.2 LS
216.834 215.972 L
221.486 200.676 L
241.082 190.903 L
236.43 206.2 LE
241.082 190.903 LS
221.486 200.676 L
226.629 185.68 L
246.225 175.908 L
241.082 190.903 LE
246.225 175.908 LS
226.629 185.68 L
232.215 171.024 L
251.812 161.252 L
246.225 175.908 LE
271.759 462.417 LS
251.812 472.204 L
246.225 457.548 L
266.173 447.761 L
271.759 462.417 LE
266.173 447.761 LS
246.225 457.548 L
241.082 442.552 L
261.028 432.765 L
266.173 447.761 LE
261.028 432.765 LS
241.082 442.552 L
236.43 427.256 L
256.378 417.469 L
261.028 432.765 LE
256.378 417.469 LS
236.43 427.256 L
232.32 411.706 L
252.267 401.919 L
256.378 417.469 LE
252.267 401.919 LS
232.32 411.706 L
228.792 395.96 L
248.739 386.173 L
252.267 401.919 LE
248.739 386.173 LS
228.792 395.96 L
225.88 380.082 L
245.826 370.295 L
248.739 386.173 LE
245.826 370.295 LS
225.88 380.082 L
223.608 364.143 L
243.556 354.356 L
245.826 370.295 LE
243.556 354.356 LS
223.608 364.143 L
221.991 348.218 L
241.939 338.431 L
243.556 354.356 LE
241.939 338.431 LS
221.991 348.218 L
221.032 332.387 L
240.978 322.6 L
241.939 338.431 LE
240.978 322.6 LS
221.032 332.387 L
220.716 316.728 L
240.664 306.941 L
240.978 322.6 LE
240.664 306.941 LS
220.716 316.728 L
221.032 301.068 L
240.978 291.281 L
240.664 306.941 LE
240.978 291.281 LS
221.032 301.068 L
221.991 285.237 L
241.939 275.45 L
240.978 291.281 LE
241.939 275.45 LS
221.991 285.237 L
223.608 269.313 L
243.556 259.526 L
241.939 275.45 LE
243.556 259.526 LS
223.608 269.313 L
225.88 253.373 L
245.826 243.586 L
243.556 259.526 LE
245.826 243.586 LS
225.88 253.373 L
228.792 237.495 L
248.739 227.708 L
245.826 243.586 LE
248.739 227.708 LS
228.792 237.495 L
232.32 221.749 L
252.267 211.962 L
248.739 227.708 LE
252.267 211.962 LS
232.32 221.749 L
236.43 206.2 L
256.378 196.413 L
252.267 211.962 LE
256.378 196.413 LS
236.43 206.2 L
241.082 190.903 L
261.028 181.116 L
256.378 196.413 LE
261.028 181.116 LS
241.082 190.903 L
246.225 175.908 L
266.173 166.12 L
261.028 181.116 LE
266.173 166.12 LS
246.225 175.908 L
251.812 161.252 L
271.759 151.465 L
266.173 166.12 LE
292.408 452.626 LS
271.759 462.417 L
266.173 447.761 L
286.822 437.97 L
292.408 452.626 LE
286.822 437.97 LS
266.173 447.761 L
261.028 432.765 L
281.679 422.974 L
286.822 437.97 LE
281.679 422.974 LS
261.028 432.765 L
256.378 417.469 L
277.027 407.678 L
281.679 422.974 LE
277.027 407.678 LS
256.378 417.469 L
252.267 401.919 L
272.916 392.128 L
277.027 407.678 LE
272.916 392.128 LS
252.267 401.919 L
248.739 386.173 L
269.388 376.382 L
272.916 392.128 LE
269.388 376.382 LS
248.739 386.173 L
245.826 370.295 L
266.476 360.504 L
269.388 376.382 LE
266.476 360.504 LS
245.826 370.295 L
243.556 354.356 L
264.205 344.565 L
266.476 360.504 LE
264.205 344.565 LS
243.556 354.356 L
241.939 338.431 L
262.588 328.641 L
264.205 344.565 LE
262.588 328.641 LS
241.939 338.431 L
240.978 322.6 L
261.628 312.809 L
262.588 328.641 LE
261.628 312.809 LS
240.978 322.6 L
240.664 306.941 L
261.313 297.15 L
261.628 312.809 LE
261.313 297.15 LS
240.664 306.941 L
240.978 291.281 L
261.628 281.491 L
261.313 297.15 LE
261.628 281.491 LS
240.978 291.281 L
241.939 275.45 L
262.588 265.659 L
261.628 281.491 LE
262.588 265.659 LS
241.939 275.45 L
243.556 259.526 L
264.205 249.735 L
262.588 265.659 LE
264.205 249.735 LS
243.556 259.526 L
245.826 243.586 L
266.476 233.795 L
264.205 249.735 LE
266.476 233.795 LS
245.826 243.586 L
248.739 227.708 L
269.388 217.917 L
266.476 233.795 LE
269.388 217.917 LS
248.739 227.708 L
252.267 211.962 L
272.916 202.172 L
269.388 217.917 LE
272.916 202.172 LS
252.267 211.962 L
256.378 196.413 L
277.027 186.622 L
272.916 202.172 LE
277.027 186.622 LS
256.378 196.413 L
261.028 181.116 L
281.679 171.326 L
277.027 186.622 LE
281.679 171.326 LS
261.028 181.116 L
266.173 166.12 L
286.822 156.33 L
281.679 171.326 LE
286.822 156.33 LS
266.173 166.12 L
271.759 151.465 L
292.408 141.673 L
286.822 156.33 LE
314.102 442.9 LS
292.408 452.626 L
286.822 437.97 L
308.515 428.243 L
314.102 442.9 LE
308.515 428.243 LS
286.822 437.97 L
281.679 422.974 L
303.372 413.248 L
308.515 428.243 LE
303.372 413.248 LS
281.679 422.974 L
277.027 407.678 L
298.722 397.951 L
303.372 413.248 LE
298.722 397.951 LS
277.027 407.678 L
272.916 392.128 L
294.611 382.402 L
298.722 397.951 LE
294.611 382.402 LS
272.916 392.128 L
269.388 376.382 L
291.082 366.656 L
294.611 382.402 LE
291.082 366.656 LS
269.388 376.382 L
266.476 360.504 L
288.17 350.778 L
291.082 366.656 LE
288.17 350.778 LS
266.476 360.504 L
264.205 344.565 L
285.898 334.839 L
288.17 350.778 LE
285.898 334.839 LS
264.205 344.565 L
262.588 328.641 L
284.283 318.914 L
285.898 334.839 LE
284.283 318.914 LS
262.588 328.641 L
261.628 312.809 L
283.322 303.083 L
284.283 318.914 LE
283.322 303.083 LS
261.628 312.809 L
261.313 297.15 L
283.006 287.423 L
283.322 303.083 LE
283.006 287.423 LS
261.313 297.15 L
261.628 281.491 L
283.322 271.764 L
283.006 287.423 LE
283.322 271.764 LS
261.628 281.491 L
262.588 265.659 L
284.283 255.933 L
283.322 271.764 LE
284.283 255.933 LS
262.588 265.659 L
264.205 249.735 L
285.898 240.008 L
284.283 255.933 LE
285.898 240.008 LS
264.205 249.735 L
266.476 233.795 L
288.17 224.069 L
285.898 240.008 LE
288.17 224.069 LS
266.476 233.795 L
269.388 217.917 L
291.082 208.191 L
288.17 224.069 LE
291.082 208.191 LS
269.388 217.917 L
272.916 202.172 L
294.611 192.445 L
291.082 208.191 LE
294.611 192.445 LS
272.916 202.172 L
277.027 186.622 L
298.722 176.896 L
294.611 192.445 LE
298.722 176.896 LS
277.027 186.622 L
281.679 171.326 L
303.372 161.599 L
298.722 176.896 LE
303.372 161.599 LS
281.679 171.326 L
286.822 156.33 L
308.515 146.603 L
303.372 161.599 LE
308.515 146.603 LS
286.822 156.33 L
292.408 141.673 L
314.102 131.946 L
308.515 146.603 LE
337.162 433.398 LS
314.102 442.9 L
308.515 428.243 L
331.576 418.742 L
337.162 433.398 LE
331.576 418.742 LS
308.515 428.243 L
303.372 413.248 L
326.431 403.746 L
331.576 418.742 LE
326.431 403.746 LS
303.372 413.248 L
298.722 397.951 L
321.781 388.45 L
326.431 403.746 LE
321.781 388.45 LS
298.722 397.951 L
294.611 382.402 L
317.67 372.9 L
321.781 388.45 LE
317.67 372.9 LS
294.611 382.402 L
291.082 366.656 L
314.142 357.154 L
317.67 372.9 LE
314.142 357.154 LS
291.082 366.656 L
288.17 350.778 L
311.228 341.276 L
314.142 357.154 LE
311.228 341.276 LS
288.17 350.778 L
285.898 334.839 L
308.958 325.337 L
311.228 341.276 LE
308.958 325.337 LS
285.898 334.839 L
284.283 318.914 L
307.341 309.413 L
308.958 325.337 LE
307.341 309.413 LS
284.283 318.914 L
283.322 303.083 L
306.381 293.581 L
307.341 309.413 LE
306.381 293.581 LS
283.322 303.083 L
283.006 287.423 L
306.067 277.922 L
306.381 293.581 LE
306.067 277.922 LS
283.006 287.423 L
283.322 271.764 L
306.381 262.262 L
306.067 277.922 LE
306.381 262.262 LS
283.322 271.764 L
284.283 255.933 L
307.341 246.431 L
306.381 262.262 LE
307.341 246.431 LS
284.283 255.933 L
285.898 240.008 L
308.958 230.507 L
307.341 246.431 LE
308.958 230.507 LS
285.898 240.008 L
288.17 224.069 L
311.228 214.567 L
308.958 230.507 LE
311.228 214.567 LS
288.17 224.069 L
291.082 208.191 L
314.142 198.689 L
311.228 214.567 LE
314.142 198.689 LS
291.082 208.191 L
294.611 192.445 L
317.67 182.943 L
314.142 198.689 LE
317.67 182.943 LS
294.611 192.445 L
298.722 176.896 L
321.781 167.393 L
317.67 182.943 LE
321.781 167.393 LS
298.722 176.896 L
303.372 161.599 L
326.431 152.098 L
321.781 167.393 LE
326.431 152.098 LS
303.372 161.599 L
308.515 146.603 L
331.576 137.102 L
326.431 152.098 LE
331.576 137.102 LS
308.515 146.603 L
314.102 131.946 L
337.162 122.445 L
331.576 137.102 LE
361.845 424.414 LS
337.162 433.398 L
331.576 418.742 L
356.259 409.758 L
361.845 424.414 LE
356.259 409.758 LS
331.576 418.742 L
326.431 403.746 L
351.114 394.762 L
356.259 409.758 LE
351.114 394.762 LS
326.431 403.746 L
321.781 388.45 L
346.464 379.466 L
351.114 394.762 LE
346.464 379.466 LS
321.781 388.45 L
317.67 372.9 L
342.353 363.916 L
346.464 379.466 LE
342.353 363.916 LS
317.67 372.9 L
314.142 357.154 L
338.825 348.17 L
342.353 363.916 LE
338.825 348.17 LS
314.142 357.154 L
311.228 341.276 L
335.913 332.292 L
338.825 348.17 LE
335.913 332.292 LS
311.228 341.276 L
308.958 325.337 L
333.642 316.353 L
335.913 332.292 LE
333.642 316.353 LS
308.958 325.337 L
307.341 309.413 L
332.025 300.428 L
333.642 316.353 LE
332.025 300.428 LS
307.341 309.413 L
306.381 293.581 L
331.066 284.597 L
332.025 300.428 LE
331.066 284.597 LS
306.381 293.581 L
306.067 277.922 L
330.75 268.938 L
331.066 284.597 LE
330.75 268.938 LS
306.067 277.922 L
306.381 262.262 L
331.066 253.278 L
330.75 268.938 LE
331.066 253.278 LS
306.381 262.262 L
307.341 246.431 L
332.025 237.447 L
331.066 253.278 LE
332.025 237.447 LS
307.341 246.431 L
308.958 230.507 L
333.642 221.523 L
332.025 237.447 LE
333.642 221.523 LS
308.958 230.507 L
311.228 214.567 L
335.913 205.583 L
333.642 221.523 LE
335.913 205.583 LS
311.228 214.567 L
314.142 198.689 L
338.825 189.705 L
335.913 205.583 LE
338.825 189.705 LS
314.142 198.689 L
317.67 182.943 L
342.353 173.959 L
338.825 189.705 LE
342.353 173.959 LS
317.67 182.943 L
321.781 167.393 L
346.464 158.41 L
342.353 173.959 LE
346.464 158.41 LS
321.781 167.393 L
326.431 152.098 L
351.114 143.113 L
346.464 158.41 LE
351.114 143.113 LS
326.431 152.098 L
331.576 137.102 L
356.259 128.117 L
351.114 143.113 LE
356.259 128.117 LS
331.576 137.102 L
337.162 122.445 L
361.845 113.462 L
356.259 128.117 LE
388.296 416.399 LS
361.845 424.414 L
356.259 409.758 L
382.71 401.743 L
388.296 416.399 LE
382.71 401.743 LS
356.259 409.758 L
351.114 394.762 L
377.567 386.747 L
382.71 401.743 LE
377.567 386.747 LS
351.114 394.762 L
346.464 379.466 L
372.917 371.451 L
377.567 386.747 LE
372.917 371.451 LS
346.464 379.466 L
342.353 363.916 L
368.806 355.901 L
372.917 371.451 LE
368.806 355.901 LS
342.353 363.916 L
338.825 348.17 L
365.277 340.155 L
368.806 355.901 LE
365.277 340.155 LS
338.825 348.17 L
335.913 332.292 L
362.365 324.277 L
365.277 340.155 LE
362.365 324.277 LS
335.913 332.292 L
333.642 316.353 L
360.093 308.338 L
362.365 324.277 LE
360.093 308.338 LS
333.642 316.353 L
332.025 300.428 L
358.478 292.413 L
360.093 308.338 LE
358.478 292.413 LS
332.025 300.428 L
331.066 284.597 L
357.517 276.582 L
358.478 292.413 LE
357.517 276.582 LS
331.066 284.597 L
330.75 268.938 L
357.201 260.923 L
357.517 276.582 LE
357.201 260.923 LS
330.75 268.938 L
331.066 253.278 L
357.517 245.263 L
357.201 260.923 LE
357.517 245.263 LS
331.066 253.278 L
332.025 237.447 L
358.478 229.432 L
357.517 245.263 LE
358.478 229.432 LS
332.025 237.447 L
333.642 221.523 L
360.093 213.507 L
358.478 229.432 LE
360.093 213.507 LS
333.642 221.523 L
335.913 205.583 L
362.365 197.568 L
360.093 213.507 LE
362.365 197.568 LS
335.913 205.583 L
338.825 189.705 L
365.277 181.69 L
362.365 197.568 LE
365.277 181.69 LS
338.825 189.705 L
342.353 173.959 L
368.806 165.944 L
365.277 181.69 LE
368.806 165.944 LS
342.353 173.959 L
346.464 158.41 L
372.917 150.395 L
368.806 165.944 LE
372.917 150.395 LS
346.464 158.41 L
351.114 143.113 L
377.567 135.098 L
372.917 150.395 LE
377.567 135.098 LS
351.114 143.113 L
356.259 128.117 L
382.71 120.102 L
377.567 135.098 LE
382.71 120.102 LS
356.259 128.117 L
361.845 113.462 L
388.296 105.447 L
382.71 120.102 LE
416.47 409.949 LS
388.296 416.399 L
382.71 401.743 L
410.884 395.293 L
416.47 409.949 LE
410.884 395.293 LS
382.71 401.743 L
377.567 386.747 L
405.739 380.297 L
410.884 395.293 LE
405.739 380.297 LS
377.567 386.747 L
372.917 371.451 L
401.089 365.001 L
405.739 380.297 LE
401.089 365.001 LS
372.917 371.451 L
368.806 355.901 L
396.978 349.451 L
401.089 365.001 LE
396.978 349.451 LS
368.806 355.901 L
365.277 340.155 L
393.45 333.705 L
396.978 349.451 LE
393.45 333.705 LS
365.277 340.155 L
362.365 324.277 L
390.537 317.827 L
393.45 333.705 LE
390.537 317.827 LS
362.365 324.277 L
360.093 308.338 L
388.267 301.888 L
390.537 317.827 LE
388.267 301.888 LS
360.093 308.338 L
358.478 292.413 L
386.65 285.964 L
388.267 301.888 LE
386.65 285.964 LS
358.478 292.413 L
357.517 276.582 L
385.689 270.132 L
386.65 285.964 LE
385.689 270.132 LS
357.517 276.582 L
357.201 260.923 L
385.375 254.473 L
385.689 270.132 LE
385.375 254.473 LS
357.201 260.923 L
357.517 245.263 L
385.689 238.813 L
385.375 254.473 LE
385.689 238.813 LS
357.517 245.263 L
358.478 229.432 L
386.65 222.982 L
385.689 238.813 LE
386.65 222.982 LS
358.478 229.432 L
360.093 213.507 L
388.267 207.058 L
386.65 222.982 LE
388.267 207.058 LS
360.093 213.507 L
362.365 197.568 L
390.537 191.118 L
388.267 207.058 LE
390.537 191.118 LS
362.365 197.568 L
365.277 181.69 L
393.45 175.24 L
390.537 191.118 LE
393.45 175.24 LS
365.277 181.69 L
368.806 165.944 L
396.978 159.494 L
393.45 175.24 LE
396.978 159.494 LS
368.806 165.944 L
372.917 150.395 L
401.089 143.945 L
396.978 159.494 LE
401.089 143.945 LS
372.917 150.395 L
377.567 135.098 L
405.739 128.649 L
401.089 143.945 LE
405.739 128.649 LS
377.567 135.098 L
382.71 120.102 L
410.884 113.653 L
405.739 128.649 LE
410.884 113.653 LS
382.71 120.102 L
388.296 105.447 L
416.47 98.9963 L
410.884 113.653 LE
446.051 405.718 LS
416.47 409.949 L
410.884 395.293 L
440.465 391.062 L
446.051 405.718 LE
440.465 391.062 LS
410.884 395.293 L
405.739 380.297 L
435.32 376.066 L
440.465 391.062 LE
435.32 376.066 LS
405.739 380.297 L
401.089 365.001 L
430.67 360.77 L
435.32 376.066 LE
430.67 360.77 LS
401.089 365.001 L
396.978 349.451 L
426.559 345.22 L
430.67 360.77 LE
426.559 345.22 LS
396.978 349.451 L
393.45 333.705 L
423.031 329.474 L
426.559 345.22 LE
423.031 329.474 LS
393.45 333.705 L
390.537 317.827 L
420.119 313.596 L
423.031 329.474 LE
420.119 313.596 LS
390.537 317.827 L
388.267 301.888 L
417.848 297.657 L
420.119 313.596 LE
417.848 297.657 LS
388.267 301.888 L
386.65 285.964 L
416.231 281.732 L
417.848 297.657 LE
416.231 281.732 LS
386.65 285.964 L
385.689 270.132 L
415.272 265.901 L
416.231 281.732 LE
415.272 265.901 LS
385.689 270.132 L
385.375 254.473 L
414.956 250.242 L
415.272 265.901 LE
414.956 250.242 LS
385.375 254.473 L
385.689 238.813 L
415.272 234.582 L
414.956 250.242 LE
415.272 234.582 LS
385.689 238.813 L
386.65 222.982 L
416.231 218.751 L
415.272 234.582 LE
416.231 218.751 LS
386.65 222.982 L
388.267 207.058 L
417.848 202.827 L
416.231 218.751 LE
417.848 202.827 LS
388.267 207.058 L
390.537 191.118 L
420.119 186.887 L
417.848 202.827 LE
420.119 186.887 LS
390.537 191.118 L
393.45 175.24 L
423.031 171.01 L
420.119 186.887 LE
423.031 171.01 LS
393.45 175.24 L
396.978 159.494 L
426.559 155.263 L
423.031 171.01 LE
426.559 155.263 LS
396.978 159.494 L
401.089 143.945 L
430.67 139.714 L
426.559 155.263 LE
430.67 139.714 LS
401.089 143.945 L
405.739 128.649 L
435.32 124.417 L
430.67 139.714 LE
435.32 124.417 LS
405.739 128.649 L
410.884 113.653 L
440.465 109.421 L
435.32 124.417 LE
440.465 109.421 LS
410.884 113.653 L
416.47 98.9963 L
446.051 94.7659 L
440.465 109.421 LE
476.436 404.238 LS
446.051 405.718 L
440.465 391.062 L
470.85 389.582 L
476.436 404.238 LE
470.85 389.582 LS
440.465 391.062 L
435.32 376.066 L
465.706 374.586 L
470.85 389.582 LE
465.706 374.586 LS
435.32 376.066 L
430.67 360.77 L
461.056 359.29 L
465.706 374.586 LE
461.056 359.29 LS
430.67 360.77 L
426.559 345.22 L
456.945 343.74 L
461.056 359.29 LE
456.945 343.74 LS
426.559 345.22 L
423.031 329.474 L
453.416 327.994 L
456.945 343.74 LE
453.416 327.994 LS
423.031 329.474 L
420.119 313.596 L
450.504 312.116 L
453.416 327.994 LE
450.504 312.116 LS
420.119 313.596 L
417.848 297.657 L
448.232 296.177 L
450.504 312.116 LE
448.232 296.177 LS
417.848 297.657 L
416.231 281.732 L
446.617 280.253 L
448.232 296.177 LE
446.617 280.253 LS
416.231 281.732 L
415.272 265.901 L
445.656 264.421 L
446.617 280.253 LE
445.656 264.421 LS
415.272 265.901 L
414.956 250.242 L
445.341 248.762 L
445.656 264.421 LE
445.341 248.762 LS
414.956 250.242 L
415.272 234.582 L
445.656 233.103 L
445.341 248.762 LE
445.656 233.103 LS
415.272 234.582 L
416.231 218.751 L
446.617 217.271 L
445.656 233.103 LE
446.617 217.271 LS
416.231 218.751 L
417.848 202.827 L
448.232 201.347 L
446.617 217.271 LE
448.232 201.347 LS
417.848 202.827 L
420.119 186.887 L
450.504 185.407 L
448.232 201.347 LE
450.504 185.407 LS
420.119 186.887 L
423.031 171.01 L
453.416 169.53 L
450.504 185.407 LE
453.416 169.53 LS
423.031 171.01 L
426.559 155.263 L
456.945 153.783 L
453.416 169.53 LE
456.945 153.783 LS
426.559 155.263 L
430.67 139.714 L
461.056 138.234 L
456.945 153.783 LE
461.056 138.234 LS
430.67 139.714 L
435.32 124.417 L
465.706 122.938 L
461.056 138.234 LE
465.706 122.938 LS
435.32 124.417 L
440.465 109.421 L
470.85 107.942 L
465.706 122.938 LE
470.85 107.942 LS
440.465 109.421 L
446.051 94.7659 L
476.436 93.2857 L
470.85 107.942 LE
506.822 405.718 LS
476.436 404.238 L
470.85 389.582 L
501.236 391.062 L
506.822 405.718 LE
501.236 391.062 LS
470.85 389.582 L
465.706 374.586 L
496.093 376.066 L
501.236 391.062 LE
496.093 376.066 LS
465.706 374.586 L
461.056 359.29 L
491.442 360.77 L
496.093 376.066 LE
491.442 360.77 LS
461.056 359.29 L
456.945 343.74 L
487.332 345.22 L
491.442 360.77 LE
487.332 345.22 LS
456.945 343.74 L
453.416 327.994 L
483.802 329.474 L
487.332 345.22 LE
483.802 329.474 LS
453.416 327.994 L
450.504 312.116 L
480.89 313.596 L
483.802 329.474 LE
480.89 313.596 LS
450.504 312.116 L
448.232 296.177 L
478.619 297.657 L
480.89 313.596 LE
478.619 297.657 LS
448.232 296.177 L
446.617 280.253 L
477.003 281.732 L
478.619 297.657 LE
477.003 281.732 LS
446.617 280.253 L
445.656 264.421 L
476.042 265.901 L
477.003 281.732 LE
476.042 265.901 LS
445.656 264.421 L
445.341 248.762 L
475.727 250.242 L
476.042 265.901 LE
475.727 250.242 LS
445.341 248.762 L
445.656 233.103 L
476.042 234.582 L
475.727 250.242 LE
476.042 234.582 LS
445.656 233.103 L
446.617 217.271 L
477.003 218.751 L
476.042 234.582 LE
477.003 218.751 LS
446.617 217.271 L
448.232 201.347 L
478.619 202.827 L
477.003 218.751 LE
478.619 202.827 LS
448.232 201.347 L
450.504 185.407 L
480.89 186.887 L
478.619 202.827 LE
480.89 186.887 LS
450.504 185.407 L
453.416 169.53 L
483.802 171.01 L
480.89 186.887 LE
483.802 171.01 LS
453.416 169.53 L
456.945 153.783 L
487.332 155.263 L
483.802 171.01 LE
487.332 155.263 LS
456.945 153.783 L
461.056 138.234 L
491.442 139.714 L
487.332 155.263 LE
491.442 139.714 LS
461.056 138.234 L
465.706 122.938 L
496.093 124.417 L
491.442 139.714 LE
496.093 124.417 LS
465.706 122.938 L
470.85 107.942 L
501.236 109.421 L
496.093 124.417 LE
501.236 109.421 LS
470.85 107.942 L
476.436 93.2857 L
506.822 94.7659 L
501.236 109.421 LE
536.403 409.949 LS
506.822 405.718 L
501.236 391.062 L
530.817 395.293 L
536.403 409.949 LE
530.817 395.293 LS
501.236 391.062 L
496.093 376.066 L
525.674 380.297 L
530.817 395.293 LE
525.674 380.297 LS
496.093 376.066 L
491.442 360.77 L
521.023 365.001 L
525.674 380.297 LE
521.023 365.001 LS
491.442 360.77 L
487.332 345.22 L
516.913 349.451 L
521.023 365.001 LE
516.913 349.451 LS
487.332 345.22 L
483.802 329.474 L
513.383 333.705 L
516.913 349.451 LE
513.383 333.705 LS
483.802 329.474 L
480.89 313.596 L
510.471 317.827 L
513.383 333.705 LE
510.471 317.827 LS
480.89 313.596 L
478.619 297.657 L
508.2 301.888 L
510.471 317.827 LE
508.2 301.888 LS
478.619 297.657 L
477.003 281.732 L
506.584 285.964 L
508.2 301.888 LE
506.584 285.964 LS
477.003 281.732 L
476.042 265.901 L
505.623 270.132 L
506.584 285.964 LE
505.623 270.132 LS
476.042 265.901 L
475.727 250.242 L
505.308 254.473 L
505.623 270.132 LE
505.308 254.473 LS
475.727 250.242 L
476.042 234.582 L
505.623 238.813 L
505.308 254.473 LE
505.623 238.813 LS
476.042 234.582 L
477.003 218.751 L
506.584 222.982 L
505.623 238.813 LE
506.584 222.982 LS
477.003 218.751 L
478.619 202.827 L
508.2 207.058 L
506.584 222.982 LE
508.2 207.058 LS
478.619 202.827 L
480.89 186.887 L
510.471 191.118 L
508.2 207.058 LE
510.471 191.118 LS
480.89 186.887 L
483.802 171.01 L
513.383 175.24 L
510.471 191.118 LE
513.383 175.24 LS
483.802 171.01 L
487.332 155.263 L
516.913 159.494 L
513.383 175.24 LE
516.913 159.494 LS
487.332 155.263 L
491.442 139.714 L
521.023 143.945 L
516.913 159.494 LE
521.023 143.945 LS
491.442 139.714 L
496.093 124.417 L
525.674 128.649 L
521.023 143.945 LE
525.674 128.649 LS
496.093 124.417 L
501.236 109.421 L
530.817 113.653 L
525.674 128.649 LE
530.817 113.653 LS
501.236 109.421 L
506.822 94.7659 L
536.403 98.9963 L
530.817 113.653 LE
564.576 416.399 LS
536.403 409.949 L
530.817 395.293 L
558.99 401.743 L
564.576 416.399 LE
558.99 401.743 LS
530.817 395.293 L
525.674 380.297 L
553.847 386.747 L
558.99 401.743 LE
553.847 386.747 LS
525.674 380.297 L
521.023 365.001 L
549.196 371.451 L
553.847 386.747 LE
549.196 371.451 LS
521.023 365.001 L
516.913 349.451 L
545.085 355.901 L
549.196 371.451 LE
545.085 355.901 LS
516.913 349.451 L
513.383 333.705 L
541.557 340.155 L
545.085 355.901 LE
541.557 340.155 LS
513.383 333.705 L
510.471 317.827 L
538.644 324.277 L
541.557 340.155 LE
538.644 324.277 LS
510.471 317.827 L
508.2 301.888 L
536.373 308.338 L
538.644 324.277 LE
536.373 308.338 LS
508.2 301.888 L
506.584 285.964 L
534.757 292.413 L
536.373 308.338 LE
534.757 292.413 LS
506.584 285.964 L
505.623 270.132 L
533.797 276.582 L
534.757 292.413 LE
533.797 276.582 LS
505.623 270.132 L
505.308 254.473 L
533.482 260.923 L
533.797 276.582 LE
533.482 260.923 LS
505.308 254.473 L
505.623 238.813 L
533.797 245.263 L
533.482 260.923 LE
533.797 245.263 LS
505.623 238.813 L
506.584 222.982 L
534.757 229.432 L
533.797 245.263 LE
534.757 229.432 LS
506.584 222.982 L
508.2 207.058 L
536.373 213.507 L
534.757 229.432 LE
536.373 213.507 LS
508.2 207.058 L
510.471 191.118 L
538.644 197.568 L
536.373 213.507 LE
538.644 197.568 LS
510.471 191.118 L
513.383 175.24 L
541.557 181.69 L
538.644 197.568 LE
541.557 181.69 LS
513.383 175.24 L
516.913 159.494 L
545.085 165.944 L
541.557 181.69 LE
545.085 165.944 LS
516.913 159.494 L
521.023 143.945 L
549.196 150.395 L
545.085 165.944 LE
549.196 150.395 LS
521.023 143.945 L
525.674 128.649 L
553.847 135.098 L
549.196 150.395 LE
553.847 135.098 LS
525.674 128.649 L
530.817 113.653 L
558.99 120.102 L
553.847 135.098 LE
558.99 120.102 LS
530.817 113.653 L
536.403 98.9963 L
564.576 105.447 L
558.99 120.102 LE
591.028 424.414 LS
564.576 416.399 L
558.99 401.743 L
585.442 409.758 L
591.028 424.414 LE
585.442 409.758 LS
558.99 401.743 L
553.847 386.747 L
580.298 394.762 L
585.442 409.758 LE
580.298 394.762 LS
553.847 386.747 L
549.196 371.451 L
575.648 379.466 L
580.298 394.762 LE
575.648 379.466 LS
549.196 371.451 L
545.085 355.901 L
571.537 363.916 L
575.648 379.466 LE
571.537 363.916 LS
545.085 355.901 L
541.557 340.155 L
568.009 348.17 L
571.537 363.916 LE
568.009 348.17 LS
541.557 340.155 L
538.644 324.277 L
565.096 332.292 L
568.009 348.17 LE
565.096 332.292 LS
538.644 324.277 L
536.373 308.338 L
562.825 316.353 L
565.096 332.292 LE
562.825 316.353 LS
536.373 308.338 L
534.757 292.413 L
561.209 300.428 L
562.825 316.353 LE
561.209 300.428 LS
534.757 292.413 L
533.797 276.582 L
560.248 284.597 L
561.209 300.428 LE
560.248 284.597 LS
533.797 276.582 L
533.482 260.923 L
559.933 268.938 L
560.248 284.597 LE
559.933 268.938 LS
533.482 260.923 L
533.797 245.263 L
560.248 253.278 L
559.933 268.938 LE
560.248 253.278 LS
533.797 245.263 L
534.757 229.432 L
561.209 237.447 L
560.248 253.278 LE
561.209 237.447 LS
534.757 229.432 L
536.373 213.507 L
562.825 221.523 L
561.209 237.447 LE
562.825 221.523 LS
536.373 213.507 L
538.644 197.568 L
565.096 205.583 L
562.825 221.523 LE
565.096 205.583 LS
538.644 197.568 L
541.557 181.69 L
568.009 189.705 L
565.096 205.583 LE
568.009 189.705 LS
541.557 181.69 L
545.085 165.944 L
571.537 173.959 L
568.009 189.705 LE
571.537 173.959 LS
545.085 165.944 L
549.196 150.395 L
575.648 158.41 L
571.537 173.959 LE
575.648 158.41 LS
549.196 150.395 L
553.847 135.098 L
580.298 143.113 L
575.648 158.41 LE
580.298 143.113 LS
553.847 135.098 L
558.99 120.102 L
585.442 128.117 L
580.298 143.113 LE
585.442 128.117 LS
558.99 120.102 L
564.576 105.447 L
591.028 113.462 L
585.442 128.117 LE
615.712 433.398 LS
591.028 424.414 L
585.442 409.758 L
610.125 418.742 L
615.712 433.398 LE
610.125 418.742 LS
585.442 409.758 L
580.298 394.762 L
604.982 403.746 L
610.125 418.742 LE
604.982 403.746 LS
580.298 394.762 L
575.648 379.466 L
600.331 388.45 L
604.982 403.746 LE
600.331 388.45 LS
575.648 379.466 L
571.537 363.916 L
596.221 372.9 L
600.331 388.45 LE
596.221 372.9 LS
571.537 363.916 L
568.009 348.17 L
592.692 357.154 L
596.221 372.9 LE
592.692 357.154 LS
568.009 348.17 L
565.096 332.292 L
589.78 341.276 L
592.692 357.154 LE
589.78 341.276 LS
565.096 332.292 L
562.825 316.353 L
587.508 325.337 L
589.78 341.276 LE
587.508 325.337 LS
562.825 316.353 L
561.209 300.428 L
585.892 309.413 L
587.508 325.337 LE
585.892 309.413 LS
561.209 300.428 L
560.248 284.597 L
584.932 293.581 L
585.892 309.413 LE
584.932 293.581 LS
560.248 284.597 L
559.933 268.938 L
584.616 277.922 L
584.932 293.581 LE
584.616 277.922 LS
559.933 268.938 L
560.248 253.278 L
584.932 262.262 L
584.616 277.922 LE
584.932 262.262 LS
560.248 253.278 L
561.209 237.447 L
585.892 246.431 L
584.932 262.262 LE
585.892 246.431 LS
561.209 237.447 L
562.825 221.523 L
587.508 230.507 L
585.892 246.431 LE
587.508 230.507 LS
562.825 221.523 L
565.096 205.583 L
589.78 214.567 L
587.508 230.507 LE
589.78 214.567 LS
565.096 205.583 L
568.009 189.705 L
592.692 198.689 L
589.78 214.567 LE
592.692 198.689 LS
568.009 189.705 L
571.537 173.959 L
596.221 182.943 L
592.692 198.689 LE
596.221 182.943 LS
571.537 173.959 L
575.648 158.41 L
600.331 167.393 L
596.221 182.943 LE
600.331 167.393 LS
575.648 158.41 L
580.298 143.113 L
604.982 152.098 L
600.331 167.393 LE
604.982 152.098 LS
580.298 143.113 L
585.442 128.117 L
610.125 137.102 L
604.982 152.098 LE
610.125 137.102 LS
585.442 128.117 L
591.028 113.462 L
615.712 122.445 L
610.125 137.102 LE
638.771 442.9 LS
615.712 433.398 L
610.125 418.742 L
633.185 428.243 L
638.771 442.9 LE
633.185 428.243 LS
610.125 418.742 L
604.982 403.746 L
628.041 413.248 L
633.185 428.243 LE
628.041 413.248 LS
604.982 403.746 L
600.331 388.45 L
623.39 397.951 L
628.041 413.248 LE
623.39 397.951 LS
600.331 388.45 L
596.221 372.9 L
619.28 382.402 L
623.39 397.951 LE
619.28 382.402 LS
596.221 372.9 L
592.692 357.154 L
615.751 366.656 L
619.28 382.402 LE
615.751 366.656 LS
592.692 357.154 L
589.78 341.276 L
612.839 350.778 L
615.751 366.656 LE
612.839 350.778 LS
589.78 341.276 L
587.508 325.337 L
610.568 334.839 L
612.839 350.778 LE
610.568 334.839 LS
587.508 325.337 L
585.892 309.413 L
608.951 318.914 L
610.568 334.839 LE
608.951 318.914 LS
585.892 309.413 L
584.932 293.581 L
607.991 303.083 L
608.951 318.914 LE
607.991 303.083 LS
584.932 293.581 L
584.616 277.922 L
607.675 287.423 L
607.991 303.083 LE
607.675 287.423 LS
584.616 277.922 L
584.932 262.262 L
607.991 271.764 L
607.675 287.423 LE
607.991 271.764 LS
584.932 262.262 L
585.892 246.431 L
608.951 255.933 L
607.991 271.764 LE
608.951 255.933 LS
585.892 246.431 L
587.508 230.507 L
610.568 240.008 L
608.951 255.933 LE
610.568 240.008 LS
587.508 230.507 L
589.78 214.567 L
612.839 224.069 L
610.568 240.008 LE
612.839 224.069 LS
589.78 214.567 L
592.692 198.689 L
615.751 208.191 L
612.839 224.069 LE
615.751 208.191 LS
592.692 198.689 L
596.221 182.943 L
619.28 192.445 L
615.751 208.191 LE
619.28 192.445 LS
596.221 182.943 L
600.331 167.393 L
623.39 176.896 L
619.28 192.445 LE
623.39 176.896 LS
600.331 167.393 L
604.982 152.098 L
628.041 161.599 L
623.39 176.896 LE
628.041 161.599 LS
604.982 152.098 L
610.125 137.102 L
633.185 146.603 L
628.041 161.599 LE
633.185 146.603 LS
610.125 137.102 L
615.712 122.445 L
638.771 131.946 L
633.185 146.603 LE
660.465 452.626 LS
638.771 442.9 L
633.185 428.243 L
654.879 437.97 L
660.465 452.626 LE
654.879 437.97 LS
633.185 428.243 L
628.041 413.248 L
649.736 422.974 L
654.879 437.97 LE
649.736 422.974 LS
628.041 413.248 L
623.39 397.951 L
645.085 407.678 L
649.736 422.974 LE
645.085 407.678 LS
623.39 397.951 L
619.28 382.402 L
640.974 392.128 L
645.085 407.678 LE
640.974 392.128 LS
619.28 382.402 L
615.751 366.656 L
637.446 376.382 L
640.974 392.128 LE
637.446 376.382 LS
615.751 366.656 L
612.839 350.778 L
634.533 360.504 L
637.446 376.382 LE
634.533 360.504 LS
612.839 350.778 L
610.568 334.839 L
632.262 344.565 L
634.533 360.504 LE
632.262 344.565 LS
610.568 334.839 L
608.951 318.914 L
630.646 328.641 L
632.262 344.565 LE
630.646 328.641 LS
608.951 318.914 L
607.991 303.083 L
629.685 312.809 L
630.646 328.641 LE
629.685 312.809 LS
607.991 303.083 L
607.675 287.423 L
629.37 297.15 L
629.685 312.809 LE
629.37 297.15 LS
607.675 287.423 L
607.991 271.764 L
629.685 281.491 L
629.37 297.15 LE
629.685 281.491 LS
607.991 271.764 L
608.951 255.933 L
630.646 265.659 L
629.685 281.491 LE
630.646 265.659 LS
608.951 255.933 L
610.568 240.008 L
632.262 249.735 L
630.646 265.659 LE
632.262 249.735 LS
610.568 240.008 L
612.839 224.069 L
634.533 233.795 L
632.262 249.735 LE
634.533 233.795 LS
612.839 224.069 L
615.751 208.191 L
637.446 217.917 L
634.533 233.795 LE
637.446 217.917 LS
615.751 208.191 L
619.28 192.445 L
640.974 202.172 L
637.446 217.917 LE
640.974 202.172 LS
619.28 192.445 L
623.39 176.896 L
645.085 186.622 L
640.974 202.172 LE
645.085 186.622 LS
623.39 176.896 L
628.041 161.599 L
649.736 171.326 L
645.085 186.622 LE
649.736 171.326 LS
628.041 161.599 L
633.185 146.603 L
654.879 156.33 L
649.736 171.326 LE
654.879 156.33 LS
633.185 146.603 L
638.771 131.946 L
660.465 141.673 L
654.879 156.33 LE
681.114 462.417 LS
660.465 452.626 L
654.879 437.97 L
675.528 447.761 L
681.114 462.417 LE
675.528 447.761 LS
654.879 437.97 L
649.736 422.974 L
670.385 432.765 L
675.528 447.761 LE
670.385 432.765 LS
649.736 422.974 L
645.085 407.678 L
665.734 417.469 L
670.385 432.765 LE
665.734 417.469 LS
645.085 407.678 L
640.974 392.128 L
661.623 401.919 L
665.734 417.469 LE
661.623 401.919 LS
640.974 392.128 L
637.446 376.382 L
658.095 386.173 L
661.623 401.919 LE
658.095 386.173 LS
637.446 376.382 L
634.533 360.504 L
655.182 370.295 L
658.095 386.173 LE
655.182 370.295 LS
634.533 360.504 L
632.262 344.565 L
652.911 354.356 L
655.182 370.295 LE
652.911 354.356 LS
632.262 344.565 L
630.646 328.641 L
651.295 338.431 L
652.911 354.356 LE
651.295 338.431 LS
630.646 328.641 L
629.685 312.809 L
650.334 322.6 L
651.295 338.431 LE
650.334 322.6 LS
629.685 312.809 L
629.37 297.15 L
650.019 306.941 L
650.334 322.6 LE
650.019 306.941 LS
629.37 297.15 L
629.685 281.491 L
650.334 291.281 L
650.019 306.941 LE
650.334 291.281 LS
629.685 281.491 L
630.646 265.659 L
651.295 275.45 L
650.334 291.281 LE
651.295 275.45 LS
630.646 265.659 L
632.262 249.735 L
652.911 259.526 L
651.295 275.45 LE
652.911 259.526 LS
632.262 249.735 L
634.533 233.795 L
655.182 243.586 L
652.911 259.526 LE
655.182 243.586 LS
634.533 233.795 L
637.446 217.917 L
658.095 227.708 L
655.182 243.586 LE
658.095 227.708 LS
637.446 217.917 L
640.974 202.172 L
661.623 211.962 L
658.095 227.708 LE
661.623 211.962 LS
640.974 202.172 L
645.085 186.622 L
665.734 196.413 L
661.623 211.962 LE
665.734 196.413 LS
645.085 186.622 L
649.736 171.326 L
670.385 181.116 L
665.734 196.413 LE
670.385 181.116 LS
649.736 171.326 L
654.879 156.33 L
675.528 166.12 L
670.385 181.116 LE
675.528 166.12 LS
654.879 156.33 L
660.465 141.673 L
681.114 151.465 L
675.528 166.12 LE
701.062 472.204 LS
681.114 462.417 L
675.528 447.761 L
695.476 457.548 L
701.062 472.204 LE
695.476 457.548 LS
675.528 447.761 L
670.385 432.765 L
690.332 442.552 L
695.476 457.548 LE
690.332 442.552 LS
670.385 432.765 L
665.734 417.469 L
685.681 427.256 L
690.332 442.552 LE
685.681 427.256 LS
665.734 417.469 L
661.623 401.919 L
681.571 411.706 L
685.681 427.256 LE
681.571 411.706 LS
661.623 401.919 L
658.095 386.173 L
678.042 395.96 L
681.571 411.706 LE
678.042 395.96 LS
658.095 386.173 L
655.182 370.295 L
675.13 380.082 L
678.042 395.96 LE
675.13 380.082 LS
655.182 370.295 L
652.911 354.356 L
672.858 364.143 L
675.13 380.082 LE
672.858 364.143 LS
652.911 354.356 L
651.295 338.431 L
671.242 348.218 L
672.858 364.143 LE
671.242 348.218 LS
651.295 338.431 L
650.334 322.6 L
670.282 332.387 L
671.242 348.218 LE
670.282 332.387 LS
650.334 322.6 L
650.019 306.941 L
669.966 316.728 L
670.282 332.387 LE
669.966 316.728 LS
650.019 306.941 L
650.334 291.281 L
670.282 301.068 L
669.966 316.728 LE
670.282 301.068 LS
650.334 291.281 L
651.295 275.45 L
671.242 285.237 L
670.282 301.068 LE
671.242 285.237 LS
651.295 275.45 L
652.911 259.526 L
672.858 269.313 L
671.242 285.237 LE
672.858 269.313 LS
652.911 259.526 L
655.182 243.586 L
675.13 253.373 L
672.858 269.313 LE
675.13 253.373 LS
655.182 243.586 L
658.095 227.708 L
678.042 237.495 L
675.13 253.373 LE
678.042 237.495 LS
658.095 227.708 L
661.623 211.962 L
681.571 221.749 L
678.042 237.495 LE
681.571 221.749 LS
661.623 211.962 L
665.734 196.413 L
685.681 206.2 L
681.571 221.749 LE
685.681 206.2 LS
665.734 196.413 L
670.385 181.116 L
690.332 190.903 L
685.681 206.2 LE
690.332 190.903 LS
670.385 181.116 L
675.528 166.12 L
695.476 175.908 L
690.332 190.903 LE
695.476 175.908 LS
675.528 166.12 L
681.114 151.465 L
701.062 161.252 L
695.476 175.908 LE
720.658 481.976 LS
701.062 472.204 L
695.476 457.548 L
715.072 467.32 L
720.658 481.976 LE
715.072 467.32 LS
695.476 457.548 L
690.332 442.552 L
709.928 452.324 L
715.072 467.32 LE
709.928 452.324 LS
690.332 442.552 L
685.681 427.256 L
705.277 437.028 L
709.928 452.324 LE
705.277 437.028 LS
685.681 427.256 L
681.571 411.706 L
701.167 421.478 L
705.277 437.028 LE
701.167 421.478 LS
681.571 411.706 L
678.042 395.96 L
697.638 405.733 L
701.167 421.478 LE
697.638 405.733 LS
678.042 395.96 L
675.13 380.082 L
694.726 389.855 L
697.638 405.733 LE
694.726 389.855 LS
675.13 380.082 L
672.858 364.143 L
692.455 373.915 L
694.726 389.855 LE
692.455 373.915 LS
672.858 364.143 L
671.242 348.218 L
690.838 357.991 L
692.455 373.915 LE
690.838 357.991 LS
671.242 348.218 L
670.282 332.387 L
689.878 342.159 L
690.838 357.991 LE
689.878 342.159 LS
670.282 332.387 L
669.966 316.728 L
689.563 326.5 L
689.878 342.159 LE
689.563 326.5 LS
669.966 316.728 L
670.282 301.068 L
689.878 310.841 L
689.563 326.5 LE
689.878 310.841 LS
670.282 301.068 L
671.242 285.237 L
690.838 295.009 L
689.878 310.841 LE
690.838 295.009 LS
671.242 285.237 L
672.858 269.313 L
692.455 279.085 L
690.838 295.009 LE
692.455 279.085 LS
672.858 269.313 L
675.13 253.373 L
694.726 263.145 L
692.455 279.085 LE
694.726 263.145 LS
675.13 253.373 L
678.042 237.495 L
697.638 247.267 L
694.726 263.145 LE
697.638 247.267 LS
678.042 237.495 L
681.571 221.749 L
701.167 231.522 L
697.638 247.267 LE
701.167 231.522 LS
681.571 221.749 L
685.681 206.2 L
705.277 215.972 L
701.167 231.522 LE
705.277 215.972 LS
685.681 206.2 L
690.332 190.903 L
709.928 200.676 L
705.277 215.972 LE
709.928 200.676 LS
690.332 190.903 L
695.476 175.908 L
715.072 185.68 L
709.928 200.676 LE
715.072 185.68 LS
695.476 175.908 L
701.062 161.252 L
720.658 171.024 L
715.072 185.68 LE

2.5 setlinewidth 0 0 1 setrgbcolor
689.878 342.159 LS
689.563 326.5 LE
689.878 310.841 LS
689.563 326.5 LE
690.838 295.009 LS
689.878 310.841 LE
692.455 279.085 LS
690.838 295.009 LE
694.726 263.145 LS
692.455 279.085 LE
697.638 247.267 LS
694.726 263.145 LE
701.167 231.522 LS
697.638 247.267 LE
705.277 215.972 LS
701.167 231.522 LE
709.928 200.676 LS
705.277 215.972 LE
715.072 185.68 LS
709.928 200.676 LE
720.658 171.024 LS
715.072 185.68 LE
705.277 437.028 LS
709.928 452.324 LE
701.167 421.478 LS
705.277 437.028 LE
697.638 405.733 LS
701.167 421.478 LE
694.726 389.855 LS
697.638 405.733 LE
692.455 373.915 LS
694.726 389.855 LE
690.838 357.991 LS
692.455 373.915 LE
689.878 342.159 LS
690.838 357.991 LE
715.072 467.32 LS
720.658 481.976 LE
709.928 452.324 LS
715.072 467.32 LE

2.5 setlinewidth 1 0 0 setrgbcolor
689.563 326.5 LS
669.966 316.728 LE
650.019 306.941 LS
669.966 316.728 LE
629.37 297.15 LS
650.019 306.941 LE
607.675 287.423 LS
629.37 297.15 LE
584.616 277.922 LS
607.675 287.423 LE
559.933 268.938 LS
584.616 277.922 LE
533.482 260.923 LS
559.933 268.938 LE
505.308 254.473 LS
533.482 260.923 LE
475.727 250.242 LS
505.308 254.473 LE
445.341 248.762 LS
475.727 250.242 LE
414.956 250.242 LS
445.341 248.762 LE
385.375 254.473 LS
414.956 250.242 LE
357.201 260.923 LS
385.375 254.473 LE
330.75 268.938 LS
357.201 260.923 LE
306.067 277.922 LS
330.75 268.938 LE
283.006 287.423 LS
306.067 277.922 LE
261.313 297.15 LS
283.006 287.423 LE
240.664 306.941 LS
261.313 297.15 LE
220.716 316.728 LS
240.664 306.941 LE
201.12 326.5 LS
220.716 316.728 LE
712.243 337.8 LS
689.563 326.5 LE
712.243 337.8 LS
735.122 348.955 L
758.384 359.798 L
782.185 370.12 L
806.623 379.655 L
831.707 388.077 L
857.315 395.024 L
883.168 400.155 L
908.832 403.239 L
933.785 404.238 LE

(D) 940 400 15 /Helvetica S
(A) 725 150 15 /Helvetica S
(B) 715 493 15 /Helvetica S
(C) 178 320 15 /Helvetica S
gsave 0 setgray % 0 0.35 0 setrgbcolor
689.563 326.5 moveto
689.563 326.5 3 0 360 arc fill
933.785 404.238 moveto
933.785 404.238 3 0 360 arc fill
720.658 171.024 moveto
720.658 171.024 3 0 360 arc fill
720.658 481.976 moveto
720.658 481.976 3 0 360 arc fill
201.12 326.5 moveto
201.12 326.5 3 0 360 arc fill
grestore
grestore
showpage
cleartomark
%%PageTrailer
%%Trailer
end
%%EOF
