%!PS-Adobe-3.0 EPSF-3.0
%%Title: boomerang-1
%%Creator: GL2PS 1.4.3, (C) 1999-2020 C. Geuzaine
%%For: Gmsh
%%CreationDate: Sun Aug 21 15:48:57 2022
%%LanguageLevel: 3
%%DocumentData: Clean7Bit
%%Pages: 1
%%BoundingBox: 110 83 1025 630
%%EndComments
%%BeginProlog
/gl2psdict 64 dict def gl2psdict begin
/tryPS3shading false def % set to false to force subdivision
/rThreshold 0.0666667 def % red component subdivision threshold
/gThreshold 0.05 def % green component subdivision threshold
/bThreshold 0.1 def % blue component subdivision threshold
/BD { bind def } bind def
/C  { setrgbcolor } BD
/G  { 0.082 mul exch 0.6094 mul add exch 0.3086 mul add neg 1.0 add setgray } BD
/W  { setlinewidth } BD
/LC  { setlinecap } BD
/LJ  { setlinejoin } BD
/FC { findfont exch /SH exch def SH scalefont setfont } BD
/SW { dup stringwidth pop } BD
/S  { FC moveto show } BD
/SBC{ FC moveto SW -2 div 0 rmoveto show } BD
/SBR{ FC moveto SW neg 0 rmoveto show } BD
/SCL{ FC moveto 0 SH -2 div rmoveto show } BD
/SCC{ FC moveto SW -2 div SH -2 div rmoveto show } BD
/SCR{ FC moveto SW neg SH -2 div rmoveto show } BD
/STL{ FC moveto 0 SH neg rmoveto show } BD
/STC{ FC moveto SW -2 div SH neg rmoveto show } BD
/STR{ FC moveto SW neg SH neg rmoveto show } BD
/FCT { FC translate 0 0 } BD
/SR  { gsave FCT moveto rotate show grestore } BD
/SBCR{ gsave FCT moveto rotate SW -2 div 0 rmoveto show grestore } BD
/SBRR{ gsave FCT moveto rotate SW neg 0 rmoveto show grestore } BD
/SCLR{ gsave FCT moveto rotate 0 SH -2 div rmoveto show grestore} BD
/SCCR{ gsave FCT moveto rotate SW -2 div SH -2 div rmoveto show grestore} BD
/SCRR{ gsave FCT moveto rotate SW neg SH -2 div rmoveto show grestore} BD
/STLR{ gsave FCT moveto rotate 0 SH neg rmoveto show grestore } BD
/STCR{ gsave FCT moveto rotate SW -2 div SH neg rmoveto show grestore } BD
/STRR{ gsave FCT moveto rotate SW neg SH neg rmoveto show grestore } BD
/P  { newpath 0.0 360.0 arc closepath fill } BD
/LS { newpath moveto } BD
/L  { lineto } BD
/LE { lineto stroke } BD
/T  { newpath moveto lineto lineto closepath fill } BD
/STshfill {
      /b1 exch def /g1 exch def /r1 exch def /y1 exch def /x1 exch def
      /b2 exch def /g2 exch def /r2 exch def /y2 exch def /x2 exch def
      /b3 exch def /g3 exch def /r3 exch def /y3 exch def /x3 exch def
      gsave << /ShadingType 4 /ColorSpace [/DeviceRGB]
      /DataSource [ 0 x1 y1 r1 g1 b1 0 x2 y2 r2 g2 b2 0 x3 y3 r3 g3 b3 ] >>
      shfill grestore } BD
/Tm { 3 -1 roll 8 -1 roll 13 -1 roll add add 3 div
      3 -1 roll 7 -1 roll 11 -1 roll add add 3 div
      3 -1 roll 6 -1 roll 9 -1 roll add add 3 div C T } BD
/STsplit {
      4 index 15 index add 0.5 mul
      4 index 15 index add 0.5 mul
      4 index 15 index add 0.5 mul
      4 index 15 index add 0.5 mul
      4 index 15 index add 0.5 mul
      5 copy 5 copy 25 15 roll
      9 index 30 index add 0.5 mul
      9 index 30 index add 0.5 mul
      9 index 30 index add 0.5 mul
      9 index 30 index add 0.5 mul
      9 index 30 index add 0.5 mul
      5 copy 5 copy 35 5 roll 25 5 roll 15 5 roll
      4 index 10 index add 0.5 mul
      4 index 10 index add 0.5 mul
      4 index 10 index add 0.5 mul
      4 index 10 index add 0.5 mul
      4 index 10 index add 0.5 mul
      5 copy 5 copy 40 5 roll 25 5 roll 15 5 roll 25 5 roll
      STnoshfill STnoshfill STnoshfill STnoshfill } BD
/STnoshfill {
      2 index 8 index sub abs rThreshold gt
      { STsplit }
      { 1 index 7 index sub abs gThreshold gt
        { STsplit }
        { dup 6 index sub abs bThreshold gt
          { STsplit }
          { 2 index 13 index sub abs rThreshold gt
            { STsplit }
            { 1 index 12 index sub abs gThreshold gt
              { STsplit }
              { dup 11 index sub abs bThreshold gt
                { STsplit }
                { 7 index 13 index sub abs rThreshold gt
                  { STsplit }
                  { 6 index 12 index sub abs gThreshold gt
                    { STsplit }
                    { 5 index 11 index sub abs bThreshold gt
                      { STsplit }
                      { Tm }
                      ifelse }
                    ifelse }
                  ifelse }
                ifelse }
              ifelse }
            ifelse }
          ifelse }
        ifelse }
      ifelse } BD
tryPS3shading
{ /shfill where
  { /ST { STshfill } BD }
  { /ST { STnoshfill } BD }
  ifelse }
{ /ST { STnoshfill } BD }
ifelse
end
%%EndProlog
%%BeginSetup
/DeviceRGB setcolorspace
gl2psdict begin
%%EndSetup
%%Page: 1 1
%%BeginPageSetup
%%EndPageSetup
mark
gsave
1.0 1.0 scale
0 0 0 C
(x) 1011.93 120.181 15 /Helvetica S
(-1.02) 150.071 90.6813 15 /Helvetica S
(-0.222) 354.286 90.6813 15 /Helvetica S
(0.575) 565 90.6813 15 /Helvetica S
(1.37) 777.214 90.6813 15 /Helvetica S
(2.17) 985.429 90.6813 15 /Helvetica S
(y) 166.571 618.319 15 /Helvetica S
(-1.84) 121.071 114.515 15 /Helvetica S
(-1.37) 121.071 235.924 15 /Helvetica S
(-0.91) 121.071 357.333 15 /Helvetica S
(-0.445) 113.071 478.743 15 /Helvetica S
(0.019) 118.071 600.152 15 /Helvetica S
1 W
166.571 120.181 LS
166.571 110.181 LE
374.786 120.181 LS
374.786 110.181 LE
583 120.181 LS
583 110.181 LE
791.214 120.181 LS
791.214 110.181 LE
999.429 120.181 LS
999.429 110.181 LE
166.571 120.181 LS
156.571 120.181 LE
166.571 241.591 LS
156.571 241.591 LE
166.571 363 LS
156.571 363 LE
166.571 484.409 LS
156.571 484.409 LE
166.571 605.819 LS
156.571 605.819 LE
166.571 120.181 LS
999.429 120.181 LE
166.571 120.181 LS
166.571 605.819 LE
166.571 120.181 LS
166.571 120.181 LE
1 0.470588 0 C
738.836 159.202 LS
733.29 150.054 LE
745.023 167.966 LS
738.836 159.202 LE
751.573 176.455 LS
745.023 167.966 LE
758.353 184.73 LS
751.573 176.455 LE
765.285 192.825 LS
758.353 184.73 LE
772.321 200.771 LS
765.285 192.825 LE
779.553 208.722 LS
772.321 200.771 LE
786.673 216.38 LS
779.553 208.722 LE
793.858 223.973 LS
786.673 216.38 LE
801.098 231.514 LS
793.858 223.973 LE
808.385 239.012 LS
801.098 231.514 LE
815.709 246.472 LS
808.385 239.012 LE
823.061 253.908 LS
815.709 246.472 LE
830.432 261.321 LS
823.061 253.908 LE
837.819 268.72 LS
830.432 261.321 LE
845.21 276.114 LS
837.819 268.72 LE
852.604 283.506 LS
845.21 276.114 LE
860.007 290.89 LS
852.604 283.506 LE
867.424 298.258 LS
860.007 290.89 LE
874.863 305.603 LS
867.424 298.258 LE
882.331 312.918 LS
874.863 305.603 LE
889.837 320.198 LS
882.331 312.918 LE
897.388 327.43 LS
889.837 320.198 LE
904.994 334.602 LS
897.388 327.43 LE
912.666 341.706 LS
904.994 334.602 LE
920.415 348.723 LS
912.666 341.706 LE
928.259 355.634 LS
920.415 348.723 LE
936.221 362.411 LS
928.259 355.634 LE
944.328 369.011 LS
936.221 362.411 LE
952.63 375.368 LS
944.328 369.011 LE
961.195 381.362 LS
952.63 375.368 LE
970.163 386.738 LS
961.195 381.362 LE
979.807 390.763 LS
970.163 386.738 LE
989.426 390.581 LS
979.807 390.763 LE
997.129 383.86 LS
989.426 390.581 LE
999.429 374.093 LS
997.129 383.86 LE
995.999 364.226 LS
999.429 374.093 LE
990.842 355.131 LS
995.999 364.226 LE
984.964 346.486 LS
990.842 355.131 LE
978.678 338.13 LS
984.964 346.486 LE
972.128 329.983 LS
978.678 338.13 LE
965.39 321.991 LS
972.128 329.983 LE
958.508 314.118 LS
965.39 321.991 LE
951.514 306.347 LS
958.508 314.118 LE
944.428 298.66 LS
951.514 306.347 LE
937.269 291.039 LS
944.428 298.66 LE
930.052 283.477 LS
937.269 291.039 LE
922.783 275.96 LS
930.052 283.477 LE
915.475 268.485 LS
922.783 275.96 LE
908.136 261.038 LS
915.475 268.485 LE
900.771 253.618 LS
908.136 261.038 LE
893.392 246.213 LS
900.771 253.618 LE
886 238.816 LS
893.392 246.213 LE
878.609 231.425 LS
886 238.816 LE
871.209 224.038 LS
878.609 231.425 LE
863.802 216.662 LS
871.209 224.038 LE
856.373 209.305 LS
863.802 216.662 LE
848.917 201.973 LS
856.373 209.305 LE
841.431 194.678 LS
848.917 201.973 LE
833.901 187.425 LS
841.431 194.678 LE
826.318 180.224 LS
833.901 187.425 LE
818.678 173.089 LS
826.318 180.224 LE
810.965 166.032 LS
818.678 173.089 LE
803.163 159.071 LS
810.965 166.032 LE
795.256 152.231 LS
803.163 159.071 LE
787.219 145.545 LS
795.256 152.231 LE
779.009 139.071 LS
787.219 145.545 LE
770.572 132.897 LS
779.009 139.071 LE
761.806 127.202 LS
770.572 132.897 LE
752.506 122.421 LS
761.806 127.202 LE
742.485 120.181 LS
752.506 122.421 LE
733.29 125.15 LS
742.485 120.181 LE
726.418 120.524 LS
733.29 125.15 LE
715.82 121.742 LS
726.418 120.524 LE
705.705 126.653 LS
715.82 121.742 LE
696.285 132.704 LS
705.705 126.653 LE
687.341 139.246 LS
696.285 132.704 LE
678.76 146.036 LS
687.341 139.246 LE
670.042 153.321 LS
678.76 146.036 LE
662.154 160.182 LS
670.042 153.321 LE
654.369 167.161 LS
662.154 160.182 LE
646.667 174.231 LS
654.369 167.161 LE
639.037 181.379 LS
646.667 174.231 LE
631.466 188.588 LS
639.037 181.379 LE
623.943 195.849 LS
631.466 188.588 LE
616.461 203.152 LS
623.943 195.849 LE
609.011 210.486 LS
616.461 203.152 LE
601.586 217.846 LS
609.011 210.486 LE
594.179 225.225 LS
601.586 217.846 LE
586.782 232.614 LS
594.179 225.225 LE
579.389 240.008 LS
586.782 232.614 LE
572 247.402 LS
579.389 240.008 LE
564.622 254.81 LS
572 247.402 LE
557.261 262.235 LS
564.622 254.81 LE
549.926 269.685 LS
557.261 262.235 LE
542.624 277.168 LS
549.926 269.685 LE
535.363 284.69 LS
542.624 277.168 LE
528.154 292.262 LS
535.363 284.69 LE
521.007 299.892 LS
528.154 292.262 LE
513.935 307.594 LS
521.007 299.892 LE
506.957 315.378 LS
513.935 307.594 LE
500.095 323.266 LS
506.957 315.378 LE
493.383 331.283 LS
500.095 323.266 LE
486.869 339.461 LS
493.383 331.283 LE
480.637 347.855 LS
486.869 339.461 LE
474.845 356.558 LS
480.637 347.855 LE
469.863 365.75 LS
474.845 356.558 LE
466.971 375.642 LS
469.863 365.75 LE
470.001 384.52 LS
466.971 375.642 LE
478.089 390.945 LS
470.001 384.52 LE
488.387 390.277 LS
478.089 390.945 LE
497.896 385.934 LS
488.387 390.277 LE
506.785 380.431 LS
497.896 385.934 LE
515.301 374.366 LS
506.785 380.431 LE
523.567 367.964 LS
515.301 374.366 LE
531.649 361.332 LS
523.567 367.964 LE
539.589 354.531 LS
531.649 361.332 LE
547.418 347.601 LS
539.589 354.531 LE
555.154 340.569 LS
547.418 347.601 LE
562.814 333.452 LS
555.154 340.569 LE
570.41 326.269 LS
562.814 333.452 LE
577.953 319.029 LS
570.41 326.269 LE
585.452 311.745 LS
577.953 319.029 LE
592.916 304.424 LS
585.452 311.745 LE
600.351 297.074 LS
592.916 304.424 LE
607.765 289.703 LS
600.351 297.074 LE
615.165 282.317 LS
607.765 289.703 LE
622.559 274.925 LS
615.165 282.317 LE
629.95 267.531 LS
622.559 274.925 LE
637.334 260.129 LS
629.95 267.531 LE
644.703 252.714 LS
637.334 260.129 LE
652.051 245.275 LS
644.703 252.714 LE
659.368 237.807 LS
652.051 245.275 LE
666.648 230.303 LS
659.368 237.807 LE
673.882 222.755 LS
666.648 230.303 LE
681.058 215.152 LS
673.882 222.755 LE
688.165 207.483 LS
681.058 215.152 LE
695.187 199.738 LS
688.165 207.483 LE
702.103 191.897 LS
695.187 199.738 LE
708.885 183.941 LS
702.103 191.897 LE
715.496 175.841 LS
708.885 183.941 LE
721.865 167.55 LS
715.496 175.841 LE
727.877 158.998 LS
721.865 167.55 LE
733.29 150.054 LS
727.877 158.998 LE
427.163 566.798 LS
432.71 575.948 LE
420.977 558.035 LS
427.163 566.798 LE
414.427 549.546 LS
420.977 558.035 LE
407.647 541.271 LS
414.427 549.546 LE
400.716 533.175 LS
407.647 541.271 LE
393.68 525.229 LS
400.716 533.175 LE
386.447 517.278 LS
393.68 525.229 LE
379.328 509.621 LS
386.447 517.278 LE
372.142 502.027 LS
379.328 509.621 LE
364.901 494.486 LS
372.142 502.027 LE
357.614 486.989 LS
364.901 494.486 LE
350.291 479.527 LS
357.614 486.989 LE
342.94 472.093 LS
350.291 479.527 LE
335.568 464.68 LS
342.94 472.093 LE
328.182 457.28 LS
335.568 464.68 LE
320.79 449.886 LS
328.182 457.28 LE
313.396 442.495 LS
320.79 449.886 LE
305.994 435.112 LS
313.396 442.495 LE
298.577 427.743 LS
305.994 435.112 LE
291.137 420.397 LS
298.577 427.743 LE
283.669 413.081 LS
291.137 420.397 LE
276.164 405.803 LS
283.669 413.081 LE
268.613 398.572 LS
276.164 405.803 LE
261.007 391.398 LS
268.613 398.572 LE
253.335 384.295 LS
261.007 391.398 LE
245.585 377.277 LS
253.335 384.295 LE
237.741 370.366 LS
245.585 377.277 LE
229.779 363.589 LS
237.741 370.366 LE
221.671 356.989 LS
229.779 363.589 LE
213.371 350.632 LS
221.671 356.989 LE
204.805 344.638 LS
213.371 350.632 LE
195.838 339.262 LS
204.805 344.638 LE
186.193 335.237 LS
195.838 339.262 LE
176.574 335.42 LS
186.193 335.237 LE
168.871 342.14 LS
176.574 335.42 LE
166.571 351.907 LS
168.871 342.14 LE
170.001 361.775 LS
166.571 351.907 LE
175.157 370.869 LS
170.001 361.775 LE
181.036 379.515 LS
175.157 370.869 LE
187.321 387.869 LS
181.036 379.515 LE
193.871 396.018 LS
187.321 387.869 LE
200.611 404.011 LS
193.871 396.018 LE
207.493 411.881 LS
200.611 404.011 LE
214.488 419.652 LS
207.493 411.881 LE
221.572 427.34 LS
214.488 419.652 LE
228.73 434.961 LS
221.572 427.34 LE
235.949 442.524 LS
228.73 434.961 LE
243.217 450.039 LS
235.949 442.524 LE
250.525 457.516 LS
243.217 450.039 LE
257.865 464.961 LS
250.525 457.516 LE
265.228 472.383 LS
257.865 464.961 LE
272.609 479.788 LS
265.228 472.383 LE
279.999 487.183 LS
272.609 479.788 LE
287.392 494.576 LS
279.999 487.183 LE
294.79 501.963 LS
287.392 494.576 LE
302.199 509.339 LS
294.79 501.963 LE
309.628 516.696 LS
302.199 509.339 LE
317.082 524.027 LS
309.628 516.696 LE
324.571 531.323 LS
317.082 524.027 LE
332.1 538.576 LS
324.571 531.323 LE
339.681 545.776 LS
332.1 538.576 LE
347.322 552.912 LS
339.681 545.776 LE
355.036 559.969 LS
347.322 552.912 LE
362.836 566.93 LS
355.036 559.969 LE
370.743 573.77 LS
362.836 566.93 LE
378.782 580.455 LS
370.743 573.77 LE
386.991 586.93 LS
378.782 580.455 LE
395.428 593.104 LS
386.991 586.93 LE
404.195 598.8 LS
395.428 593.104 LE
413.493 603.579 LS
404.195 598.8 LE
423.514 605.819 LS
413.493 603.579 LE
432.71 600.85 LS
423.514 605.819 LE
439.583 605.478 LS
432.71 600.85 LE
450.18 604.258 LS
439.583 605.478 LE
460.295 599.347 LS
450.18 604.258 LE
469.716 593.296 LS
460.295 599.347 LE
478.659 586.754 LS
469.716 593.296 LE
487.241 579.965 LS
478.659 586.754 LE
495.958 572.679 LS
487.241 579.965 LE
503.846 565.818 LS
495.958 572.679 LE
511.631 558.839 LS
503.846 565.818 LE
519.332 551.768 LS
511.631 558.839 LE
526.963 544.621 LS
519.332 551.768 LE
534.534 537.412 LS
526.963 544.621 LE
542.057 530.151 LS
534.534 537.412 LE
549.539 522.849 LS
542.057 530.151 LE
556.989 515.514 LS
549.539 522.849 LE
564.414 508.153 LS
556.989 515.514 LE
571.821 500.775 LS
564.414 508.153 LE
579.218 493.386 LS
571.821 500.775 LE
586.611 485.993 LS
579.218 493.386 LE
594 478.597 LS
586.611 485.993 LE
601.378 471.19 LS
594 478.597 LE
608.739 463.765 LS
601.378 471.19 LE
616.074 456.315 LS
608.739 463.765 LE
623.376 448.833 LS
616.074 456.315 LE
630.637 441.31 LS
623.376 448.833 LE
637.846 433.738 LS
630.637 441.31 LE
644.993 426.108 LS
637.846 433.738 LE
652.065 418.407 LS
644.993 426.108 LE
659.043 410.622 LS
652.065 418.407 LE
665.905 402.734 LS
659.043 410.622 LE
672.617 394.718 LS
665.905 402.734 LE
679.131 386.541 LS
672.617 394.718 LE
685.363 378.146 LS
679.131 386.541 LE
691.155 369.442 LS
685.363 378.146 LE
696.138 360.251 LS
691.155 369.442 LE
699.029 350.359 LS
696.138 360.251 LE
696 341.48 LS
699.029 350.359 LE
687.911 335.057 LS
696 341.48 LE
677.613 335.723 LS
687.911 335.057 LE
668.104 340.066 LS
677.613 335.723 LE
659.215 345.57 LS
668.104 340.066 LE
650.699 351.634 LS
659.215 345.57 LE
642.433 358.036 LS
650.699 351.634 LE
634.351 364.669 LS
642.433 358.036 LE
626.411 371.469 LS
634.351 364.669 LE
618.582 378.399 LS
626.411 371.469 LE
610.846 385.432 LS
618.582 378.399 LE
603.186 392.547 LS
610.846 385.432 LE
595.59 399.731 LS
603.186 392.547 LE
588.047 406.97 LS
595.59 399.731 LE
580.548 414.255 LS
588.047 406.97 LE
573.084 421.577 LS
580.548 414.255 LE
565.649 428.927 LS
573.084 421.577 LE
558.235 436.298 LS
565.649 428.927 LE
550.835 443.683 LS
558.235 436.298 LE
543.441 451.075 LS
550.835 443.683 LE
536.05 458.469 LS
543.441 451.075 LE
528.666 465.871 LS
536.05 458.469 LE
521.297 473.287 LS
528.666 465.871 LE
513.949 480.725 LS
521.297 473.287 LE
506.632 488.192 LS
513.949 480.725 LE
499.352 495.696 LS
506.632 488.192 LE
492.118 503.245 LS
499.352 495.696 LE
484.942 510.848 LS
492.118 503.245 LE
477.835 518.516 LS
484.942 510.848 LE
470.814 526.262 LS
477.835 518.516 LE
463.897 534.103 LS
470.814 526.262 LE
457.114 542.059 LS
463.897 534.103 LE
450.505 550.16 LS
457.114 542.059 LE
444.135 558.45 LS
450.505 550.16 LE
438.122 567.002 LS
444.135 558.45 LE
432.71 575.948 LS
438.122 567.002 LE
grestore
showpage
cleartomark
%%PageTrailer
%%Trailer
end
%%EOF
