%!PS-Adobe-3.0 EPSF-3.0
%%Title:                     angle-a
%%BoundingBox:     85   19   165   74
%%EndComments

% these procedures have been posted in comp.lang.postscript
% by Bill Lee, bill@leeweyr.sccsi.com, on Apr 19 1995
% subject: arc with arrow head


%* _____________________________ Arrows ____________________________________
%* Procedure to draw the path for an arrow head. Note: the arrowhead will be
%* added to the current path. The arrowhead will also be drawn and filled.
%*
%*      Usage:  Linewidth PreviousX PreviousY
%*                      ArrowHead
%*              
%*                 where: LineWidth is the width in points of the arrow head
%*                        lines
%*
%*                        PreviousX and PreviousY along with the currentpoint
%*                        define the direction that the arrow points
%*
%*              Note: If Linewidth is zero, a value of 1 will be substituted
/ArrowHead {
          currentpoint moveto
          currentpoint
          4 2 roll exch 4 -1 roll exch
          sub 3 1 roll sub
          exch atan matrix currentmatrix exch rotate exch
          dup 0 eq
            { pop 1 } if
          dup scale
          -7 2 rlineto
          1 -2 rlineto
          -1 -2 rlineto
          7 2 rlineto
          currentpoint
          gsave
            newpath moveto
            -7 2 rlineto
            1 -2 rlineto
            -1 -2 rlineto
            closepath
            fill
          grestore
          setmatrix
} bind def

%* _____________________________ RLineto^ ____________________________________
%* Procedure to add a relative line to the current path and then add the
%* path for an arrow on its end.
%*
%*      Usage:  x y RLineto^
%*
%*                where: x and y are the offsets from the current point
%*              
/RLineto^ {
        currentlinewidth currentpoint 5 3 roll
        rlineto
        ArrowHead
} bind def

%* _____________________________ Lineto^ ____________________________________
%* Procedure to add a line to the current path and then add the
%* path for an arrow on its end.
%*
%*      Usage:  x y Lineto^
%*
%*                where: x and y are the new points for the path
%*              
/Lineto^ {
        currentlinewidth currentpoint 5 3 roll
        lineto
        ArrowHead
} bind def

%* _____________________________ Arc^ ____________________________________
%* Procedure to add an arc to the current path and then add the
%* path for arrow on its end.
%*
%*      Usage:  x y r ang1 ang2 Arc^
%*
%*                where: x, y, ang1, ang2, and r are the normal parameters
%*                       for drawing an arc.
%*              
/Arc^ {
        5 copy arc
        exch pop 2 sub
        dup cos 2 index mul 4 index add
        exch sin 2 index mul 3 index add
        currentlinewidth  3 1 roll
        ArrowHead pop pop pop
} bind def

%* _____________________________ Arcn^ ____________________________________
%* Procedure to add an arc to the current path and then add the
%* path for arrow on its end.
%*
%*      Usage:  x y r ang1 ang2 Arcn^
%*
%*                where: x, y, ang1, ang2, and r are the normal parameters
%*                       for drawing an arcn.
%*              
/Arcn^ {
        5 copy arcn
        exch pop 2 add
        dup cos 2 index mul 4 index add
        exch sin 2 index mul 3 index add
        currentlinewidth  3 1 roll
        ArrowHead pop pop pop
} bind def


1 setlinecap

gsave 0 setlinewidth 0.9 setgray
87 66 moveto
105 65 lineto
120 35 lineto
146 54 lineto
163 49 lineto
158 47 152 44 148 40 curveto
144 36 138 32 135 28 curveto
130 24 125 18 115 20 curveto
105 23 103 30 102 35 curveto
102 44 99 48 95 51 curveto
90 55 88 61 87 66 curveto
closepath fill grestore

0.3 setgray 0.5 setlinewidth
109 57 moveto 120 63 Lineto^ stroke
137 48 moveto 130 57 Lineto^ stroke

0.8 setlinewidth 1 0.5 0 setrgbcolor
87 66 moveto
105 65 lineto
120 35 Lineto^
146 54 Lineto^
163 49 lineto
stroke

0.4 setlinewidth

40 60 moveto
105 65 moveto 95 51 lineto stroke
102 35 moveto 120 35 lineto stroke
120 35 moveto 115 20 lineto stroke
120 35 moveto 135 28 lineto stroke
146 54 moveto 148 40 lineto stroke


/Helvetica findfont 10 scalefont setfont	
106 65 moveto (A) show
120 39 moveto (B) show
145 57 moveto (C) show
119 65 moveto (nab) show
129 59 moveto (nbc) show


showpage
%%Trailer
%EOF
