%!PS-Adobe-3.0 EPSF-3.0
%%Title: ring
%%Creator: GL2PS 1.4.0, (C) 1999-2017 C. Geuzaine
%%For: Gmsh
%%CreationDate: Wed Mar 20 22:37:55 2019
%%LanguageLevel: 3
%%DocumentData: Clean7Bit
%%Pages: 1
%%BoundingBox: 30 36 586 523
%%EndComments
%%BeginProlog
/gl2psdict 64 dict def gl2psdict begin
/tryPS3shading false def % set to false to force subdivision
/rThreshold 0.0666667 def % red component subdivision threshold
/gThreshold 0.05 def % green component subdivision threshold
/bThreshold 0.1 def % blue component subdivision threshold
/BD { bind def } bind def
/C  { setrgbcolor } BD
/G  { 0.082 mul exch 0.6094 mul add exch 0.3086 mul add neg 1.0 add setgray } BD
/W  { setlinewidth } BD
/LC  { setlinecap } BD
/LJ  { setlinejoin } BD
/FC { findfont exch /SH exch def SH scalefont setfont } BD
/SW { dup stringwidth pop } BD
/S  { FC moveto show } BD
/SBC{ FC moveto SW -2 div 0 rmoveto show } BD
/SBR{ FC moveto SW neg 0 rmoveto show } BD
/SCL{ FC moveto 0 SH -2 div rmoveto show } BD
/SCC{ FC moveto SW -2 div SH -2 div rmoveto show } BD
/SCR{ FC moveto SW neg SH -2 div rmoveto show } BD
/STL{ FC moveto 0 SH neg rmoveto show } BD
/STC{ FC moveto SW -2 div SH neg rmoveto show } BD
/STR{ FC moveto SW neg SH neg rmoveto show } BD
/FCT { FC translate 0 0 } BD
/SR  { gsave FCT moveto rotate show grestore } BD
/SBCR{ gsave FCT moveto rotate SW -2 div 0 rmoveto show grestore } BD
/SBRR{ gsave FCT moveto rotate SW neg 0 rmoveto show grestore } BD
/SCLR{ gsave FCT moveto rotate 0 SH -2 div rmoveto show grestore} BD
/SCCR{ gsave FCT moveto rotate SW -2 div SH -2 div rmoveto show grestore} BD
/SCRR{ gsave FCT moveto rotate SW neg SH -2 div rmoveto show grestore} BD
/STLR{ gsave FCT moveto rotate 0 SH neg rmoveto show grestore } BD
/STCR{ gsave FCT moveto rotate SW -2 div SH neg rmoveto show grestore } BD
/STRR{ gsave FCT moveto rotate SW neg SH neg rmoveto show grestore } BD
/P  { newpath 0.0 360.0 arc closepath fill } BD
/LS { newpath moveto } BD
/L  { lineto } BD
/LE { lineto stroke } BD
/T  { newpath moveto lineto lineto closepath fill } BD
/STshfill {
      /b1 exch def /g1 exch def /r1 exch def /y1 exch def /x1 exch def
      /b2 exch def /g2 exch def /r2 exch def /y2 exch def /x2 exch def
      /b3 exch def /g3 exch def /r3 exch def /y3 exch def /x3 exch def
      gsave << /ShadingType 4 /ColorSpace [/DeviceRGB]
      /DataSource [ 0 x1 y1 r1 g1 b1 0 x2 y2 r2 g2 b2 0 x3 y3 r3 g3 b3 ] >>
      shfill grestore } BD
/Tm { 3 -1 roll 8 -1 roll 13 -1 roll add add 3 div
      3 -1 roll 7 -1 roll 11 -1 roll add add 3 div
      3 -1 roll 6 -1 roll 9 -1 roll add add 3 div C T } BD
/STsplit {
      4 index 15 index add 0.5 mul
      4 index 15 index add 0.5 mul
      4 index 15 index add 0.5 mul
      4 index 15 index add 0.5 mul
      4 index 15 index add 0.5 mul
      5 copy 5 copy 25 15 roll
      9 index 30 index add 0.5 mul
      9 index 30 index add 0.5 mul
      9 index 30 index add 0.5 mul
      9 index 30 index add 0.5 mul
      9 index 30 index add 0.5 mul
      5 copy 5 copy 35 5 roll 25 5 roll 15 5 roll
      4 index 10 index add 0.5 mul
      4 index 10 index add 0.5 mul
      4 index 10 index add 0.5 mul
      4 index 10 index add 0.5 mul
      4 index 10 index add 0.5 mul
      5 copy 5 copy 40 5 roll 25 5 roll 15 5 roll 25 5 roll
      STnoshfill STnoshfill STnoshfill STnoshfill } BD
/STnoshfill {
      2 index 8 index sub abs rThreshold gt
      { STsplit }
      { 1 index 7 index sub abs gThreshold gt
        { STsplit }
        { dup 6 index sub abs bThreshold gt
          { STsplit }
          { 2 index 13 index sub abs rThreshold gt
            { STsplit }
            { 1 index 12 index sub abs gThreshold gt
              { STsplit }
              { dup 11 index sub abs bThreshold gt
                { STsplit }
                { 7 index 13 index sub abs rThreshold gt
                  { STsplit }
                  { 6 index 12 index sub abs gThreshold gt
                    { STsplit }
                    { 5 index 11 index sub abs bThreshold gt
                      { STsplit }
                      { Tm }
                      ifelse }
                    ifelse }
                  ifelse }
                ifelse }
              ifelse }
            ifelse }
          ifelse }
        ifelse }
      ifelse } BD
tryPS3shading
{ /shfill where
  { /ST { STshfill } BD }
  { /ST { STnoshfill } BD }
  ifelse }
{ /ST { STnoshfill } BD }
ifelse
end
%%EndProlog
%%BeginSetup
/DeviceRGB setcolorspace
gl2psdict begin
%%EndSetup
%%Page: 1 1
%%BeginPageSetup
%%EndPageSetup
mark
gsave
1.0 1.0 scale
0 0 0 C
(1.99) 46.3875 508.619 15 /Helvetica S
(-1.96) 70.3875 56.2143 15 /Helvetica S
(0) 66.3875 294.333 15 /Helvetica S
(-0.967) 172.944 56.2143 15 /Helvetica S
(-0.995) 33.3875 187.19 15 /Helvetica S
(0.0218) 278 56.2143 15 /Helvetica S
(-1.99) 41.3875 80.0476 15 /Helvetica S
(1.01) 392.556 56.2143 15 /Helvetica S
(2) 509.112 56.2143 15 /Helvetica S
(0.995) 38.3875 401.476 15 /Helvetica S
1 W
86.8875 85.7143 LS
76.8875 85.7143 LE
406.556 85.7143 LS
406.556 75.7143 LE
86.8875 192.857 LS
76.8875 192.857 LE
300 85.7143 LS
300 75.7143 LE
86.8875 300 LS
76.8875 300 LE
193.444 85.7143 LS
193.444 75.7143 LE
86.8875 407.143 LS
76.8875 407.143 LE
513.112 85.7143 LS
513.112 75.7143 LE
86.8875 514.286 LS
76.8875 514.286 LE
86.8875 85.7143 LS
86.8875 75.7143 LE
86.8875 85.7143 LS
513.112 85.7143 LE
86.8875 85.7143 LS
86.8875 514.286 LE
86.8875 85.7143 LS
86.8875 85.7143 LE
86.8875 514.286 LS
513.112 514.286 LE
513.112 85.7143 LS
513.112 514.286 LE
513.112 85.7143 LS
513.112 85.7143 LE
86.8875 85.7143 LS
513.112 85.7143 LE
86.8875 85.7143 LS
86.8875 514.286 L
86.8875 514.286 L
513.112 514.286 LE
513.112 85.7143 LS
513.112 514.286 L
513.112 514.286 LE
[1 3 1 3 1 3 1 3] 0 setdash
193.444 85.7143 LS
193.444 514.286 LE
300 85.7143 LS
300 514.286 LE
406.556 85.7143 LS
406.556 514.286 LE
86.8875 192.857 LS
513.112 192.857 LE
86.8875 300 LS
513.112 300 LE
86.8875 407.143 LS
513.112 407.143 LE
86.8875 192.857 LS
86.8875 192.857 LE
86.8875 300 LS
86.8875 300 LE
86.8875 407.143 LS
86.8875 407.143 LE
193.444 85.7143 LS
193.444 85.7143 LE
300 85.7143 LS
300 85.7143 LE
406.556 85.7143 LS
406.556 85.7143 LE
513.112 407.143 LS
513.112 407.143 LE
513.112 300 LS
513.112 300 LE
513.112 192.857 LS
513.112 192.857 LE
406.556 514.286 LS
406.556 514.286 LE
300 514.286 LS
300 514.286 LE
193.444 514.286 LS
193.444 514.286 LE
[] 0 setdash
1 0.510338 0.0236323 C
494.484 212.362 LS
498.21 229.889 L
488.182 233.395 L
484.643 216.744 L
494.484 212.362 LE
498.21 229.889 LS
501.935 247.417 L
491.721 250.046 L
488.182 233.395 L
498.21 229.889 LE
501.935 247.417 LS
505.662 264.945 L
495.26 266.698 L
491.721 250.046 L
501.935 247.417 LE
505.662 264.945 LS
509.387 282.472 L
498.8 283.349 L
495.26 266.698 L
505.662 264.945 LE
509.387 282.472 LS
513.112 300 L
502.339 300 L
498.8 283.349 L
509.387 282.472 LE
484.643 216.744 LS
488.182 233.395 L
478.154 236.901 L
474.8 221.126 L
484.643 216.744 LE
488.182 233.395 LS
491.721 250.046 L
481.507 252.675 L
478.154 236.901 L
488.182 233.395 LE
491.721 250.046 LS
495.26 266.698 L
484.859 268.45 L
481.507 252.675 L
491.721 250.046 LE
495.26 266.698 LS
498.8 283.349 L
488.213 284.225 L
484.859 268.45 L
495.26 266.698 LE
498.8 283.349 LS
502.339 300 L
491.566 300 L
488.213 284.225 L
498.8 283.349 LE
474.8 221.126 LS
478.154 236.901 L
468.125 240.406 L
464.959 225.508 L
474.8 221.126 LE
478.154 236.901 LS
481.507 252.675 L
471.293 255.305 L
468.125 240.406 L
478.154 236.901 LE
481.507 252.675 LS
484.859 268.45 L
474.459 270.203 L
471.293 255.305 L
481.507 252.675 LE
484.859 268.45 LS
488.213 284.225 L
477.626 285.102 L
474.459 270.203 L
484.859 268.45 LE
488.213 284.225 LS
491.566 300 L
480.793 300 L
477.626 285.102 L
488.213 284.225 LE
464.959 225.508 LS
468.125 240.406 L
458.097 243.912 L
455.116 229.889 L
464.959 225.508 LE
468.125 240.406 LS
471.293 255.305 L
461.077 257.934 L
458.097 243.912 L
468.125 240.406 LE
471.293 255.305 LS
474.459 270.203 L
464.058 271.956 L
461.077 257.934 L
471.293 255.305 LE
474.459 270.203 LS
477.626 285.102 L
467.038 285.978 L
464.058 271.956 L
474.459 270.203 LE
477.626 285.102 LS
480.793 300 L
470.019 300 L
467.038 285.978 L
477.626 285.102 LE
455.116 229.889 LS
458.097 243.912 L
448.069 247.417 L
445.275 234.271 L
455.116 229.889 LE
458.097 243.912 LS
461.077 257.934 L
450.863 260.563 L
448.069 247.417 L
458.097 243.912 LE
461.077 257.934 LS
464.058 271.956 L
453.658 273.709 L
450.863 260.563 L
461.077 257.934 LE
464.058 271.956 LS
467.038 285.978 L
456.451 286.854 L
453.658 273.709 L
464.058 271.956 LE
467.038 285.978 LS
470.019 300 L
459.246 300 L
456.451 286.854 L
467.038 285.978 LE
445.275 234.271 LS
448.069 247.417 L
438.041 250.923 L
435.433 238.653 L
445.275 234.271 LE
448.069 247.417 LS
450.863 260.563 L
440.649 263.192 L
438.041 250.923 L
448.069 247.417 LE
450.863 260.563 LS
453.658 273.709 L
443.257 275.461 L
440.649 263.192 L
450.863 260.563 LE
453.658 273.709 LS
456.451 286.854 L
445.864 287.731 L
443.257 275.461 L
453.658 273.709 LE
456.451 286.854 LS
459.246 300 L
448.473 300 L
445.864 287.731 L
456.451 286.854 LE
435.433 238.653 LS
438.041 250.923 L
428.013 254.428 L
425.591 243.035 L
435.433 238.653 LE
438.041 250.923 LS
440.649 263.192 L
430.435 265.821 L
428.013 254.428 L
438.041 250.923 LE
440.649 263.192 LS
443.257 275.461 L
432.856 277.214 L
430.435 265.821 L
440.649 263.192 LE
443.257 275.461 LS
445.864 287.731 L
435.277 288.607 L
432.856 277.214 L
443.257 275.461 LE
445.864 287.731 LS
448.473 300 L
437.699 300 L
435.277 288.607 L
445.864 287.731 LE
425.591 243.035 LS
428.013 254.428 L
417.984 257.934 L
415.749 247.417 L
425.591 243.035 LE
428.013 254.428 LS
430.435 265.821 L
420.22 268.45 L
417.984 257.934 L
428.013 254.428 LE
430.435 265.821 LS
432.856 277.214 L
422.455 278.967 L
420.22 268.45 L
430.435 265.821 LE
432.856 277.214 LS
435.277 288.607 L
424.69 289.483 L
422.455 278.967 L
432.856 277.214 LE
435.277 288.607 LS
437.699 300 L
426.926 300 L
424.69 289.483 L
435.277 288.607 LE
415.749 247.417 LS
417.984 257.934 L
407.956 261.439 L
405.907 251.799 L
415.749 247.417 LE
417.984 257.934 LS
420.22 268.45 L
410.005 271.079 L
407.956 261.439 L
417.984 257.934 LE
420.22 268.45 LS
422.455 278.967 L
412.054 280.72 L
410.005 271.079 L
420.22 268.45 LE
422.455 278.967 LS
424.69 289.483 L
414.103 290.36 L
412.054 280.72 L
422.455 278.967 LE
424.69 289.483 LS
426.926 300 L
416.153 300 L
414.103 290.36 L
424.69 289.483 LE
405.907 251.799 LS
407.956 261.439 L
397.928 264.945 L
396.065 256.181 L
405.907 251.799 LE
407.956 261.439 LS
410.005 271.079 L
399.791 273.709 L
397.928 264.945 L
407.956 261.439 LE
410.005 271.079 LS
412.054 280.72 L
401.654 282.472 L
399.791 273.709 L
410.005 271.079 LE
412.054 280.72 LS
414.103 290.36 L
403.516 291.236 L
401.654 282.472 L
412.054 280.72 LE
414.103 290.36 LS
416.153 300 L
405.379 300 L
403.516 291.236 L
414.103 290.36 LE
369.734 219.939 LS
376.942 211.932 L
382.735 219.906 L
375 227.187 L
369.734 219.939 LE
376.942 211.932 LS
384.151 203.926 L
390.471 212.624 L
382.735 219.906 L
376.942 211.932 LE
384.151 203.926 LS
391.36 195.92 L
398.206 205.343 L
390.471 212.624 L
384.151 203.926 LE
391.36 195.92 LS
398.569 187.914 L
405.942 198.062 L
398.206 205.343 L
391.36 195.92 LE
398.569 187.914 LS
405.778 179.908 L
413.677 190.781 L
405.942 198.062 L
398.569 187.914 LE
405.778 179.908 LS
412.986 171.902 L
421.412 183.499 L
413.677 190.781 L
405.778 179.908 LE
412.986 171.902 LS
420.195 163.895 L
429.147 176.218 L
421.412 183.499 L
412.986 171.902 LE
420.195 163.895 LS
427.404 155.89 L
436.883 168.937 L
429.147 176.218 L
420.195 163.895 LE
427.404 155.89 LS
434.613 147.883 L
444.619 161.655 L
436.883 168.937 L
427.404 155.89 LE
434.613 147.883 LS
441.821 139.877 L
452.354 154.374 L
444.619 161.655 L
434.613 147.883 LE
375 227.187 LS
382.735 219.906 L
388.528 227.879 L
380.266 234.435 L
375 227.187 LE
382.735 219.906 LS
390.471 212.624 L
396.79 221.323 L
388.528 227.879 L
382.735 219.906 LE
390.471 212.624 LS
398.206 205.343 L
405.052 214.766 L
396.79 221.323 L
390.471 212.624 LE
398.206 205.343 LS
405.942 198.062 L
413.315 208.21 L
405.052 214.766 L
398.206 205.343 LE
405.942 198.062 LS
413.677 190.781 L
421.576 201.653 L
413.315 208.21 L
405.942 198.062 LE
413.677 190.781 LS
421.412 183.499 L
429.838 195.097 L
421.576 201.653 L
413.677 190.781 LE
421.412 183.499 LS
429.147 176.218 L
438.1 188.54 L
429.838 195.097 L
421.412 183.499 LE
429.147 176.218 LS
436.883 168.937 L
446.362 181.984 L
438.1 188.54 L
429.147 176.218 LE
436.883 168.937 LS
444.619 161.655 L
454.624 175.428 L
446.362 181.984 L
436.883 168.937 LE
444.619 161.655 LS
452.354 154.374 L
462.886 168.871 L
454.624 175.428 L
444.619 161.655 LE
380.266 234.435 LS
388.528 227.879 L
394.321 235.852 L
385.533 241.684 L
380.266 234.435 LE
388.528 227.879 LS
396.79 221.323 L
403.11 230.021 L
394.321 235.852 L
388.528 227.879 LE
396.79 221.323 LS
405.052 214.766 L
411.898 224.189 L
403.11 230.021 L
396.79 221.323 LE
405.052 214.766 LS
413.315 208.21 L
420.687 218.358 L
411.898 224.189 L
405.052 214.766 LE
413.315 208.21 LS
421.576 201.653 L
429.476 212.526 L
420.687 218.358 L
413.315 208.21 LE
421.576 201.653 LS
429.838 195.097 L
438.265 206.694 L
429.476 212.526 L
421.576 201.653 LE
429.838 195.097 LS
438.1 188.54 L
447.054 200.863 L
438.265 206.694 L
429.838 195.097 LE
438.1 188.54 LS
446.362 181.984 L
455.841 195.031 L
447.054 200.863 L
438.1 188.54 LE
446.362 181.984 LS
454.624 175.428 L
464.63 189.2 L
455.841 195.031 L
446.362 181.984 LE
454.624 175.428 LS
462.886 168.871 L
473.419 183.368 L
464.63 189.2 L
454.624 175.428 LE
385.533 241.684 LS
394.321 235.852 L
400.114 243.826 L
390.799 248.933 L
385.533 241.684 LE
394.321 235.852 LS
403.11 230.021 L
409.429 238.719 L
400.114 243.826 L
394.321 235.852 LE
403.11 230.021 LS
411.898 224.189 L
418.745 233.612 L
409.429 238.719 L
403.11 230.021 LE
411.898 224.189 LS
420.687 218.358 L
428.06 228.505 L
418.745 233.612 L
411.898 224.189 LE
420.687 218.358 LS
429.476 212.526 L
437.375 223.399 L
428.06 228.505 L
420.687 218.358 LE
429.476 212.526 LS
438.265 206.694 L
446.691 218.292 L
437.375 223.399 L
429.476 212.526 LE
438.265 206.694 LS
447.054 200.863 L
456.006 213.185 L
446.691 218.292 L
438.265 206.694 LE
447.054 200.863 LS
455.841 195.031 L
465.321 208.078 L
456.006 213.185 L
447.054 200.863 LE
455.841 195.031 LS
464.63 189.2 L
474.637 202.972 L
465.321 208.078 L
455.841 195.031 LE
464.63 189.2 LS
473.419 183.368 L
483.951 197.865 L
474.637 202.972 L
464.63 189.2 LE
390.799 248.933 LS
400.114 243.826 L
405.907 251.799 L
396.065 256.181 L
390.799 248.933 LE
400.114 243.826 LS
409.429 238.719 L
415.749 247.417 L
405.907 251.799 L
400.114 243.826 LE
409.429 238.719 LS
418.745 233.612 L
425.591 243.035 L
415.749 247.417 L
409.429 238.719 LE
418.745 233.612 LS
428.06 228.505 L
435.433 238.653 L
425.591 243.035 L
418.745 233.612 LE
428.06 228.505 LS
437.375 223.399 L
445.275 234.271 L
435.433 238.653 L
428.06 228.505 LE
437.375 223.399 LS
446.691 218.292 L
455.116 229.889 L
445.275 234.271 L
437.375 223.399 LE
446.691 218.292 LS
456.006 213.185 L
464.959 225.508 L
455.116 229.889 L
446.691 218.292 LE
456.006 213.185 LS
465.321 208.078 L
474.8 221.126 L
464.959 225.508 L
456.006 213.185 LE
465.321 208.078 LS
474.637 202.972 L
484.643 216.744 L
474.8 221.126 L
465.321 208.078 LE
474.637 202.972 LS
483.951 197.865 L
494.484 212.362 L
484.643 216.744 L
474.637 202.972 LE
330.937 197.54 LS
334.267 187.294 L
342.802 192.222 L
338.697 202.019 L
330.937 197.54 LE
334.267 187.294 LS
337.596 177.047 L
346.907 182.423 L
342.802 192.222 L
334.267 187.294 LE
337.596 177.047 LS
340.925 166.802 L
351.012 172.625 L
346.907 182.423 L
337.596 177.047 LE
340.925 166.802 LS
344.254 156.555 L
355.117 162.828 L
351.012 172.625 L
340.925 166.802 LE
344.254 156.555 LS
347.583 146.31 L
359.222 153.029 L
355.117 162.828 L
344.254 156.555 LE
347.583 146.31 LS
350.912 136.063 L
363.327 143.231 L
359.222 153.029 L
347.583 146.31 LE
350.912 136.063 LS
354.241 125.817 L
367.432 133.433 L
363.327 143.231 L
350.912 136.063 LE
354.241 125.817 LS
357.571 115.571 L
371.537 123.635 L
367.432 133.433 L
354.241 125.817 LE
357.571 115.571 LS
360.9 105.325 L
375.642 113.837 L
371.537 123.635 L
357.571 115.571 LE
360.9 105.325 LS
364.229 95.0796 L
379.747 104.039 L
375.642 113.837 L
360.9 105.325 LE
338.697 202.019 LS
342.802 192.222 L
351.337 197.149 L
346.456 206.499 L
338.697 202.019 LE
342.802 192.222 LS
346.907 182.423 L
356.218 187.799 L
351.337 197.149 L
342.802 192.222 LE
346.907 182.423 LS
351.012 172.625 L
361.099 178.449 L
356.218 187.799 L
346.907 182.423 LE
351.012 172.625 LS
355.117 162.828 L
365.98 169.099 L
361.099 178.449 L
351.012 172.625 LE
355.117 162.828 LS
359.222 153.029 L
370.861 159.749 L
365.98 169.099 L
355.117 162.828 LE
359.222 153.029 LS
363.327 143.231 L
375.742 150.398 L
370.861 159.749 L
359.222 153.029 LE
363.327 143.231 LS
367.432 133.433 L
380.623 141.048 L
375.742 150.398 L
363.327 143.231 LE
367.432 133.433 LS
371.537 123.635 L
385.504 131.698 L
380.623 141.048 L
367.432 133.433 LE
371.537 123.635 LS
375.642 113.837 L
390.385 122.349 L
385.504 131.698 L
371.537 123.635 LE
375.642 113.837 LS
379.747 104.039 L
395.266 112.999 L
390.385 122.349 L
375.642 113.837 LE
346.456 206.499 LS
351.337 197.149 L
359.872 202.077 L
354.215 210.979 L
346.456 206.499 LE
351.337 197.149 LS
356.218 187.799 L
365.529 193.175 L
359.872 202.077 L
351.337 197.149 LE
356.218 187.799 LS
361.099 178.449 L
371.186 184.273 L
365.529 193.175 L
356.218 187.799 LE
361.099 178.449 LS
365.98 169.099 L
376.843 175.371 L
371.186 184.273 L
361.099 178.449 LE
365.98 169.099 LS
370.861 159.749 L
382.5 166.469 L
376.843 175.371 L
365.98 169.099 LE
370.861 159.749 LS
375.742 150.398 L
388.157 157.566 L
382.5 166.469 L
370.861 159.749 LE
375.742 150.398 LS
380.623 141.048 L
393.814 148.664 L
388.157 157.566 L
375.742 150.398 LE
380.623 141.048 LS
385.504 131.698 L
399.47 139.762 L
393.814 148.664 L
380.623 141.048 LE
385.504 131.698 LS
390.385 122.349 L
405.127 130.86 L
399.47 139.762 L
385.504 131.698 LE
390.385 122.349 LS
395.266 112.999 L
410.784 121.958 L
405.127 130.86 L
390.385 122.349 LE
354.215 210.979 LS
359.872 202.077 L
368.407 207.005 L
361.974 215.459 L
354.215 210.979 LE
359.872 202.077 LS
365.529 193.175 L
374.84 198.551 L
368.407 207.005 L
359.872 202.077 LE
365.529 193.175 LS
371.186 184.273 L
381.273 190.096 L
374.84 198.551 L
365.529 193.175 LE
371.186 184.273 LS
376.843 175.371 L
387.706 181.642 L
381.273 190.096 L
371.186 184.273 LE
376.843 175.371 LS
382.5 166.469 L
394.139 173.188 L
387.706 181.642 L
376.843 175.371 LE
382.5 166.469 LS
388.157 157.566 L
400.571 164.734 L
394.139 173.188 L
382.5 166.469 LE
388.157 157.566 LS
393.814 148.664 L
407.004 156.28 L
400.571 164.734 L
388.157 157.566 LE
393.814 148.664 LS
399.47 139.762 L
413.437 147.826 L
407.004 156.28 L
393.814 148.664 LE
399.47 139.762 LS
405.127 130.86 L
419.869 139.372 L
413.437 147.826 L
399.47 139.762 LE
405.127 130.86 LS
410.784 121.958 L
426.303 130.918 L
419.869 139.372 L
405.127 130.86 LE
361.974 215.459 LS
368.407 207.005 L
376.942 211.932 L
369.734 219.939 L
361.974 215.459 LE
368.407 207.005 LS
374.84 198.551 L
384.151 203.926 L
376.942 211.932 L
368.407 207.005 LE
374.84 198.551 LS
381.273 190.096 L
391.36 195.92 L
384.151 203.926 L
374.84 198.551 LE
381.273 190.096 LS
387.706 181.642 L
398.569 187.914 L
391.36 195.92 L
381.273 190.096 LE
387.706 181.642 LS
394.139 173.188 L
405.778 179.908 L
398.569 187.914 L
387.706 181.642 LE
394.139 173.188 LS
400.571 164.734 L
412.986 171.902 L
405.778 179.908 L
394.139 173.188 LE
400.571 164.734 LS
407.004 156.28 L
420.195 163.895 L
412.986 171.902 L
400.571 164.734 LE
407.004 156.28 LS
413.437 147.826 L
427.404 155.89 L
420.195 163.895 L
407.004 156.28 LE
413.437 147.826 LS
419.869 139.372 L
434.613 147.883 L
427.404 155.89 L
413.437 147.826 LE
419.869 139.372 LS
426.303 130.918 L
441.821 139.877 L
434.613 147.883 L
419.869 139.372 LE
286.385 192.857 LS
285.259 182.143 L
295.06 183.173 L
295.295 193.793 L
286.385 192.857 LE
285.259 182.143 LS
284.133 171.428 L
294.825 172.553 L
295.06 183.173 L
285.259 182.143 LE
284.133 171.428 LS
283.007 160.714 L
294.59 161.931 L
294.825 172.553 L
284.133 171.428 LE
283.007 160.714 LS
281.88 150 L
294.355 151.311 L
294.59 161.931 L
283.007 160.714 LE
281.88 150 LS
280.754 139.286 L
294.12 140.691 L
294.355 151.311 L
281.88 150 LE
280.754 139.286 LS
279.628 128.571 L
293.885 130.069 L
294.12 140.691 L
280.754 139.286 LE
279.628 128.571 LS
278.502 117.856 L
293.65 119.449 L
293.885 130.069 L
279.628 128.571 LE
278.502 117.856 LS
277.376 107.142 L
293.415 108.828 L
293.65 119.449 L
278.502 117.856 LE
277.376 107.142 LS
276.25 96.4284 L
293.18 98.2081 L
293.415 108.828 L
277.376 107.142 LE
276.25 96.4284 LS
275.124 85.7143 L
292.945 87.5867 L
293.18 98.2081 L
276.25 96.4284 LE
295.295 193.793 LS
295.06 183.173 L
304.862 184.203 L
304.206 194.73 L
295.295 193.793 LE
295.06 183.173 LS
294.825 172.553 L
305.518 173.676 L
304.862 184.203 L
295.06 183.173 LE
294.825 172.553 LS
294.59 161.931 L
306.174 163.149 L
305.518 173.676 L
294.825 172.553 LE
294.59 161.931 LS
294.355 151.311 L
306.83 152.622 L
306.174 163.149 L
294.59 161.931 LE
294.355 151.311 LS
294.12 140.691 L
307.486 142.095 L
306.83 152.622 L
294.355 151.311 LE
294.12 140.691 LS
293.885 130.069 L
308.142 131.568 L
307.486 142.095 L
294.12 140.691 LE
293.885 130.069 LS
293.65 119.449 L
308.798 121.041 L
308.142 131.568 L
293.885 130.069 LE
293.65 119.449 LS
293.415 108.828 L
309.454 110.514 L
308.798 121.041 L
293.65 119.449 LE
293.415 108.828 LS
293.18 98.2081 L
310.11 99.9868 L
309.454 110.514 L
293.415 108.828 LE
293.18 98.2081 LS
292.945 87.5867 L
310.766 89.4602 L
310.11 99.9868 L
293.18 98.2081 LE
304.206 194.73 LS
304.862 184.203 L
314.663 185.233 L
313.116 195.667 L
304.206 194.73 LE
304.862 184.203 LS
305.518 173.676 L
316.211 174.8 L
314.663 185.233 L
304.862 184.203 LE
305.518 173.676 LS
306.174 163.149 L
317.757 164.366 L
316.211 174.8 L
305.518 173.676 LE
306.174 163.149 LS
306.83 152.622 L
319.305 153.933 L
317.757 164.366 L
306.174 163.149 LE
306.83 152.622 LS
307.486 142.095 L
320.852 143.5 L
319.305 153.933 L
306.83 152.622 LE
307.486 142.095 LS
308.142 131.568 L
322.399 133.066 L
320.852 143.5 L
307.486 142.095 LE
308.142 131.568 LS
308.798 121.041 L
323.946 122.633 L
322.399 133.066 L
308.142 131.568 LE
308.798 121.041 LS
309.454 110.514 L
325.493 112.199 L
323.946 122.633 L
308.798 121.041 LE
309.454 110.514 LS
310.11 99.9868 L
327.04 101.767 L
325.493 112.199 L
309.454 110.514 LE
310.11 99.9868 LS
310.766 89.4602 L
328.587 91.3326 L
327.04 101.767 L
310.11 99.9868 LE
313.116 195.667 LS
314.663 185.233 L
324.465 186.264 L
322.027 196.603 L
313.116 195.667 LE
314.663 185.233 LS
316.211 174.8 L
326.903 175.924 L
324.465 186.264 L
314.663 185.233 LE
316.211 174.8 LS
317.757 164.366 L
329.341 165.584 L
326.903 175.924 L
316.211 174.8 LE
317.757 164.366 LS
319.305 153.933 L
331.779 155.244 L
329.341 165.584 L
317.757 164.366 LE
319.305 153.933 LS
320.852 143.5 L
334.217 144.905 L
331.779 155.244 L
319.305 153.933 LE
320.852 143.5 LS
322.399 133.066 L
336.655 134.565 L
334.217 144.905 L
320.852 143.5 LE
322.399 133.066 LS
323.946 122.633 L
339.093 124.226 L
336.655 134.565 L
322.399 133.066 LE
323.946 122.633 LS
325.493 112.199 L
341.532 113.885 L
339.093 124.226 L
323.946 122.633 LE
325.493 112.199 LS
327.04 101.767 L
343.97 103.546 L
341.532 113.885 L
325.493 112.199 LE
327.04 101.767 LS
328.587 91.3326 L
346.408 93.2061 L
343.97 103.546 L
327.04 101.767 LE
322.027 196.603 LS
324.465 186.264 L
334.267 187.294 L
330.937 197.54 L
322.027 196.603 LE
324.465 186.264 LS
326.903 175.924 L
337.596 177.047 L
334.267 187.294 L
324.465 186.264 LE
326.903 175.924 LS
329.341 165.584 L
340.925 166.802 L
337.596 177.047 L
326.903 175.924 LE
329.341 165.584 LS
331.779 155.244 L
344.254 156.555 L
340.925 166.802 L
329.341 165.584 LE
331.779 155.244 LS
334.217 144.905 L
347.583 146.31 L
344.254 156.555 L
331.779 155.244 LE
334.217 144.905 LS
336.655 134.565 L
350.912 136.063 L
347.583 146.31 L
334.217 144.905 LE
336.655 134.565 LS
339.093 124.226 L
354.241 125.817 L
350.912 136.063 L
336.655 134.565 LE
339.093 124.226 LS
341.532 113.885 L
357.571 115.571 L
354.241 125.817 L
339.093 124.226 LE
341.532 113.885 LS
343.97 103.546 L
360.9 105.325 L
357.571 115.571 L
341.532 113.885 LE
343.97 103.546 LS
346.408 93.2061 L
364.229 95.0796 L
360.9 105.325 L
343.97 103.546 LE
243.779 206.7 LS
238.393 197.37 L
247.766 194.325 L
252.3 203.932 L
243.779 206.7 LE
238.393 197.37 LS
233.006 188.04 L
243.231 184.718 L
247.766 194.325 L
238.393 197.37 LE
233.006 188.04 LS
227.619 178.711 L
238.697 175.111 L
243.231 184.718 L
233.006 188.04 LE
227.619 178.711 LS
222.233 169.38 L
234.162 165.505 L
238.697 175.111 L
227.619 178.711 LE
222.233 169.38 LS
216.846 160.05 L
229.628 155.897 L
234.162 165.505 L
222.233 169.38 LE
216.846 160.05 LS
211.459 150.721 L
225.093 146.291 L
229.628 155.897 L
216.846 160.05 LE
211.459 150.721 LS
206.073 141.391 L
220.559 136.684 L
225.093 146.291 L
211.459 150.721 LE
206.073 141.391 LS
200.686 132.06 L
216.024 127.077 L
220.559 136.684 L
206.073 141.391 LE
200.686 132.06 LS
195.299 122.73 L
211.49 117.47 L
216.024 127.077 L
200.686 132.06 LE
195.299 122.73 LS
189.913 113.401 L
206.955 107.863 L
211.49 117.47 L
195.299 122.73 LE
252.3 203.932 LS
247.766 194.325 L
257.139 191.279 L
260.822 201.163 L
252.3 203.932 LE
247.766 194.325 LS
243.231 184.718 L
253.457 181.395 L
257.139 191.279 L
247.766 194.325 LE
243.231 184.718 LS
238.697 175.111 L
249.774 171.512 L
253.457 181.395 L
243.231 184.718 LE
238.697 175.111 LS
234.162 165.505 L
246.092 161.629 L
249.774 171.512 L
238.697 175.111 LE
234.162 165.505 LS
229.628 155.897 L
242.409 151.744 L
246.092 161.629 L
234.162 165.505 LE
229.628 155.897 LS
225.093 146.291 L
238.727 141.861 L
242.409 151.744 L
229.628 155.897 LE
225.093 146.291 LS
220.559 136.684 L
235.045 131.977 L
238.727 141.861 L
225.093 146.291 LE
220.559 136.684 LS
216.024 127.077 L
231.362 122.094 L
235.045 131.977 L
220.559 136.684 LE
216.024 127.077 LS
211.49 117.47 L
227.68 112.209 L
231.362 122.094 L
216.024 127.077 LE
211.49 117.47 LS
206.955 107.863 L
223.997 102.326 L
227.68 112.209 L
211.49 117.47 LE
260.822 201.163 LS
257.139 191.279 L
266.512 188.233 L
269.343 198.394 L
260.822 201.163 LE
257.139 191.279 LS
253.457 181.395 L
263.682 178.073 L
266.512 188.233 L
257.139 191.279 LE
253.457 181.395 LS
249.774 171.512 L
260.852 167.913 L
263.682 178.073 L
253.457 181.395 LE
249.774 171.512 LS
246.092 161.629 L
258.021 157.752 L
260.852 167.913 L
249.774 171.512 LE
246.092 161.629 LS
242.409 151.744 L
255.191 147.592 L
258.021 157.752 L
246.092 161.629 LE
242.409 151.744 LS
238.727 141.861 L
252.361 137.431 L
255.191 147.592 L
242.409 151.744 LE
238.727 141.861 LS
235.045 131.977 L
249.53 127.27 L
252.361 137.431 L
238.727 141.861 LE
235.045 131.977 LS
231.362 122.094 L
246.7 117.11 L
249.53 127.27 L
235.045 131.977 LE
231.362 122.094 LS
227.68 112.209 L
243.87 106.95 L
246.7 117.11 L
231.362 122.094 LE
227.68 112.209 LS
223.997 102.326 L
241.039 96.7882 L
243.87 106.95 L
227.68 112.209 LE
269.343 198.394 LS
266.512 188.233 L
275.886 185.189 L
277.864 195.626 L
269.343 198.394 LE
266.512 188.233 LS
263.682 178.073 L
273.907 174.75 L
275.886 185.189 L
266.512 188.233 LE
263.682 178.073 LS
260.852 167.913 L
271.929 164.313 L
273.907 174.75 L
263.682 178.073 LE
260.852 167.913 LS
258.021 157.752 L
269.951 153.876 L
271.929 164.313 L
260.852 167.913 LE
258.021 157.752 LS
255.191 147.592 L
267.973 143.439 L
269.951 153.876 L
258.021 157.752 LE
255.191 147.592 LS
252.361 137.431 L
265.994 133.001 L
267.973 143.439 L
255.191 147.592 LE
252.361 137.431 LS
249.53 127.27 L
264.016 122.563 L
265.994 133.001 L
252.361 137.431 LE
249.53 127.27 LS
246.7 117.11 L
262.038 112.126 L
264.016 122.563 L
249.53 127.27 LE
246.7 117.11 LS
243.87 106.95 L
260.06 101.689 L
262.038 112.126 L
246.7 117.11 LE
243.87 106.95 LS
241.039 96.7882 L
258.081 91.2507 L
260.06 101.689 L
243.87 106.95 LE
277.864 195.626 LS
275.886 185.189 L
285.259 182.143 L
286.385 192.857 L
277.864 195.626 LE
275.886 185.189 LS
273.907 174.75 L
284.133 171.428 L
285.259 182.143 L
275.886 185.189 LE
273.907 174.75 LS
271.929 164.313 L
283.007 160.714 L
284.133 171.428 L
273.907 174.75 LE
271.929 164.313 LS
269.951 153.876 L
281.88 150 L
283.007 160.714 L
271.929 164.313 LE
269.951 153.876 LS
267.973 143.439 L
280.754 139.286 L
281.88 150 L
269.951 153.876 LE
267.973 143.439 LS
265.994 133.001 L
279.628 128.571 L
280.754 139.286 L
267.973 143.439 LE
265.994 133.001 LS
264.016 122.563 L
278.502 117.856 L
279.628 128.571 L
265.994 133.001 LE
264.016 122.563 LS
262.038 112.126 L
277.376 107.142 L
278.502 117.856 L
264.016 122.563 LE
262.038 112.126 LS
260.06 101.689 L
276.25 96.4284 L
277.376 107.142 L
262.038 112.126 LE
260.06 101.689 LS
258.081 91.2507 L
275.124 85.7143 L
276.25 96.4284 L
260.06 101.689 LE
210.488 236.676 LS
201.772 230.344 L
209.096 223.749 L
217.146 230.681 L
210.488 236.676 LE
201.772 230.344 LS
193.056 224.011 L
201.046 216.817 L
209.096 223.749 L
201.772 230.344 LE
193.056 224.011 LS
184.341 217.679 L
192.996 209.885 L
201.046 216.817 L
193.056 224.011 LE
184.341 217.679 LS
175.625 211.346 L
184.946 202.953 L
192.996 209.885 L
184.341 217.679 LE
175.625 211.346 LS
166.909 205.014 L
176.896 196.021 L
184.946 202.953 L
175.625 211.346 LE
166.909 205.014 LS
158.193 198.682 L
168.847 189.09 L
176.896 196.021 L
166.909 205.014 LE
158.193 198.682 LS
149.477 192.349 L
160.797 182.157 L
168.847 189.09 L
158.193 198.682 LE
149.477 192.349 LS
140.762 186.017 L
152.747 175.226 L
160.797 182.157 L
149.477 192.349 LE
140.762 186.017 LS
132.046 179.685 L
144.696 168.294 L
152.747 175.226 L
140.762 186.017 LE
132.046 179.685 LS
123.33 173.352 L
136.646 161.361 L
144.696 168.294 L
132.046 179.685 LE
217.146 230.681 LS
209.096 223.749 L
216.42 217.154 L
223.805 224.686 L
217.146 230.681 LE
209.096 223.749 LS
201.046 216.817 L
209.036 209.623 L
216.42 217.154 L
209.096 223.749 LE
201.046 216.817 LS
192.996 209.885 L
201.652 202.091 L
209.036 209.623 L
201.046 216.817 LE
192.996 209.885 LS
184.946 202.953 L
194.268 194.56 L
201.652 202.091 L
192.996 209.885 LE
184.946 202.953 LS
176.896 196.021 L
186.883 187.029 L
194.268 194.56 L
184.946 202.953 LE
176.896 196.021 LS
168.847 189.09 L
179.499 179.497 L
186.883 187.029 L
176.896 196.021 LE
168.847 189.09 LS
160.797 182.157 L
172.115 171.966 L
179.499 179.497 L
168.847 189.09 LE
160.797 182.157 LS
152.747 175.226 L
164.731 164.434 L
172.115 171.966 L
160.797 182.157 LE
152.747 175.226 LS
144.696 168.294 L
157.347 156.903 L
164.731 164.434 L
152.747 175.226 LE
144.696 168.294 LS
136.646 161.361 L
149.963 149.372 L
157.347 156.903 L
144.696 168.294 LE
223.805 224.686 LS
216.42 217.154 L
223.745 210.56 L
230.463 218.691 L
223.805 224.686 LE
216.42 217.154 LS
209.036 209.623 L
217.026 202.429 L
223.745 210.56 L
216.42 217.154 LE
209.036 209.623 LS
201.652 202.091 L
210.308 194.298 L
217.026 202.429 L
209.036 209.623 LE
201.652 202.091 LS
194.268 194.56 L
203.59 186.167 L
210.308 194.298 L
201.652 202.091 LE
194.268 194.56 LS
186.883 187.029 L
196.871 178.036 L
203.59 186.167 L
194.268 194.56 LE
186.883 187.029 LS
179.499 179.497 L
190.153 169.905 L
196.871 178.036 L
186.883 187.029 LE
179.499 179.497 LS
172.115 171.966 L
183.435 161.774 L
190.153 169.905 L
179.499 179.497 LE
172.115 171.966 LS
164.731 164.434 L
176.717 153.643 L
183.435 161.774 L
172.115 171.966 LE
164.731 164.434 LS
157.347 156.903 L
169.998 145.512 L
176.717 153.643 L
164.731 164.434 LE
157.347 156.903 LS
149.963 149.372 L
163.28 137.381 L
169.998 145.512 L
157.347 156.903 LE
230.463 218.691 LS
223.745 210.56 L
231.069 203.965 L
237.121 212.695 L
230.463 218.691 LE
223.745 210.56 LS
217.026 202.429 L
225.016 195.234 L
231.069 203.965 L
223.745 210.56 LE
217.026 202.429 LS
210.308 194.298 L
218.964 186.504 L
225.016 195.234 L
217.026 202.429 LE
210.308 194.298 LS
203.59 186.167 L
212.911 177.773 L
218.964 186.504 L
210.308 194.298 LE
203.59 186.167 LS
196.871 178.036 L
206.859 169.043 L
212.911 177.773 L
203.59 186.167 LE
196.871 178.036 LS
190.153 169.905 L
200.806 160.313 L
206.859 169.043 L
196.871 178.036 LE
190.153 169.905 LS
183.435 161.774 L
194.754 151.582 L
200.806 160.313 L
190.153 169.905 LE
183.435 161.774 LS
176.717 153.643 L
188.701 142.852 L
194.754 151.582 L
183.435 161.774 LE
176.717 153.643 LS
169.998 145.512 L
182.648 134.121 L
188.701 142.852 L
176.717 153.643 LE
169.998 145.512 LS
163.28 137.381 L
176.596 125.391 L
182.648 134.121 L
169.998 145.512 LE
237.121 212.695 LS
231.069 203.965 L
238.393 197.37 L
243.779 206.7 L
237.121 212.695 LE
231.069 203.965 LS
225.016 195.234 L
233.006 188.04 L
238.393 197.37 L
231.069 203.965 LE
225.016 195.234 LS
218.964 186.504 L
227.619 178.711 L
233.006 188.04 L
225.016 195.234 LE
218.964 186.504 LS
212.911 177.773 L
222.233 169.38 L
227.619 178.711 L
218.964 186.504 LE
212.911 177.773 LS
206.859 169.043 L
216.846 160.05 L
222.233 169.38 L
212.911 177.773 LE
206.859 169.043 LS
200.806 160.313 L
211.459 150.721 L
216.846 160.05 L
206.859 169.043 LE
200.806 160.313 LS
194.754 151.582 L
206.073 141.391 L
211.459 150.721 L
200.806 160.313 LE
194.754 151.582 LS
188.701 142.852 L
200.686 132.06 L
206.073 141.391 L
194.754 151.582 LE
188.701 142.852 LS
182.648 134.121 L
195.299 122.73 L
200.686 132.06 L
188.701 142.852 LE
182.648 134.121 LS
176.596 125.391 L
189.913 113.401 L
195.299 122.73 L
182.648 134.121 LE
192.267 277.601 LS
181.729 275.361 L
185.738 266.358 L
195.911 269.416 L
192.267 277.601 LE
181.729 275.361 LS
171.191 273.121 L
175.564 263.299 L
185.738 266.358 L
181.729 275.361 LE
171.191 273.121 LS
160.654 270.881 L
165.391 260.241 L
175.564 263.299 L
171.191 273.121 LE
160.654 270.881 LS
150.115 268.641 L
155.217 257.182 L
165.391 260.241 L
160.654 270.881 LE
150.115 268.641 LS
139.578 266.401 L
145.044 254.124 L
155.217 257.182 L
150.115 268.641 LE
139.578 266.401 LS
129.039 264.162 L
134.871 251.066 L
145.044 254.124 L
139.578 266.401 LE
129.039 264.162 LS
118.502 261.922 L
124.696 248.007 L
134.871 251.066 L
129.039 264.162 LE
118.502 261.922 LS
107.963 259.682 L
114.523 244.949 L
124.696 248.007 L
118.502 261.922 LE
107.963 259.682 LS
97.426 257.442 L
104.35 241.89 L
114.523 244.949 L
107.963 259.682 LE
97.426 257.442 LS
86.8875 255.202 L
94.1767 238.832 L
104.35 241.89 L
97.426 257.442 LE
195.911 269.416 LS
185.738 266.358 L
189.747 257.354 L
199.555 261.231 L
195.911 269.416 LE
185.738 266.358 LS
175.564 263.299 L
179.938 253.477 L
189.747 257.354 L
185.738 266.358 LE
175.564 263.299 LS
165.391 260.241 L
170.129 249.6 L
179.938 253.477 L
175.564 263.299 LE
165.391 260.241 LS
155.217 257.182 L
160.32 245.723 L
170.129 249.6 L
165.391 260.241 LE
155.217 257.182 LS
145.044 254.124 L
150.51 241.846 L
160.32 245.723 L
155.217 257.182 LE
145.044 254.124 LS
134.871 251.066 L
140.701 237.97 L
150.51 241.846 L
145.044 254.124 LE
134.871 251.066 LS
124.696 248.007 L
130.892 234.093 L
140.701 237.97 L
134.871 251.066 LE
124.696 248.007 LS
114.523 244.949 L
121.083 230.216 L
130.892 234.093 L
124.696 248.007 LE
114.523 244.949 LS
104.35 241.89 L
111.274 226.339 L
121.083 230.216 L
114.523 244.949 LE
104.35 241.89 LS
94.1767 238.832 L
101.465 222.462 L
111.274 226.339 L
104.35 241.89 LE
199.555 261.231 LS
189.747 257.354 L
193.755 248.351 L
203.2 253.046 L
199.555 261.231 LE
189.747 257.354 LS
179.938 253.477 L
184.311 243.655 L
193.755 248.351 L
189.747 257.354 LE
179.938 253.477 LS
170.129 249.6 L
174.866 238.96 L
184.311 243.655 L
179.938 253.477 LE
170.129 249.6 LS
160.32 245.723 L
165.421 234.264 L
174.866 238.96 L
170.129 249.6 LE
160.32 245.723 LS
150.51 241.846 L
155.977 229.569 L
165.421 234.264 L
160.32 245.723 LE
150.51 241.846 LS
140.701 237.97 L
146.532 224.874 L
155.977 229.569 L
150.51 241.846 LE
140.701 237.97 LS
130.892 234.093 L
137.087 220.178 L
146.532 224.874 L
140.701 237.97 LE
130.892 234.093 LS
121.083 230.216 L
127.643 215.483 L
137.087 220.178 L
130.892 234.093 LE
121.083 230.216 LS
111.274 226.339 L
118.198 210.787 L
127.643 215.483 L
121.083 230.216 LE
111.274 226.339 LS
101.465 222.462 L
108.753 206.092 L
118.198 210.787 L
111.274 226.339 LE
203.2 253.046 LS
193.755 248.351 L
197.764 239.347 L
206.844 244.861 L
203.2 253.046 LE
193.755 248.351 LS
184.311 243.655 L
188.684 233.833 L
197.764 239.347 L
193.755 248.351 LE
184.311 243.655 LS
174.866 238.96 L
179.603 228.319 L
188.684 233.833 L
184.311 243.655 LE
174.866 238.96 LS
165.421 234.264 L
170.523 222.805 L
179.603 228.319 L
174.866 238.96 LE
165.421 234.264 LS
155.977 229.569 L
161.443 217.291 L
170.523 222.805 L
165.421 234.264 LE
155.977 229.569 LS
146.532 224.874 L
152.362 211.778 L
161.443 217.291 L
155.977 229.569 LE
146.532 224.874 LS
137.087 220.178 L
143.283 206.264 L
152.362 211.778 L
146.532 224.874 LE
137.087 220.178 LS
127.643 215.483 L
134.202 200.75 L
143.283 206.264 L
137.087 220.178 LE
127.643 215.483 LS
118.198 210.787 L
125.122 195.236 L
134.202 200.75 L
127.643 215.483 LE
118.198 210.787 LS
108.753 206.092 L
116.041 189.722 L
125.122 195.236 L
118.198 210.787 LE
206.844 244.861 LS
197.764 239.347 L
201.772 230.344 L
210.488 236.676 L
206.844 244.861 LE
197.764 239.347 LS
188.684 233.833 L
193.056 224.011 L
201.772 230.344 L
197.764 239.347 LE
188.684 233.833 LS
179.603 228.319 L
184.341 217.679 L
193.056 224.011 L
188.684 233.833 LE
179.603 228.319 LS
170.523 222.805 L
175.625 211.346 L
184.341 217.679 L
179.603 228.319 LE
170.523 222.805 LS
161.443 217.291 L
166.909 205.014 L
175.625 211.346 L
170.523 222.805 LE
161.443 217.291 LS
152.362 211.778 L
158.193 198.682 L
166.909 205.014 L
161.443 217.291 LE
152.362 211.778 LS
143.283 206.264 L
149.477 192.349 L
158.193 198.682 L
152.362 211.778 LE
143.283 206.264 LS
134.202 200.75 L
140.762 186.017 L
149.477 192.349 L
143.283 206.264 LE
134.202 200.75 LS
125.122 195.236 L
132.046 179.685 L
140.762 186.017 L
134.202 200.75 LE
125.122 195.236 LS
116.041 189.722 L
123.33 173.352 L
132.046 179.685 L
125.122 195.236 LE
192.267 322.399 LS
181.729 324.639 L
181.729 314.783 L
192.267 313.439 L
192.267 322.399 LE
181.729 324.639 LS
171.191 326.879 L
171.191 316.127 L
181.729 314.783 L
181.729 324.639 LE
171.191 326.879 LS
160.654 329.119 L
160.654 317.471 L
171.191 316.127 L
171.191 326.879 LE
160.654 329.119 LS
150.115 331.359 L
150.115 318.815 L
160.654 317.471 L
160.654 329.119 LE
150.115 331.359 LS
139.578 333.599 L
139.578 320.159 L
150.115 318.815 L
150.115 331.359 LE
139.578 333.599 LS
129.039 335.838 L
129.039 321.503 L
139.578 320.159 L
139.578 333.599 LE
129.039 335.838 LS
118.502 338.078 L
118.502 322.847 L
129.039 321.503 L
129.039 335.838 LE
118.502 338.078 LS
107.963 340.318 L
107.963 324.191 L
118.502 322.847 L
118.502 338.078 LE
107.963 340.318 LS
97.426 342.558 L
97.426 325.535 L
107.963 324.191 L
107.963 340.318 LE
97.426 342.558 LS
86.8875 344.798 L
86.8875 326.879 L
97.426 325.535 L
97.426 342.558 LE
192.267 313.439 LS
181.729 314.783 L
181.729 304.928 L
192.267 304.48 L
192.267 313.439 LE
181.729 314.783 LS
171.191 316.127 L
171.191 305.376 L
181.729 304.928 L
181.729 314.783 LE
171.191 316.127 LS
160.654 317.471 L
160.654 305.824 L
171.191 305.376 L
171.191 316.127 LE
160.654 317.471 LS
150.115 318.815 L
150.115 306.272 L
160.654 305.824 L
160.654 317.471 LE
150.115 318.815 LS
139.578 320.159 L
139.578 306.72 L
150.115 306.272 L
150.115 318.815 LE
139.578 320.159 LS
129.039 321.503 L
129.039 307.168 L
139.578 306.72 L
139.578 320.159 LE
129.039 321.503 LS
118.502 322.847 L
118.502 307.616 L
129.039 307.168 L
129.039 321.503 LE
118.502 322.847 LS
107.963 324.191 L
107.963 308.064 L
118.502 307.616 L
118.502 322.847 LE
107.963 324.191 LS
97.426 325.535 L
97.426 308.512 L
107.963 308.064 L
107.963 324.191 LE
97.426 325.535 LS
86.8875 326.879 L
86.8875 308.96 L
97.426 308.512 L
97.426 325.535 LE
192.267 304.48 LS
181.729 304.928 L
181.729 295.072 L
192.267 295.52 L
192.267 304.48 LE
181.729 304.928 LS
171.191 305.376 L
171.191 294.624 L
181.729 295.072 L
181.729 304.928 LE
171.191 305.376 LS
160.654 305.824 L
160.654 294.176 L
171.191 294.624 L
171.191 305.376 LE
160.654 305.824 LS
150.115 306.272 L
150.115 293.728 L
160.654 294.176 L
160.654 305.824 LE
150.115 306.272 LS
139.578 306.72 L
139.578 293.28 L
150.115 293.728 L
150.115 306.272 LE
139.578 306.72 LS
129.039 307.168 L
129.039 292.832 L
139.578 293.28 L
139.578 306.72 LE
129.039 307.168 LS
118.502 307.616 L
118.502 292.384 L
129.039 292.832 L
129.039 307.168 LE
118.502 307.616 LS
107.963 308.064 L
107.963 291.936 L
118.502 292.384 L
118.502 307.616 LE
107.963 308.064 LS
97.426 308.512 L
97.426 291.488 L
107.963 291.936 L
107.963 308.064 LE
97.426 308.512 LS
86.8875 308.96 L
86.8875 291.04 L
97.426 291.488 L
97.426 308.512 LE
192.267 295.52 LS
181.729 295.072 L
181.729 285.217 L
192.267 286.561 L
192.267 295.52 LE
181.729 295.072 LS
171.191 294.624 L
171.191 283.873 L
181.729 285.217 L
181.729 295.072 LE
171.191 294.624 LS
160.654 294.176 L
160.654 282.529 L
171.191 283.873 L
171.191 294.624 LE
160.654 294.176 LS
150.115 293.728 L
150.115 281.185 L
160.654 282.529 L
160.654 294.176 LE
150.115 293.728 LS
139.578 293.28 L
139.578 279.841 L
150.115 281.185 L
150.115 293.728 LE
139.578 293.28 LS
129.039 292.832 L
129.039 278.497 L
139.578 279.841 L
139.578 293.28 LE
129.039 292.832 LS
118.502 292.384 L
118.502 277.153 L
129.039 278.497 L
129.039 292.832 LE
118.502 292.384 LS
107.963 291.936 L
107.963 275.809 L
118.502 277.153 L
118.502 292.384 LE
107.963 291.936 LS
97.426 291.488 L
97.426 274.465 L
107.963 275.809 L
107.963 291.936 LE
97.426 291.488 LS
86.8875 291.04 L
86.8875 273.121 L
97.426 274.465 L
97.426 291.488 LE
192.267 286.561 LS
181.729 285.217 L
181.729 275.361 L
192.267 277.601 L
192.267 286.561 LE
181.729 285.217 LS
171.191 283.873 L
171.191 273.121 L
181.729 275.361 L
181.729 285.217 LE
171.191 283.873 LS
160.654 282.529 L
160.654 270.881 L
171.191 273.121 L
171.191 283.873 LE
160.654 282.529 LS
150.115 281.185 L
150.115 268.641 L
160.654 270.881 L
160.654 282.529 LE
150.115 281.185 LS
139.578 279.841 L
139.578 266.401 L
150.115 268.641 L
150.115 281.185 LE
139.578 279.841 LS
129.039 278.497 L
129.039 264.162 L
139.578 266.401 L
139.578 279.841 LE
129.039 278.497 LS
118.502 277.153 L
118.502 261.922 L
129.039 264.162 L
129.039 278.497 LE
118.502 277.153 LS
107.963 275.809 L
107.963 259.682 L
118.502 261.922 L
118.502 277.153 LE
107.963 275.809 LS
97.426 274.465 L
97.426 257.442 L
107.963 259.682 L
107.963 275.809 LE
97.426 274.465 LS
86.8875 273.121 L
86.8875 255.202 L
97.426 257.442 L
97.426 274.465 LE
210.488 363.324 LS
201.772 369.656 L
197.764 360.653 L
206.844 355.139 L
210.488 363.324 LE
201.772 369.656 LS
193.056 375.989 L
188.684 366.167 L
197.764 360.653 L
201.772 369.656 LE
193.056 375.989 LS
184.341 382.321 L
179.603 371.681 L
188.684 366.167 L
193.056 375.989 LE
184.341 382.321 LS
175.625 388.654 L
170.523 377.195 L
179.603 371.681 L
184.341 382.321 LE
175.625 388.654 LS
166.909 394.986 L
161.443 382.709 L
170.523 377.195 L
175.625 388.654 LE
166.909 394.986 LS
158.193 401.318 L
152.362 388.222 L
161.443 382.709 L
166.909 394.986 LE
158.193 401.318 LS
149.477 407.651 L
143.283 393.736 L
152.362 388.222 L
158.193 401.318 LE
149.477 407.651 LS
140.762 413.983 L
134.202 399.25 L
143.283 393.736 L
149.477 407.651 LE
140.762 413.983 LS
132.046 420.315 L
125.122 404.764 L
134.202 399.25 L
140.762 413.983 LE
132.046 420.315 LS
123.33 426.648 L
116.041 410.278 L
125.122 404.764 L
132.046 420.315 LE
206.844 355.139 LS
197.764 360.653 L
193.755 351.649 L
203.2 346.954 L
206.844 355.139 LE
197.764 360.653 LS
188.684 366.167 L
184.311 356.345 L
193.755 351.649 L
197.764 360.653 LE
188.684 366.167 LS
179.603 371.681 L
174.866 361.04 L
184.311 356.345 L
188.684 366.167 LE
179.603 371.681 LS
170.523 377.195 L
165.421 365.736 L
174.866 361.04 L
179.603 371.681 LE
170.523 377.195 LS
161.443 382.709 L
155.977 370.431 L
165.421 365.736 L
170.523 377.195 LE
161.443 382.709 LS
152.362 388.222 L
146.532 375.126 L
155.977 370.431 L
161.443 382.709 LE
152.362 388.222 LS
143.283 393.736 L
137.087 379.822 L
146.532 375.126 L
152.362 388.222 LE
143.283 393.736 LS
134.202 399.25 L
127.643 384.517 L
137.087 379.822 L
143.283 393.736 LE
134.202 399.25 LS
125.122 404.764 L
118.198 389.213 L
127.643 384.517 L
134.202 399.25 LE
125.122 404.764 LS
116.041 410.278 L
108.753 393.908 L
118.198 389.213 L
125.122 404.764 LE
203.2 346.954 LS
193.755 351.649 L
189.747 342.646 L
199.555 338.769 L
203.2 346.954 LE
193.755 351.649 LS
184.311 356.345 L
179.938 346.523 L
189.747 342.646 L
193.755 351.649 LE
184.311 356.345 LS
174.866 361.04 L
170.129 350.4 L
179.938 346.523 L
184.311 356.345 LE
174.866 361.04 LS
165.421 365.736 L
160.32 354.277 L
170.129 350.4 L
174.866 361.04 LE
165.421 365.736 LS
155.977 370.431 L
150.51 358.154 L
160.32 354.277 L
165.421 365.736 LE
155.977 370.431 LS
146.532 375.126 L
140.701 362.03 L
150.51 358.154 L
155.977 370.431 LE
146.532 375.126 LS
137.087 379.822 L
130.892 365.907 L
140.701 362.03 L
146.532 375.126 LE
137.087 379.822 LS
127.643 384.517 L
121.083 369.784 L
130.892 365.907 L
137.087 379.822 LE
127.643 384.517 LS
118.198 389.213 L
111.274 373.661 L
121.083 369.784 L
127.643 384.517 LE
118.198 389.213 LS
108.753 393.908 L
101.465 377.538 L
111.274 373.661 L
118.198 389.213 LE
199.555 338.769 LS
189.747 342.646 L
185.738 333.642 L
195.911 330.584 L
199.555 338.769 LE
189.747 342.646 LS
179.938 346.523 L
175.564 336.701 L
185.738 333.642 L
189.747 342.646 LE
179.938 346.523 LS
170.129 350.4 L
165.391 339.759 L
175.564 336.701 L
179.938 346.523 LE
170.129 350.4 LS
160.32 354.277 L
155.217 342.818 L
165.391 339.759 L
170.129 350.4 LE
160.32 354.277 LS
150.51 358.154 L
145.044 345.876 L
155.217 342.818 L
160.32 354.277 LE
150.51 358.154 LS
140.701 362.03 L
134.871 348.934 L
145.044 345.876 L
150.51 358.154 LE
140.701 362.03 LS
130.892 365.907 L
124.696 351.993 L
134.871 348.934 L
140.701 362.03 LE
130.892 365.907 LS
121.083 369.784 L
114.523 355.051 L
124.696 351.993 L
130.892 365.907 LE
121.083 369.784 LS
111.274 373.661 L
104.35 358.11 L
114.523 355.051 L
121.083 369.784 LE
111.274 373.661 LS
101.465 377.538 L
94.1767 361.168 L
104.35 358.11 L
111.274 373.661 LE
195.911 330.584 LS
185.738 333.642 L
181.729 324.639 L
192.267 322.399 L
195.911 330.584 LE
185.738 333.642 LS
175.564 336.701 L
171.191 326.879 L
181.729 324.639 L
185.738 333.642 LE
175.564 336.701 LS
165.391 339.759 L
160.654 329.119 L
171.191 326.879 L
175.564 336.701 LE
165.391 339.759 LS
155.217 342.818 L
150.115 331.359 L
160.654 329.119 L
165.391 339.759 LE
155.217 342.818 LS
145.044 345.876 L
139.578 333.599 L
150.115 331.359 L
155.217 342.818 LE
145.044 345.876 LS
134.871 348.934 L
129.039 335.838 L
139.578 333.599 L
145.044 345.876 LE
134.871 348.934 LS
124.696 351.993 L
118.502 338.078 L
129.039 335.838 L
134.871 348.934 LE
124.696 351.993 LS
114.523 355.051 L
107.963 340.318 L
118.502 338.078 L
124.696 351.993 LE
114.523 355.051 LS
104.35 358.11 L
97.426 342.558 L
107.963 340.318 L
114.523 355.051 LE
104.35 358.11 LS
94.1767 361.168 L
86.8875 344.798 L
97.426 342.558 L
104.35 358.11 LE
243.779 393.3 LS
238.393 402.63 L
231.069 396.035 L
237.121 387.305 L
243.779 393.3 LE
238.393 402.63 LS
233.006 411.96 L
225.016 404.766 L
231.069 396.035 L
238.393 402.63 LE
233.006 411.96 LS
227.619 421.289 L
218.964 413.496 L
225.016 404.766 L
233.006 411.96 LE
227.619 421.289 LS
222.233 430.62 L
212.911 422.227 L
218.964 413.496 L
227.619 421.289 LE
222.233 430.62 LS
216.846 439.95 L
206.859 430.957 L
212.911 422.227 L
222.233 430.62 LE
216.846 439.95 LS
211.459 449.279 L
200.806 439.687 L
206.859 430.957 L
216.846 439.95 LE
211.459 449.279 LS
206.073 458.609 L
194.754 448.418 L
200.806 439.687 L
211.459 449.279 LE
206.073 458.609 LS
200.686 467.94 L
188.701 457.148 L
194.754 448.418 L
206.073 458.609 LE
200.686 467.94 LS
195.299 477.27 L
182.648 465.879 L
188.701 457.148 L
200.686 467.94 LE
195.299 477.27 LS
189.913 486.599 L
176.596 474.609 L
182.648 465.879 L
195.299 477.27 LE
237.121 387.305 LS
231.069 396.035 L
223.745 389.44 L
230.463 381.309 L
237.121 387.305 LE
231.069 396.035 LS
225.016 404.766 L
217.026 397.571 L
223.745 389.44 L
231.069 396.035 LE
225.016 404.766 LS
218.964 413.496 L
210.308 405.702 L
217.026 397.571 L
225.016 404.766 LE
218.964 413.496 LS
212.911 422.227 L
203.59 413.833 L
210.308 405.702 L
218.964 413.496 LE
212.911 422.227 LS
206.859 430.957 L
196.871 421.964 L
203.59 413.833 L
212.911 422.227 LE
206.859 430.957 LS
200.806 439.687 L
190.153 430.095 L
196.871 421.964 L
206.859 430.957 LE
200.806 439.687 LS
194.754 448.418 L
183.435 438.226 L
190.153 430.095 L
200.806 439.687 LE
194.754 448.418 LS
188.701 457.148 L
176.717 446.357 L
183.435 438.226 L
194.754 448.418 LE
188.701 457.148 LS
182.648 465.879 L
169.998 454.488 L
176.717 446.357 L
188.701 457.148 LE
182.648 465.879 LS
176.596 474.609 L
163.28 462.619 L
169.998 454.488 L
182.648 465.879 LE
230.463 381.309 LS
223.745 389.44 L
216.42 382.846 L
223.805 375.314 L
230.463 381.309 LE
223.745 389.44 LS
217.026 397.571 L
209.036 390.377 L
216.42 382.846 L
223.745 389.44 LE
217.026 397.571 LS
210.308 405.702 L
201.652 397.909 L
209.036 390.377 L
217.026 397.571 LE
210.308 405.702 LS
203.59 413.833 L
194.268 405.44 L
201.652 397.909 L
210.308 405.702 LE
203.59 413.833 LS
196.871 421.964 L
186.883 412.971 L
194.268 405.44 L
203.59 413.833 LE
196.871 421.964 LS
190.153 430.095 L
179.499 420.503 L
186.883 412.971 L
196.871 421.964 LE
190.153 430.095 LS
183.435 438.226 L
172.115 428.034 L
179.499 420.503 L
190.153 430.095 LE
183.435 438.226 LS
176.717 446.357 L
164.731 435.566 L
172.115 428.034 L
183.435 438.226 LE
176.717 446.357 LS
169.998 454.488 L
157.347 443.097 L
164.731 435.566 L
176.717 446.357 LE
169.998 454.488 LS
163.28 462.619 L
149.963 450.628 L
157.347 443.097 L
169.998 454.488 LE
223.805 375.314 LS
216.42 382.846 L
209.096 376.251 L
217.146 369.319 L
223.805 375.314 LE
216.42 382.846 LS
209.036 390.377 L
201.046 383.183 L
209.096 376.251 L
216.42 382.846 LE
209.036 390.377 LS
201.652 397.909 L
192.996 390.115 L
201.046 383.183 L
209.036 390.377 LE
201.652 397.909 LS
194.268 405.44 L
184.946 397.047 L
192.996 390.115 L
201.652 397.909 LE
194.268 405.44 LS
186.883 412.971 L
176.896 403.979 L
184.946 397.047 L
194.268 405.44 LE
186.883 412.971 LS
179.499 420.503 L
168.847 410.91 L
176.896 403.979 L
186.883 412.971 LE
179.499 420.503 LS
172.115 428.034 L
160.797 417.843 L
168.847 410.91 L
179.499 420.503 LE
172.115 428.034 LS
164.731 435.566 L
152.747 424.774 L
160.797 417.843 L
172.115 428.034 LE
164.731 435.566 LS
157.347 443.097 L
144.696 431.706 L
152.747 424.774 L
164.731 435.566 LE
157.347 443.097 LS
149.963 450.628 L
136.646 438.639 L
144.696 431.706 L
157.347 443.097 LE
217.146 369.319 LS
209.096 376.251 L
201.772 369.656 L
210.488 363.324 L
217.146 369.319 LE
209.096 376.251 LS
201.046 383.183 L
193.056 375.989 L
201.772 369.656 L
209.096 376.251 LE
201.046 383.183 LS
192.996 390.115 L
184.341 382.321 L
193.056 375.989 L
201.046 383.183 LE
192.996 390.115 LS
184.946 397.047 L
175.625 388.654 L
184.341 382.321 L
192.996 390.115 LE
184.946 397.047 LS
176.896 403.979 L
166.909 394.986 L
175.625 388.654 L
184.946 397.047 LE
176.896 403.979 LS
168.847 410.91 L
158.193 401.318 L
166.909 394.986 L
176.896 403.979 LE
168.847 410.91 LS
160.797 417.843 L
149.477 407.651 L
158.193 401.318 L
168.847 410.91 LE
160.797 417.843 LS
152.747 424.774 L
140.762 413.983 L
149.477 407.651 L
160.797 417.843 LE
152.747 424.774 LS
144.696 431.706 L
132.046 420.315 L
140.762 413.983 L
152.747 424.774 LE
144.696 431.706 LS
136.646 438.639 L
123.33 426.648 L
132.046 420.315 L
144.696 431.706 LE
286.385 407.143 LS
285.259 417.857 L
275.886 414.811 L
277.864 404.374 L
286.385 407.143 LE
285.259 417.857 LS
284.133 428.572 L
273.907 425.25 L
275.886 414.811 L
285.259 417.857 LE
284.133 428.572 LS
283.007 439.286 L
271.929 435.687 L
273.907 425.25 L
284.133 428.572 LE
283.007 439.286 LS
281.88 450 L
269.951 446.124 L
271.929 435.687 L
283.007 439.286 LE
281.88 450 LS
280.754 460.714 L
267.973 456.561 L
269.951 446.124 L
281.88 450 LE
280.754 460.714 LS
279.628 471.429 L
265.994 466.999 L
267.973 456.561 L
280.754 460.714 LE
279.628 471.429 LS
278.502 482.144 L
264.016 477.437 L
265.994 466.999 L
279.628 471.429 LE
278.502 482.144 LS
277.376 492.858 L
262.038 487.874 L
264.016 477.437 L
278.502 482.144 LE
277.376 492.858 LS
276.25 503.572 L
260.06 498.311 L
262.038 487.874 L
277.376 492.858 LE
276.25 503.572 LS
275.124 514.286 L
258.081 508.749 L
260.06 498.311 L
276.25 503.572 LE
277.864 404.374 LS
275.886 414.811 L
266.512 411.767 L
269.343 401.606 L
277.864 404.374 LE
275.886 414.811 LS
273.907 425.25 L
263.682 421.927 L
266.512 411.767 L
275.886 414.811 LE
273.907 425.25 LS
271.929 435.687 L
260.852 432.087 L
263.682 421.927 L
273.907 425.25 LE
271.929 435.687 LS
269.951 446.124 L
258.021 442.248 L
260.852 432.087 L
271.929 435.687 LE
269.951 446.124 LS
267.973 456.561 L
255.191 452.408 L
258.021 442.248 L
269.951 446.124 LE
267.973 456.561 LS
265.994 466.999 L
252.361 462.569 L
255.191 452.408 L
267.973 456.561 LE
265.994 466.999 LS
264.016 477.437 L
249.53 472.73 L
252.361 462.569 L
265.994 466.999 LE
264.016 477.437 LS
262.038 487.874 L
246.7 482.89 L
249.53 472.73 L
264.016 477.437 LE
262.038 487.874 LS
260.06 498.311 L
243.87 493.05 L
246.7 482.89 L
262.038 487.874 LE
260.06 498.311 LS
258.081 508.749 L
241.039 503.212 L
243.87 493.05 L
260.06 498.311 LE
269.343 401.606 LS
266.512 411.767 L
257.139 408.721 L
260.822 398.837 L
269.343 401.606 LE
266.512 411.767 LS
263.682 421.927 L
253.457 418.605 L
257.139 408.721 L
266.512 411.767 LE
263.682 421.927 LS
260.852 432.087 L
249.774 428.488 L
253.457 418.605 L
263.682 421.927 LE
260.852 432.087 LS
258.021 442.248 L
246.092 438.371 L
249.774 428.488 L
260.852 432.087 LE
258.021 442.248 LS
255.191 452.408 L
242.409 448.256 L
246.092 438.371 L
258.021 442.248 LE
255.191 452.408 LS
252.361 462.569 L
238.727 458.139 L
242.409 448.256 L
255.191 452.408 LE
252.361 462.569 LS
249.53 472.73 L
235.045 468.023 L
238.727 458.139 L
252.361 462.569 LE
249.53 472.73 LS
246.7 482.89 L
231.362 477.906 L
235.045 468.023 L
249.53 472.73 LE
246.7 482.89 LS
243.87 493.05 L
227.68 487.791 L
231.362 477.906 L
246.7 482.89 LE
243.87 493.05 LS
241.039 503.212 L
223.997 497.674 L
227.68 487.791 L
243.87 493.05 LE
260.822 398.837 LS
257.139 408.721 L
247.766 405.675 L
252.3 396.068 L
260.822 398.837 LE
257.139 408.721 LS
253.457 418.605 L
243.231 415.282 L
247.766 405.675 L
257.139 408.721 LE
253.457 418.605 LS
249.774 428.488 L
238.697 424.889 L
243.231 415.282 L
253.457 418.605 LE
249.774 428.488 LS
246.092 438.371 L
234.162 434.495 L
238.697 424.889 L
249.774 428.488 LE
246.092 438.371 LS
242.409 448.256 L
229.628 444.103 L
234.162 434.495 L
246.092 438.371 LE
242.409 448.256 LS
238.727 458.139 L
225.093 453.709 L
229.628 444.103 L
242.409 448.256 LE
238.727 458.139 LS
235.045 468.023 L
220.559 463.316 L
225.093 453.709 L
238.727 458.139 LE
235.045 468.023 LS
231.362 477.906 L
216.024 472.923 L
220.559 463.316 L
235.045 468.023 LE
231.362 477.906 LS
227.68 487.791 L
211.49 482.53 L
216.024 472.923 L
231.362 477.906 LE
227.68 487.791 LS
223.997 497.674 L
206.955 492.137 L
211.49 482.53 L
227.68 487.791 LE
252.3 396.068 LS
247.766 405.675 L
238.393 402.63 L
243.779 393.3 L
252.3 396.068 LE
247.766 405.675 LS
243.231 415.282 L
233.006 411.96 L
238.393 402.63 L
247.766 405.675 LE
243.231 415.282 LS
238.697 424.889 L
227.619 421.289 L
233.006 411.96 L
243.231 415.282 LE
238.697 424.889 LS
234.162 434.495 L
222.233 430.62 L
227.619 421.289 L
238.697 424.889 LE
234.162 434.495 LS
229.628 444.103 L
216.846 439.95 L
222.233 430.62 L
234.162 434.495 LE
229.628 444.103 LS
225.093 453.709 L
211.459 449.279 L
216.846 439.95 L
229.628 444.103 LE
225.093 453.709 LS
220.559 463.316 L
206.073 458.609 L
211.459 449.279 L
225.093 453.709 LE
220.559 463.316 LS
216.024 472.923 L
200.686 467.94 L
206.073 458.609 L
220.559 463.316 LE
216.024 472.923 LS
211.49 482.53 L
195.299 477.27 L
200.686 467.94 L
216.024 472.923 LE
211.49 482.53 LS
206.955 492.137 L
189.913 486.599 L
195.299 477.27 L
211.49 482.53 LE
330.937 402.46 LS
334.267 412.706 L
324.465 413.736 L
322.027 403.397 L
330.937 402.46 LE
334.267 412.706 LS
337.596 422.953 L
326.903 424.076 L
324.465 413.736 L
334.267 412.706 LE
337.596 422.953 LS
340.925 433.198 L
329.341 434.415 L
326.903 424.076 L
337.596 422.953 LE
340.925 433.198 LS
344.254 443.445 L
331.779 444.756 L
329.341 434.415 L
340.925 433.198 LE
344.254 443.445 LS
347.583 453.69 L
334.217 455.095 L
331.779 444.756 L
344.254 443.445 LE
347.583 453.69 LS
350.912 463.937 L
336.655 465.435 L
334.217 455.095 L
347.583 453.69 LE
350.912 463.937 LS
354.241 474.183 L
339.093 475.774 L
336.655 465.435 L
350.912 463.937 LE
354.241 474.183 LS
357.571 484.429 L
341.532 486.115 L
339.093 475.774 L
354.241 474.183 LE
357.571 484.429 LS
360.9 494.675 L
343.97 496.454 L
341.532 486.115 L
357.571 484.429 LE
360.9 494.675 LS
364.229 504.92 L
346.408 506.794 L
343.97 496.454 L
360.9 494.675 LE
322.027 403.397 LS
324.465 413.736 L
314.663 414.767 L
313.116 404.333 L
322.027 403.397 LE
324.465 413.736 LS
326.903 424.076 L
316.211 425.2 L
314.663 414.767 L
324.465 413.736 LE
326.903 424.076 LS
329.341 434.415 L
317.757 435.634 L
316.211 425.2 L
326.903 424.076 LE
329.341 434.415 LS
331.779 444.756 L
319.305 446.067 L
317.757 435.634 L
329.341 434.415 LE
331.779 444.756 LS
334.217 455.095 L
320.852 456.5 L
319.305 446.067 L
331.779 444.756 LE
334.217 455.095 LS
336.655 465.435 L
322.399 466.934 L
320.852 456.5 L
334.217 455.095 LE
336.655 465.435 LS
339.093 475.774 L
323.946 477.367 L
322.399 466.934 L
336.655 465.435 LE
339.093 475.774 LS
341.532 486.115 L
325.493 487.801 L
323.946 477.367 L
339.093 475.774 LE
341.532 486.115 LS
343.97 496.454 L
327.04 498.233 L
325.493 487.801 L
341.532 486.115 LE
343.97 496.454 LS
346.408 506.794 L
328.587 508.667 L
327.04 498.233 L
343.97 496.454 LE
313.116 404.333 LS
314.663 414.767 L
304.862 415.797 L
304.206 405.27 L
313.116 404.333 LE
314.663 414.767 LS
316.211 425.2 L
305.518 426.324 L
304.862 415.797 L
314.663 414.767 LE
316.211 425.2 LS
317.757 435.634 L
306.174 436.851 L
305.518 426.324 L
316.211 425.2 LE
317.757 435.634 LS
319.305 446.067 L
306.83 447.378 L
306.174 436.851 L
317.757 435.634 LE
319.305 446.067 LS
320.852 456.5 L
307.486 457.905 L
306.83 447.378 L
319.305 446.067 LE
320.852 456.5 LS
322.399 466.934 L
308.142 468.432 L
307.486 457.905 L
320.852 456.5 LE
322.399 466.934 LS
323.946 477.367 L
308.798 478.959 L
308.142 468.432 L
322.399 466.934 LE
323.946 477.367 LS
325.493 487.801 L
309.454 489.486 L
308.798 478.959 L
323.946 477.367 LE
325.493 487.801 LS
327.04 498.233 L
310.11 500.013 L
309.454 489.486 L
325.493 487.801 LE
327.04 498.233 LS
328.587 508.667 L
310.766 510.54 L
310.11 500.013 L
327.04 498.233 LE
304.206 405.27 LS
304.862 415.797 L
295.06 416.827 L
295.295 406.207 L
304.206 405.27 LE
304.862 415.797 LS
305.518 426.324 L
294.825 427.447 L
295.06 416.827 L
304.862 415.797 LE
305.518 426.324 LS
306.174 436.851 L
294.59 438.069 L
294.825 427.447 L
305.518 426.324 LE
306.174 436.851 LS
306.83 447.378 L
294.355 448.689 L
294.59 438.069 L
306.174 436.851 LE
306.83 447.378 LS
307.486 457.905 L
294.12 459.309 L
294.355 448.689 L
306.83 447.378 LE
307.486 457.905 LS
308.142 468.432 L
293.885 469.931 L
294.12 459.309 L
307.486 457.905 LE
308.142 468.432 LS
308.798 478.959 L
293.65 480.551 L
293.885 469.931 L
308.142 468.432 LE
308.798 478.959 LS
309.454 489.486 L
293.415 491.172 L
293.65 480.551 L
308.798 478.959 LE
309.454 489.486 LS
310.11 500.013 L
293.18 501.792 L
293.415 491.172 L
309.454 489.486 LE
310.11 500.013 LS
310.766 510.54 L
292.945 512.413 L
293.18 501.792 L
310.11 500.013 LE
295.295 406.207 LS
295.06 416.827 L
285.259 417.857 L
286.385 407.143 L
295.295 406.207 LE
295.06 416.827 LS
294.825 427.447 L
284.133 428.572 L
285.259 417.857 L
295.06 416.827 LE
294.825 427.447 LS
294.59 438.069 L
283.007 439.286 L
284.133 428.572 L
294.825 427.447 LE
294.59 438.069 LS
294.355 448.689 L
281.88 450 L
283.007 439.286 L
294.59 438.069 LE
294.355 448.689 LS
294.12 459.309 L
280.754 460.714 L
281.88 450 L
294.355 448.689 LE
294.12 459.309 LS
293.885 469.931 L
279.628 471.429 L
280.754 460.714 L
294.12 459.309 LE
293.885 469.931 LS
293.65 480.551 L
278.502 482.144 L
279.628 471.429 L
293.885 469.931 LE
293.65 480.551 LS
293.415 491.172 L
277.376 492.858 L
278.502 482.144 L
293.65 480.551 LE
293.415 491.172 LS
293.18 501.792 L
276.25 503.572 L
277.376 492.858 L
293.415 491.172 LE
293.18 501.792 LS
292.945 512.413 L
275.124 514.286 L
276.25 503.572 L
293.18 501.792 LE
369.734 380.061 LS
376.942 388.068 L
368.407 392.995 L
361.974 384.541 L
369.734 380.061 LE
376.942 388.068 LS
384.151 396.074 L
374.84 401.449 L
368.407 392.995 L
376.942 388.068 LE
384.151 396.074 LS
391.36 404.08 L
381.273 409.904 L
374.84 401.449 L
384.151 396.074 LE
391.36 404.08 LS
398.569 412.086 L
387.706 418.358 L
381.273 409.904 L
391.36 404.08 LE
398.569 412.086 LS
405.778 420.092 L
394.139 426.812 L
387.706 418.358 L
398.569 412.086 LE
405.778 420.092 LS
412.986 428.098 L
400.571 435.266 L
394.139 426.812 L
405.778 420.092 LE
412.986 428.098 LS
420.195 436.105 L
407.004 443.72 L
400.571 435.266 L
412.986 428.098 LE
420.195 436.105 LS
427.404 444.11 L
413.437 452.174 L
407.004 443.72 L
420.195 436.105 LE
427.404 444.11 LS
434.613 452.117 L
419.869 460.628 L
413.437 452.174 L
427.404 444.11 LE
434.613 452.117 LS
441.821 460.123 L
426.303 469.082 L
419.869 460.628 L
434.613 452.117 LE
361.974 384.541 LS
368.407 392.995 L
359.872 397.923 L
354.215 389.021 L
361.974 384.541 LE
368.407 392.995 LS
374.84 401.449 L
365.529 406.825 L
359.872 397.923 L
368.407 392.995 LE
374.84 401.449 LS
381.273 409.904 L
371.186 415.727 L
365.529 406.825 L
374.84 401.449 LE
381.273 409.904 LS
387.706 418.358 L
376.843 424.629 L
371.186 415.727 L
381.273 409.904 LE
387.706 418.358 LS
394.139 426.812 L
382.5 433.531 L
376.843 424.629 L
387.706 418.358 LE
394.139 426.812 LS
400.571 435.266 L
388.157 442.434 L
382.5 433.531 L
394.139 426.812 LE
400.571 435.266 LS
407.004 443.72 L
393.814 451.336 L
388.157 442.434 L
400.571 435.266 LE
407.004 443.72 LS
413.437 452.174 L
399.47 460.238 L
393.814 451.336 L
407.004 443.72 LE
413.437 452.174 LS
419.869 460.628 L
405.127 469.14 L
399.47 460.238 L
413.437 452.174 LE
419.869 460.628 LS
426.303 469.082 L
410.784 478.042 L
405.127 469.14 L
419.869 460.628 LE
354.215 389.021 LS
359.872 397.923 L
351.337 402.851 L
346.456 393.501 L
354.215 389.021 LE
359.872 397.923 LS
365.529 406.825 L
356.218 412.201 L
351.337 402.851 L
359.872 397.923 LE
365.529 406.825 LS
371.186 415.727 L
361.099 421.551 L
356.218 412.201 L
365.529 406.825 LE
371.186 415.727 LS
376.843 424.629 L
365.98 430.901 L
361.099 421.551 L
371.186 415.727 LE
376.843 424.629 LS
382.5 433.531 L
370.861 440.251 L
365.98 430.901 L
376.843 424.629 LE
382.5 433.531 LS
388.157 442.434 L
375.742 449.602 L
370.861 440.251 L
382.5 433.531 LE
388.157 442.434 LS
393.814 451.336 L
380.623 458.952 L
375.742 449.602 L
388.157 442.434 LE
393.814 451.336 LS
399.47 460.238 L
385.504 468.302 L
380.623 458.952 L
393.814 451.336 LE
399.47 460.238 LS
405.127 469.14 L
390.385 477.651 L
385.504 468.302 L
399.47 460.238 LE
405.127 469.14 LS
410.784 478.042 L
395.266 487.001 L
390.385 477.651 L
405.127 469.14 LE
346.456 393.501 LS
351.337 402.851 L
342.802 407.779 L
338.697 397.981 L
346.456 393.501 LE
351.337 402.851 LS
356.218 412.201 L
346.907 417.577 L
342.802 407.779 L
351.337 402.851 LE
356.218 412.201 LS
361.099 421.551 L
351.012 427.375 L
346.907 417.577 L
356.218 412.201 LE
361.099 421.551 LS
365.98 430.901 L
355.117 437.172 L
351.012 427.375 L
361.099 421.551 LE
365.98 430.901 LS
370.861 440.251 L
359.222 446.971 L
355.117 437.172 L
365.98 430.901 LE
370.861 440.251 LS
375.742 449.602 L
363.327 456.769 L
359.222 446.971 L
370.861 440.251 LE
375.742 449.602 LS
380.623 458.952 L
367.432 466.567 L
363.327 456.769 L
375.742 449.602 LE
380.623 458.952 LS
385.504 468.302 L
371.537 476.365 L
367.432 466.567 L
380.623 458.952 LE
385.504 468.302 LS
390.385 477.651 L
375.642 486.163 L
371.537 476.365 L
385.504 468.302 LE
390.385 477.651 LS
395.266 487.001 L
379.747 495.961 L
375.642 486.163 L
390.385 477.651 LE
338.697 397.981 LS
342.802 407.779 L
334.267 412.706 L
330.937 402.46 L
338.697 397.981 LE
342.802 407.779 LS
346.907 417.577 L
337.596 422.953 L
334.267 412.706 L
342.802 407.779 LE
346.907 417.577 LS
351.012 427.375 L
340.925 433.198 L
337.596 422.953 L
346.907 417.577 LE
351.012 427.375 LS
355.117 437.172 L
344.254 443.445 L
340.925 433.198 L
351.012 427.375 LE
355.117 437.172 LS
359.222 446.971 L
347.583 453.69 L
344.254 443.445 L
355.117 437.172 LE
359.222 446.971 LS
363.327 456.769 L
350.912 463.937 L
347.583 453.69 L
359.222 446.971 LE
363.327 456.769 LS
367.432 466.567 L
354.241 474.183 L
350.912 463.937 L
363.327 456.769 LE
367.432 466.567 LS
371.537 476.365 L
357.571 484.429 L
354.241 474.183 L
367.432 466.567 LE
371.537 476.365 LS
375.642 486.163 L
360.9 494.675 L
357.571 484.429 L
371.537 476.365 LE
375.642 486.163 LS
379.747 495.961 L
364.229 504.92 L
360.9 494.675 L
375.642 486.163 LE
396.065 343.819 LS
405.907 348.201 L
400.114 356.174 L
390.799 351.068 L
396.065 343.819 LE
405.907 348.201 LS
415.749 352.583 L
409.429 361.281 L
400.114 356.174 L
405.907 348.201 LE
415.749 352.583 LS
425.591 356.965 L
418.745 366.388 L
409.429 361.281 L
415.749 352.583 LE
425.591 356.965 LS
435.433 361.347 L
428.06 371.495 L
418.745 366.388 L
425.591 356.965 LE
435.433 361.347 LS
445.275 365.729 L
437.375 376.601 L
428.06 371.495 L
435.433 361.347 LE
445.275 365.729 LS
455.116 370.111 L
446.691 381.708 L
437.375 376.601 L
445.275 365.729 LE
455.116 370.111 LS
464.959 374.492 L
456.006 386.815 L
446.691 381.708 L
455.116 370.111 LE
464.959 374.492 LS
474.8 378.874 L
465.321 391.922 L
456.006 386.815 L
464.959 374.492 LE
474.8 378.874 LS
484.643 383.256 L
474.637 397.028 L
465.321 391.922 L
474.8 378.874 LE
484.643 383.256 LS
494.484 387.638 L
483.951 402.135 L
474.637 397.028 L
484.643 383.256 LE
390.799 351.068 LS
400.114 356.174 L
394.321 364.148 L
385.533 358.316 L
390.799 351.068 LE
400.114 356.174 LS
409.429 361.281 L
403.11 369.979 L
394.321 364.148 L
400.114 356.174 LE
409.429 361.281 LS
418.745 366.388 L
411.898 375.811 L
403.11 369.979 L
409.429 361.281 LE
418.745 366.388 LS
428.06 371.495 L
420.687 381.642 L
411.898 375.811 L
418.745 366.388 LE
428.06 371.495 LS
437.375 376.601 L
429.476 387.474 L
420.687 381.642 L
428.06 371.495 LE
437.375 376.601 LS
446.691 381.708 L
438.265 393.306 L
429.476 387.474 L
437.375 376.601 LE
446.691 381.708 LS
456.006 386.815 L
447.054 399.137 L
438.265 393.306 L
446.691 381.708 LE
456.006 386.815 LS
465.321 391.922 L
455.841 404.969 L
447.054 399.137 L
456.006 386.815 LE
465.321 391.922 LS
474.637 397.028 L
464.63 410.8 L
455.841 404.969 L
465.321 391.922 LE
474.637 397.028 LS
483.951 402.135 L
473.419 416.632 L
464.63 410.8 L
474.637 397.028 LE
385.533 358.316 LS
394.321 364.148 L
388.528 372.121 L
380.266 365.564 L
385.533 358.316 LE
394.321 364.148 LS
403.11 369.979 L
396.79 378.677 L
388.528 372.121 L
394.321 364.148 LE
403.11 369.979 LS
411.898 375.811 L
405.052 385.234 L
396.79 378.677 L
403.11 369.979 LE
411.898 375.811 LS
420.687 381.642 L
413.315 391.79 L
405.052 385.234 L
411.898 375.811 LE
420.687 381.642 LS
429.476 387.474 L
421.576 398.347 L
413.315 391.79 L
420.687 381.642 LE
429.476 387.474 LS
438.265 393.306 L
429.838 404.903 L
421.576 398.347 L
429.476 387.474 LE
438.265 393.306 LS
447.054 399.137 L
438.1 411.46 L
429.838 404.903 L
438.265 393.306 LE
447.054 399.137 LS
455.841 404.969 L
446.362 418.016 L
438.1 411.46 L
447.054 399.137 LE
455.841 404.969 LS
464.63 410.8 L
454.624 424.572 L
446.362 418.016 L
455.841 404.969 LE
464.63 410.8 LS
473.419 416.632 L
462.886 431.129 L
454.624 424.572 L
464.63 410.8 LE
380.266 365.564 LS
388.528 372.121 L
382.735 380.094 L
375 372.813 L
380.266 365.564 LE
388.528 372.121 LS
396.79 378.677 L
390.471 387.376 L
382.735 380.094 L
388.528 372.121 LE
396.79 378.677 LS
405.052 385.234 L
398.206 394.657 L
390.471 387.376 L
396.79 378.677 LE
405.052 385.234 LS
413.315 391.79 L
405.942 401.938 L
398.206 394.657 L
405.052 385.234 LE
413.315 391.79 LS
421.576 398.347 L
413.677 409.219 L
405.942 401.938 L
413.315 391.79 LE
421.576 398.347 LS
429.838 404.903 L
421.412 416.501 L
413.677 409.219 L
421.576 398.347 LE
429.838 404.903 LS
438.1 411.46 L
429.147 423.782 L
421.412 416.501 L
429.838 404.903 LE
438.1 411.46 LS
446.362 418.016 L
436.883 431.063 L
429.147 423.782 L
438.1 411.46 LE
446.362 418.016 LS
454.624 424.572 L
444.619 438.345 L
436.883 431.063 L
446.362 418.016 LE
454.624 424.572 LS
462.886 431.129 L
452.354 445.626 L
444.619 438.345 L
454.624 424.572 LE
375 372.813 LS
382.735 380.094 L
376.942 388.068 L
369.734 380.061 L
375 372.813 LE
382.735 380.094 LS
390.471 387.376 L
384.151 396.074 L
376.942 388.068 L
382.735 380.094 LE
390.471 387.376 LS
398.206 394.657 L
391.36 404.08 L
384.151 396.074 L
390.471 387.376 LE
398.206 394.657 LS
405.942 401.938 L
398.569 412.086 L
391.36 404.08 L
398.206 394.657 LE
405.942 401.938 LS
413.677 409.219 L
405.778 420.092 L
398.569 412.086 L
405.942 401.938 LE
413.677 409.219 LS
421.412 416.501 L
412.986 428.098 L
405.778 420.092 L
413.677 409.219 LE
421.412 416.501 LS
429.147 423.782 L
420.195 436.105 L
412.986 428.098 L
421.412 416.501 LE
429.147 423.782 LS
436.883 431.063 L
427.404 444.11 L
420.195 436.105 L
429.147 423.782 LE
436.883 431.063 LS
444.619 438.345 L
434.613 452.117 L
427.404 444.11 L
436.883 431.063 LE
444.619 438.345 LS
452.354 445.626 L
441.821 460.123 L
434.613 452.117 L
444.619 438.345 LE
405.379 300 LS
416.153 300 L
414.103 309.64 L
403.516 308.764 L
405.379 300 LE
416.153 300 LS
426.926 300 L
424.69 310.517 L
414.103 309.64 L
416.153 300 LE
426.926 300 LS
437.699 300 L
435.277 311.393 L
424.69 310.517 L
426.926 300 LE
437.699 300 LS
448.473 300 L
445.864 312.269 L
435.277 311.393 L
437.699 300 LE
448.473 300 LS
459.246 300 L
456.451 313.146 L
445.864 312.269 L
448.473 300 LE
459.246 300 LS
470.019 300 L
467.038 314.022 L
456.451 313.146 L
459.246 300 LE
470.019 300 LS
480.793 300 L
477.626 314.898 L
467.038 314.022 L
470.019 300 LE
480.793 300 LS
491.566 300 L
488.213 315.775 L
477.626 314.898 L
480.793 300 LE
491.566 300 LS
502.339 300 L
498.8 316.651 L
488.213 315.775 L
491.566 300 LE
502.339 300 LS
513.112 300 L
509.387 317.528 L
498.8 316.651 L
502.339 300 LE
403.516 308.764 LS
414.103 309.64 L
412.054 319.28 L
401.654 317.528 L
403.516 308.764 LE
414.103 309.64 LS
424.69 310.517 L
422.455 321.033 L
412.054 319.28 L
414.103 309.64 LE
424.69 310.517 LS
435.277 311.393 L
432.856 322.786 L
422.455 321.033 L
424.69 310.517 LE
435.277 311.393 LS
445.864 312.269 L
443.257 324.539 L
432.856 322.786 L
435.277 311.393 LE
445.864 312.269 LS
456.451 313.146 L
453.658 326.291 L
443.257 324.539 L
445.864 312.269 LE
456.451 313.146 LS
467.038 314.022 L
464.058 328.044 L
453.658 326.291 L
456.451 313.146 LE
467.038 314.022 LS
477.626 314.898 L
474.459 329.797 L
464.058 328.044 L
467.038 314.022 LE
477.626 314.898 LS
488.213 315.775 L
484.859 331.55 L
474.459 329.797 L
477.626 314.898 LE
488.213 315.775 LS
498.8 316.651 L
495.26 333.302 L
484.859 331.55 L
488.213 315.775 LE
498.8 316.651 LS
509.387 317.528 L
505.662 335.055 L
495.26 333.302 L
498.8 316.651 LE
401.654 317.528 LS
412.054 319.28 L
410.005 328.921 L
399.791 326.291 L
401.654 317.528 LE
412.054 319.28 LS
422.455 321.033 L
420.22 331.55 L
410.005 328.921 L
412.054 319.28 LE
422.455 321.033 LS
432.856 322.786 L
430.435 334.179 L
420.22 331.55 L
422.455 321.033 LE
432.856 322.786 LS
443.257 324.539 L
440.649 336.808 L
430.435 334.179 L
432.856 322.786 LE
443.257 324.539 LS
453.658 326.291 L
450.863 339.437 L
440.649 336.808 L
443.257 324.539 LE
453.658 326.291 LS
464.058 328.044 L
461.077 342.066 L
450.863 339.437 L
453.658 326.291 LE
464.058 328.044 LS
474.459 329.797 L
471.293 344.695 L
461.077 342.066 L
464.058 328.044 LE
474.459 329.797 LS
484.859 331.55 L
481.507 347.325 L
471.293 344.695 L
474.459 329.797 LE
484.859 331.55 LS
495.26 333.302 L
491.721 349.954 L
481.507 347.325 L
484.859 331.55 LE
495.26 333.302 LS
505.662 335.055 L
501.935 352.583 L
491.721 349.954 L
495.26 333.302 LE
399.791 326.291 LS
410.005 328.921 L
407.956 338.561 L
397.928 335.055 L
399.791 326.291 LE
410.005 328.921 LS
420.22 331.55 L
417.984 342.066 L
407.956 338.561 L
410.005 328.921 LE
420.22 331.55 LS
430.435 334.179 L
428.013 345.572 L
417.984 342.066 L
420.22 331.55 LE
430.435 334.179 LS
440.649 336.808 L
438.041 349.077 L
428.013 345.572 L
430.435 334.179 LE
440.649 336.808 LS
450.863 339.437 L
448.069 352.583 L
438.041 349.077 L
440.649 336.808 LE
450.863 339.437 LS
461.077 342.066 L
458.097 356.088 L
448.069 352.583 L
450.863 339.437 LE
461.077 342.066 LS
471.293 344.695 L
468.125 359.594 L
458.097 356.088 L
461.077 342.066 LE
471.293 344.695 LS
481.507 347.325 L
478.154 363.099 L
468.125 359.594 L
471.293 344.695 LE
481.507 347.325 LS
491.721 349.954 L
488.182 366.605 L
478.154 363.099 L
481.507 347.325 LE
491.721 349.954 LS
501.935 352.583 L
498.21 370.111 L
488.182 366.605 L
491.721 349.954 LE
397.928 335.055 LS
407.956 338.561 L
405.907 348.201 L
396.065 343.819 L
397.928 335.055 LE
407.956 338.561 LS
417.984 342.066 L
415.749 352.583 L
405.907 348.201 L
407.956 338.561 LE
417.984 342.066 LS
428.013 345.572 L
425.591 356.965 L
415.749 352.583 L
417.984 342.066 LE
428.013 345.572 LS
438.041 349.077 L
435.433 361.347 L
425.591 356.965 L
428.013 345.572 LE
438.041 349.077 LS
448.069 352.583 L
445.275 365.729 L
435.433 361.347 L
438.041 349.077 LE
448.069 352.583 LS
458.097 356.088 L
455.116 370.111 L
445.275 365.729 L
448.069 352.583 LE
458.097 356.088 LS
468.125 359.594 L
464.959 374.492 L
455.116 370.111 L
458.097 356.088 LE
468.125 359.594 LS
478.154 363.099 L
474.8 378.874 L
464.959 374.492 L
468.125 359.594 LE
478.154 363.099 LS
488.182 366.605 L
484.643 383.256 L
474.8 378.874 L
478.154 363.099 LE
488.182 366.605 LS
498.21 370.111 L
494.484 387.638 L
484.643 383.256 L
488.182 366.605 LE
0 0 0 C
(Y) 543 73 15 /Helvetica S
(X) 573 43 15 /Helvetica S
(Z) 543 43 15 /Helvetica S
540 40 LS
540 40 L
540 70 LE
540 40 LS
570 40 LE
grestore
showpage
cleartomark
%%PageTrailer
%%Trailer
end
%%EOF
