<?xml version="1.0" encoding="UTF-8" standalone="no"?>
<!-- Created with Inkscape (http://www.inkscape.org/) -->

<svg
   xmlns:dc="http://purl.org/dc/elements/1.1/"
   xmlns:cc="http://creativecommons.org/ns#"
   xmlns:rdf="http://www.w3.org/1999/02/22-rdf-syntax-ns#"
   xmlns:svg="http://www.w3.org/2000/svg"
   xmlns="http://www.w3.org/2000/svg"
   xmlns:sodipodi="http://sodipodi.sourceforge.net/DTD/sodipodi-0.dtd"
   xmlns:inkscape="http://www.inkscape.org/namespaces/inkscape"
   width="297mm"
   height="120mm"
   viewBox="0 0 297 120"
   version="1.1"
   id="svg8"
   sodipodi:docname="MicroDexed logo 2.5mm.svg"
   inkscape:version="0.92.4 (5da689c313, 2019-01-14)">
  <defs
     id="defs2" />
  <sodipodi:namedview
     id="base"
     pagecolor="#ffffff"
     bordercolor="#666666"
     borderopacity="1.0"
     inkscape:pageopacity="0.0"
     inkscape:pageshadow="2"
     inkscape:zoom="0.5"
     inkscape:cx="744.81626"
     inkscape:cy="-47.989683"
     inkscape:document-units="mm"
     inkscape:current-layer="layer1"
     showgrid="false"
     inkscape:window-width="1280"
     inkscape:window-height="962"
     inkscape:window-x="-8"
     inkscape:window-y="-8"
     inkscape:window-maximized="1" />
  <metadata
     id="metadata5">
    <rdf:RDF>
      <cc:Work
         rdf:about="">
        <dc:format>image/svg+xml</dc:format>
        <dc:type
           rdf:resource="http://purl.org/dc/dcmitype/StillImage" />
        <dc:title></dc:title>
      </cc:Work>
    </rdf:RDF>
  </metadata>
  <g
     inkscape:label="Calque 1"
     inkscape:groupmode="layer"
     id="layer1"
     transform="translate(0,-177)">
    <path
       style="fill:none;stroke:#000000;stroke-width:2;stroke-linecap:butt;stroke-linejoin:round;stroke-opacity:1;stroke-miterlimit:4;stroke-dasharray:none"
       d="m 6.2621514,225.42921 c 23.0803516,0 23.0803516,0 23.0803516,0"
       id="path3743-2-6"
       inkscape:connector-curvature="0" />
    <path
       style="fill:none;stroke:#000000;stroke-width:2;stroke-linecap:butt;stroke-linejoin:round;stroke-opacity:1;stroke-miterlimit:4;stroke-dasharray:none"
       d="m 6.2621503,230.22819 c 23.0803537,0 23.0803537,0 23.0803537,0"
       id="path3743-52"
       inkscape:connector-curvature="0" />
    <path
       style="fill:none;stroke:#000000;stroke-width:2;stroke-linecap:butt;stroke-linejoin:round;stroke-opacity:1;stroke-miterlimit:4;stroke-dasharray:none"
       d="m 6.2621514,235.02717 c 23.0803516,0 23.0803516,0 23.0803516,0"
       id="path3743-2-0"
       inkscape:connector-curvature="0" />
    <path
       style="fill:none;stroke:#000000;stroke-width:2;stroke-linecap:butt;stroke-linejoin:round;stroke-opacity:1;stroke-miterlimit:4;stroke-dasharray:none"
       d="m 6.2621503,239.82615 c 23.0803537,0 23.0803537,0 23.0803537,0"
       id="path3743-1"
       inkscape:connector-curvature="0" />
    <path
       style="fill:none;stroke:#000000;stroke-width:2;stroke-linecap:butt;stroke-linejoin:round;stroke-opacity:1;stroke-miterlimit:4;stroke-dasharray:none"
       d="m 6.3002103,244.67191 31.1425327,-0.0468 c 11.874882,0.0842 6.259411,-15.0646 15.625213,-15.70846"
       id="path3743-2-06"
       inkscape:connector-curvature="0"
       sodipodi:nodetypes="ccc" />
    <path
       style="fill:none;stroke:#000000;stroke-width:2;stroke-linecap:butt;stroke-linejoin:round;stroke-opacity:1;stroke-miterlimit:4;stroke-dasharray:none"
       d="m 6.2621503,249.42412 26.9698017,-0.0165 c 11.907955,0.10074 6.292484,-15.04806 15.658286,-15.69192"
       id="path3743-5-0"
       inkscape:connector-curvature="0"
       sodipodi:nodetypes="ccc" />
    <path
       style="fill:none;stroke:#000000;stroke-width:2;stroke-linecap:butt;stroke-linejoin:round;stroke-opacity:1;stroke-miterlimit:4;stroke-dasharray:none"
       d="m 6.2678848,254.17633 22.5682272,0.005 c 12.070461,0.0893 6.45499,-15.05945 15.820792,-15.70331"
       id="path3743-2-6-0"
       inkscape:connector-curvature="0"
       sodipodi:nodetypes="ccc" />
    <path
       style="fill:none;stroke:#000000;stroke-width:2;stroke-linecap:butt;stroke-linejoin:round;stroke-opacity:1;stroke-miterlimit:4;stroke-dasharray:none"
       d="m 6.2621503,259.02208 c 23.0803537,0 23.0803537,0 23.0803537,0"
       id="path3743-52-8"
       inkscape:connector-curvature="0" />
    <path
       style="fill:none;stroke:#000000;stroke-width:2;stroke-linecap:butt;stroke-linejoin:round;stroke-opacity:1;stroke-miterlimit:4;stroke-dasharray:none"
       d="m 6.2621514,263.82106 c 23.0803516,0 23.0803516,0 23.0803516,0"
       id="path3743-2-0-6"
       inkscape:connector-curvature="0" />
    <path
       style="fill:none;stroke:#000000;stroke-width:2;stroke-linecap:butt;stroke-linejoin:round;stroke-opacity:1;stroke-miterlimit:4;stroke-dasharray:none"
       d="m 6.2621514,273.41903 c 23.0803516,0 23.0803516,0 23.0803516,0"
       id="path3743-2-8"
       inkscape:connector-curvature="0" />
    <path
       style="fill:none;stroke:#000000;stroke-width:2;stroke-linecap:butt;stroke-linejoin:round;stroke-opacity:1;stroke-miterlimit:4;stroke-dasharray:none"
       d="m 79.12041,225.39706 c 24.70231,0 24.70231,0 24.70231,0"
       id="path3743-2-6-02"
       inkscape:connector-curvature="0" />
    <path
       style="fill:none;stroke:#000000;stroke-width:2;stroke-linecap:butt;stroke-linejoin:round;stroke-opacity:1;stroke-miterlimit:4;stroke-dasharray:none"
       d="m 82.538482,230.19604 c 23.683688,0 23.683688,0 23.683688,0"
       id="path3743-52-88"
       inkscape:connector-curvature="0" />
    <path
       style="fill:none;stroke:#000000;stroke-width:2;stroke-linecap:butt;stroke-linejoin:round;stroke-opacity:1;stroke-miterlimit:4;stroke-dasharray:none"
       d="m 85.758153,234.99502 c 22.863517,0 22.863517,0 22.863517,0"
       id="path3743-2-0-3"
       inkscape:connector-curvature="0" />
    <path
       style="fill:none;stroke:#000000;stroke-width:2;stroke-linecap:butt;stroke-linejoin:round;stroke-opacity:1;stroke-miterlimit:4;stroke-dasharray:none"
       d="m 87.115222,239.79401 c 22.706188,0 22.706188,0 22.706188,0"
       id="path3743-1-5"
       inkscape:connector-curvature="0" />
    <path
       style="fill:none;stroke:#000000;stroke-width:2;stroke-linecap:butt;stroke-linejoin:round;stroke-opacity:1;stroke-miterlimit:4;stroke-dasharray:none"
       d="m 86.741044,258.98993 c 23.080366,0 23.080366,0 23.080366,0"
       id="path3743-52-8-5"
       inkscape:connector-curvature="0" />
    <path
       style="fill:none;stroke:#000000;stroke-width:2;stroke-linecap:butt;stroke-linejoin:round;stroke-opacity:1;stroke-miterlimit:4;stroke-dasharray:none"
       d="m 100.12028,211.07509 c 25.4012,0 25.4012,0 25.4012,0"
       id="path3743-8"
       inkscape:connector-curvature="0" />
    <path
       style="fill:none;stroke:#000000;stroke-width:2;stroke-linecap:butt;stroke-linejoin:round;stroke-opacity:1;stroke-miterlimit:4;stroke-dasharray:none"
       d="m 104.74159,215.87407 c 25.40124,0 25.40124,0 25.40124,0"
       id="path3743-2-63"
       inkscape:connector-curvature="0" />
    <path
       style="fill:none;stroke:#000000;stroke-width:2;stroke-linecap:butt;stroke-linejoin:round;stroke-opacity:1;stroke-miterlimit:4;stroke-dasharray:none"
       d="m 109.36291,220.67305 c 25.40125,0 25.40125,0 25.40125,0"
       id="path3743-5-9"
       inkscape:connector-curvature="0" />
    <path
       style="fill:none;stroke:#000000;stroke-width:2;stroke-linecap:butt;stroke-linejoin:round;stroke-opacity:1;stroke-miterlimit:4;stroke-dasharray:none"
       d="m 113.98423,225.47204 c 25.40126,0 25.40126,0 25.40126,0"
       id="path3743-2-6-7"
       inkscape:connector-curvature="0" />
    <path
       style="fill:none;stroke:#000000;stroke-width:2;stroke-linecap:butt;stroke-linejoin:round;stroke-opacity:1;stroke-miterlimit:4;stroke-dasharray:none"
       d="m 118.31057,230.27102 c 25.40128,0 25.40128,0 25.40128,0"
       id="path3743-52-5"
       inkscape:connector-curvature="0" />
    <path
       style="fill:none;stroke:#000000;stroke-width:2;stroke-linecap:butt;stroke-linejoin:round;stroke-opacity:1;stroke-miterlimit:4;stroke-dasharray:none"
       d="m 122.85817,235.07 c 25.40126,0 25.40126,0 25.40126,0"
       id="path3743-2-0-9"
       inkscape:connector-curvature="0" />
    <path
       style="fill:none;stroke:#000000;stroke-width:2;stroke-linecap:butt;stroke-linejoin:round;stroke-opacity:1;stroke-miterlimit:4;stroke-dasharray:none"
       d="m 131.93492,244.74171 c 34.10417,0 34.10417,0 34.10417,0"
       id="path3743-2-06-5"
       inkscape:connector-curvature="0" />
    <path
       style="fill:none;stroke:#000000;stroke-width:2;stroke-linecap:butt;stroke-linejoin:round;stroke-opacity:1;stroke-miterlimit:4;stroke-dasharray:none"
       d="m 136.24843,249.43007 c 25.40128,0 25.40128,0 25.40128,0"
       id="path3743-5-0-2"
       inkscape:connector-curvature="0" />
    <path
       style="fill:none;stroke:#000000;stroke-width:2;stroke-linecap:butt;stroke-linejoin:round;stroke-opacity:1;stroke-miterlimit:4;stroke-dasharray:none"
       d="m 197.73601,287.8588 c -25.40127,0 -25.40127,0 -25.40127,0"
       id="path3743-8-3"
       inkscape:connector-curvature="0" />
    <path
       style="fill:none;stroke:#000000;stroke-width:2;stroke-linecap:butt;stroke-linejoin:round;stroke-opacity:1;stroke-miterlimit:4;stroke-dasharray:none"
       d="m 193.37543,283.05982 c -25.40129,0 -25.40129,0 -25.40129,0"
       id="path3743-2-63-1"
       inkscape:connector-curvature="0" />
    <path
       style="fill:none;stroke:#000000;stroke-width:2;stroke-linecap:butt;stroke-linejoin:round;stroke-opacity:1;stroke-miterlimit:4;stroke-dasharray:none"
       d="m 188.85836,278.29995 c -25.40127,0 -25.40127,0 -25.40127,0"
       id="path3743-5-9-2"
       inkscape:connector-curvature="0" />
    <path
       style="fill:none;stroke:#000000;stroke-width:2;stroke-linecap:butt;stroke-linejoin:round;stroke-opacity:1;stroke-miterlimit:4;stroke-dasharray:none"
       d="m 184.26311,273.44882 c -25.40128,0 -25.40128,0 -25.40128,0"
       id="path3743-2-6-7-2"
       inkscape:connector-curvature="0" />
    <path
       style="fill:none;stroke:#000000;stroke-width:2;stroke-linecap:butt;stroke-linejoin:round;stroke-opacity:1;stroke-miterlimit:4;stroke-dasharray:none"
       d="m 179.81125,268.67591 c -25.40129,0 -25.40129,0 -25.40129,0"
       id="path3743-52-5-9"
       inkscape:connector-curvature="0" />
    <path
       style="fill:none;stroke:#000000;stroke-width:2;stroke-linecap:butt;stroke-linejoin:round;stroke-opacity:1;stroke-miterlimit:4;stroke-dasharray:none"
       d="m 175.30725,263.87693 c -25.40128,0 -25.40128,0 -25.40128,0"
       id="path3743-2-0-9-4"
       inkscape:connector-curvature="0" />
    <path
       inkscape:connector-curvature="0"
       id="path80"
       d="m 6.2628724,203.20177 c 285.7188076,0 285.7188076,0 285.7188076,0"
       style="fill:none;stroke:#000000;stroke-width:2;stroke-linecap:butt;stroke-linejoin:round;stroke-opacity:1;stroke-miterlimit:4;stroke-dasharray:none" />
    <path
       style="fill:none;stroke:#000000;stroke-width:2;stroke-linecap:butt;stroke-linejoin:round;stroke-opacity:1;stroke-miterlimit:4;stroke-dasharray:none"
       d="m 199.98707,199.43456 -0.0147,-12.34625 v 0"
       id="path363"
       inkscape:connector-curvature="0"
       sodipodi:nodetypes="ccc" />
    <path
       style="fill:none;stroke:#000000;stroke-width:2;stroke-linecap:butt;stroke-linejoin:round;stroke-opacity:1;stroke-miterlimit:4;stroke-dasharray:none"
       d="m 200.07891,189.57409 c 0.87462,-2.15683 2.08451,-2.21821 3.3044,-2.21706 l 17.16135,-0.13436 v 0 c 0.84348,0.0446 1.67854,0.10119 1.91864,1.00775"
       id="path365"
       inkscape:connector-curvature="0"
       sodipodi:nodetypes="ccccc" />
    <path
       style="fill:none;stroke:#000000;stroke-width:2;stroke-linecap:butt;stroke-linejoin:round;stroke-opacity:1;stroke-miterlimit:4;stroke-dasharray:none"
       d="m 6.2628724,182.88247 c 285.7188076,0 285.7188076,0 285.7188076,0"
       id="path373"
       inkscape:connector-curvature="0" />
    <g
       id="g2556"
       transform="translate(0.52916667)"
       style="stroke-linejoin:round;stroke-width:2;stroke-miterlimit:4;stroke-dasharray:none">
      <path
         sodipodi:nodetypes="cc"
         inkscape:connector-curvature="0"
         id="path4317-1-2"
         d="m 70.517273,259.40633 c -12.058891,0.29733 -8.46504,-30.22405 -17.978484,-30.48965"
         style="fill:none;stroke:#000000;stroke-width:2;stroke-linecap:butt;stroke-linejoin:round;stroke-opacity:1;stroke-miterlimit:4;stroke-dasharray:none" />
      <path
         style="fill:none;stroke:#000000;stroke-width:2;stroke-linecap:butt;stroke-linejoin:round;stroke-opacity:1;stroke-miterlimit:4;stroke-dasharray:none"
         d="m 70.517273,259.40633 c 11.03201,0.10898 3.698085,-15.28293 16.459169,-14.83539 l 23.548618,-0.0442"
         id="path2529"
         inkscape:connector-curvature="0"
         sodipodi:nodetypes="ccc" />
    </g>
    <g
       id="g2564"
       transform="translate(-3.648551,4.79898)"
       style="stroke-linejoin:round;stroke-width:2;stroke-miterlimit:4;stroke-dasharray:none">
      <path
         style="fill:none;stroke:#000000;stroke-width:2;stroke-linecap:butt;stroke-linejoin:round;stroke-opacity:1;stroke-miterlimit:4;stroke-dasharray:none"
         d="m 70.517273,259.40633 c -12.058891,0.29733 -8.46504,-30.22405 -17.978484,-30.48965"
         id="path2558"
         inkscape:connector-curvature="0"
         sodipodi:nodetypes="cc" />
      <path
         sodipodi:nodetypes="ccc"
         inkscape:connector-curvature="0"
         id="path2560"
         d="m 70.517273,259.40633 c 11.03201,0.10898 4.161106,-15.24986 16.75642,-14.812 l 27.995877,-0.001"
         style="fill:none;stroke:#000000;stroke-width:2;stroke-linecap:butt;stroke-linejoin:round;stroke-opacity:1;stroke-miterlimit:4;stroke-dasharray:none" />
    </g>
    <g
       transform="translate(-7.8818846,9.5614803)"
       id="g2572"
       style="stroke-linejoin:round;stroke-width:2;stroke-miterlimit:4;stroke-dasharray:none">
      <path
         sodipodi:nodetypes="cc"
         inkscape:connector-curvature="0"
         id="path2566"
         d="m 70.517273,259.40633 c -12.058891,0.29733 -8.46504,-30.22405 -17.978484,-30.48965"
         style="fill:none;stroke:#000000;stroke-width:2;stroke-linecap:butt;stroke-linejoin:round;stroke-opacity:1;stroke-miterlimit:4;stroke-dasharray:none" />
      <path
         style="fill:none;stroke:#000000;stroke-width:2;stroke-linecap:butt;stroke-linejoin:round;stroke-opacity:1;stroke-miterlimit:4;stroke-dasharray:none"
         d="m 70.517273,259.40633 c 11.03201,0.10898 5.12022,-14.72069 18.138146,-14.72247 l 30.313761,0.0117"
         id="path2568"
         inkscape:connector-curvature="0"
         sodipodi:nodetypes="ccc" />
    </g>
    <path
       inkscape:connector-curvature="0"
       id="path263"
       d="M 6.2621514,211.14162 H 87.550873"
       style="fill:none;stroke:#000000;stroke-width:2;stroke-linecap:butt;stroke-linejoin:round;stroke-opacity:1;stroke-miterlimit:4;stroke-dasharray:none"
       sodipodi:nodetypes="cc" />
    <g
       id="g274"
       transform="matrix(2.3171425,0,0,1.5013403,-25.69501,-148.91007)"
       style="stroke-linejoin:round;stroke-width:1.07229444;stroke-miterlimit:4;stroke-dasharray:none">
      <path
         sodipodi:nodetypes="cccc"
         inkscape:connector-curvature="0"
         id="path334"
         d="m 18.220269,231.57357 c -0.175214,0.16254 0,0 0,0 8.674325,-7.94577 8.942646,-8.42364 9.103148,-7.10375 0.0047,2.38306 0.01002,4.91024 0.01511,7.2933"
         style="fill:none;stroke:#000000;stroke-width:1.07229444;stroke-linecap:butt;stroke-linejoin:round;stroke-opacity:1;stroke-miterlimit:4;stroke-dasharray:none" />
    </g>
    <path
       sodipodi:nodetypes="ccc"
       inkscape:connector-curvature="0"
       id="path297"
       d="m 95.721131,187.05223 v 0 l 0.0023,1.21883"
       style="fill:none;stroke:#000000;stroke-width:2;stroke-linecap:butt;stroke-linejoin:round;stroke-opacity:1;stroke-miterlimit:4;stroke-dasharray:none"
       inkscape:transform-center-x="-0.18547473"
       inkscape:transform-center-y="-0.09408752" />
    <g
       transform="matrix(2.3171425,0,0,1.5013403,-4.2681066,-148.91007)"
       id="g305"
       style="stroke-linejoin:round;stroke-width:1.07229444;stroke-miterlimit:4;stroke-dasharray:none">
      <path
         style="fill:none;stroke:#000000;stroke-width:1.07229444;stroke-linecap:butt;stroke-linejoin:round;stroke-opacity:1;stroke-miterlimit:4;stroke-dasharray:none"
         d="m 18.220269,231.57357 c -0.175214,0.16254 0,0 0,0 8.674325,-7.94577 8.942646,-8.42364 9.103148,-7.10375 0.0047,2.38306 0.01002,4.91024 0.01511,7.2933"
         id="path303"
         inkscape:connector-curvature="0"
         sodipodi:nodetypes="cccc" />
    </g>
    <path
       inkscape:transform-center-y="-0.76851075"
       inkscape:transform-center-x="-0.027608918"
       style="fill:none;stroke:#000000;stroke-width:2;stroke-linecap:butt;stroke-linejoin:round;stroke-opacity:1;stroke-miterlimit:4;stroke-dasharray:none"
       d="m 95.637468,189.08754 v 0 l 3.47e-4,9.9555"
       id="path307"
       inkscape:connector-curvature="0"
       sodipodi:nodetypes="ccc" />
    <path
       inkscape:connector-curvature="0"
       id="path311"
       d="m 161.97226,198.03681 c -0.0858,0.58222 -0.53866,1.14589 -1.22078,1.14084 l -18.5993,9.2e-4 c -1.81163,0.0525 -2.47874,-0.47346 -2.57581,-1.32912 -0.006,-0.0511 -0.008,-4.42756 -0.008,-4.42756 m 0,0 c 0,0 0.002,-4.80071 0.008,-4.8518 0.0971,-0.85565 0.76418,-1.38165 2.57581,-1.32911 l 18.5993,9.2e-4 c 0.68212,-0.005 1.13493,0.55862 1.22078,1.14084"
       style="fill:none;stroke:#000000;stroke-width:2;stroke-linecap:butt;stroke-linejoin:round;stroke-opacity:1;stroke-miterlimit:4;stroke-dasharray:none"
       sodipodi:nodetypes="cccsccsccc" />
    <path
       sodipodi:nodetypes="cscccsccsc"
       style="fill:none;stroke:#000000;stroke-width:2;stroke-linecap:butt;stroke-linejoin:round;stroke-opacity:1;stroke-miterlimit:4;stroke-dasharray:none"
       d="m 260.7483,193.42189 c 0,0 0.002,-4.80071 0.008,-4.8518 0.0971,-0.85565 0.76418,-1.38165 2.57581,-1.32911 l 12.2493,9.2e-4 c 0.68212,-0.005 1.73712,0.50015 2.29654,1.35131 0.12287,0.18758 4.35709,7.61192 4.65759,8.16356 0.79496,1.45936 0.19066,2.51087 -0.60413,2.42088 l -18.5993,9.2e-4 c -1.81163,0.0525 -2.47874,-0.47346 -2.57581,-1.32912 -0.006,-0.0511 -0.008,-4.42756 -0.008,-4.42756"
       id="path319"
       inkscape:connector-curvature="0" />
    <path
       sodipodi:nodetypes="cc"
       style="fill:none;stroke:#000000;stroke-width:2;stroke-linecap:butt;stroke-linejoin:round;stroke-opacity:1;stroke-miterlimit:4;stroke-dasharray:none"
       d="M 6.2621515,215.90415 H 94.430045"
       id="path1022"
       inkscape:connector-curvature="0" />
    <path
       inkscape:connector-curvature="0"
       id="path1024"
       d="M 6.2621517,220.66669 H 99.457132"
       style="fill:none;stroke:#000000;stroke-width:2;stroke-linecap:butt;stroke-linejoin:round;stroke-opacity:1;stroke-miterlimit:4;stroke-dasharray:none"
       sodipodi:nodetypes="cc" />
    <path
       sodipodi:nodetypes="cc"
       style="fill:none;stroke:#000000;stroke-width:2;stroke-linecap:butt;stroke-linejoin:round;stroke-opacity:1;stroke-miterlimit:4;stroke-dasharray:none"
       d="M 6.2621514,287.87128 H 87.550873"
       id="path1042"
       inkscape:connector-curvature="0" />
    <path
       inkscape:connector-curvature="0"
       id="path1044"
       d="M 6.2621515,283.10875 H 94.430045"
       style="fill:none;stroke:#000000;stroke-width:2;stroke-linecap:butt;stroke-linejoin:round;stroke-opacity:1;stroke-miterlimit:4;stroke-dasharray:none"
       sodipodi:nodetypes="cc" />
    <path
       sodipodi:nodetypes="cc"
       style="fill:none;stroke:#000000;stroke-width:2;stroke-linecap:butt;stroke-linejoin:round;stroke-opacity:1;stroke-miterlimit:4;stroke-dasharray:none"
       d="M 6.2621517,278.34621 H 99.457132"
       id="path1046"
       inkscape:connector-curvature="0" />
    <path
       inkscape:connector-curvature="0"
       id="path1048"
       d="m 100.12028,287.8588 c 25.4012,0 25.4012,0 25.4012,0"
       style="fill:none;stroke:#000000;stroke-width:2;stroke-linecap:butt;stroke-linejoin:round;stroke-opacity:1;stroke-miterlimit:4;stroke-dasharray:none" />
    <path
       inkscape:connector-curvature="0"
       id="path1050"
       d="m 197.73601,211.07509 c -25.40127,0 -25.40127,0 -25.40127,0"
       style="fill:none;stroke:#000000;stroke-width:2;stroke-linecap:butt;stroke-linejoin:round;stroke-opacity:1;stroke-miterlimit:4;stroke-dasharray:none" />
    <path
       inkscape:connector-curvature="0"
       id="path1092"
       d="m 193.23258,215.87407 c -25.40139,0 -25.40139,0 -25.40139,0"
       style="fill:none;stroke:#000000;stroke-width:2;stroke-linecap:butt;stroke-linejoin:round;stroke-opacity:1;stroke-miterlimit:4;stroke-dasharray:none" />
    <path
       inkscape:connector-curvature="0"
       id="path1094"
       d="m 188.61123,220.67305 c -25.40139,0 -25.40139,0 -25.40139,0"
       style="fill:none;stroke:#000000;stroke-width:2;stroke-linecap:butt;stroke-linejoin:round;stroke-opacity:1;stroke-miterlimit:4;stroke-dasharray:none" />
    <path
       inkscape:connector-curvature="0"
       id="path1096"
       d="m 183.98988,225.47204 c -25.4014,0 -25.4014,0 -25.4014,0"
       style="fill:none;stroke:#000000;stroke-width:2;stroke-linecap:butt;stroke-linejoin:round;stroke-opacity:1;stroke-miterlimit:4;stroke-dasharray:none" />
    <path
       inkscape:connector-curvature="0"
       id="path1098"
       d="m 179.66352,230.27102 c -25.40142,0 -25.40142,0 -25.40142,0"
       style="fill:none;stroke:#000000;stroke-width:2;stroke-linecap:butt;stroke-linejoin:round;stroke-opacity:1;stroke-miterlimit:4;stroke-dasharray:none" />
    <path
       inkscape:connector-curvature="0"
       id="path1100"
       d="m 175.11589,235.07 c -25.4014,0 -25.4014,0 -25.4014,0"
       style="fill:none;stroke:#000000;stroke-width:2;stroke-linecap:butt;stroke-linejoin:round;stroke-opacity:1;stroke-miterlimit:4;stroke-dasharray:none" />
    <path
       inkscape:connector-curvature="0"
       id="path1102"
       d="m 170.60516,239.86898 c -43.23628,0 -43.23628,0 -43.23628,0"
       style="fill:none;stroke:#000000;stroke-width:2;stroke-linecap:butt;stroke-linejoin:round;stroke-opacity:1;stroke-miterlimit:4;stroke-dasharray:none" />
    <path
       inkscape:connector-curvature="0"
       id="path1110"
       d="m 104.59823,283.05982 c 25.40144,0 25.40144,0 25.40144,0"
       style="fill:none;stroke:#000000;stroke-width:2;stroke-linecap:butt;stroke-linejoin:round;stroke-opacity:1;stroke-miterlimit:4;stroke-dasharray:none" />
    <path
       inkscape:connector-curvature="0"
       id="path1112"
       d="m 109.11533,278.29995 c 25.40142,0 25.40142,0 25.40142,0"
       style="fill:none;stroke:#000000;stroke-width:2;stroke-linecap:butt;stroke-linejoin:round;stroke-opacity:1;stroke-miterlimit:4;stroke-dasharray:none" />
    <path
       inkscape:connector-curvature="0"
       id="path1114"
       d="m 113.71061,273.44882 c 25.40142,0 25.40142,0 25.40142,0"
       style="fill:none;stroke:#000000;stroke-width:2;stroke-linecap:butt;stroke-linejoin:round;stroke-opacity:1;stroke-miterlimit:4;stroke-dasharray:none" />
    <path
       inkscape:connector-curvature="0"
       id="path1116"
       d="m 118.16249,268.67591 c 25.40144,0 25.40144,0 25.40144,0"
       style="fill:none;stroke:#000000;stroke-width:2;stroke-linecap:butt;stroke-linejoin:round;stroke-opacity:1;stroke-miterlimit:4;stroke-dasharray:none" />
    <path
       inkscape:connector-curvature="0"
       id="path1118"
       d="m 122.66652,263.87693 c 25.40142,0 25.40142,0 25.40142,0"
       style="fill:none;stroke:#000000;stroke-width:2;stroke-linecap:butt;stroke-linejoin:round;stroke-opacity:1;stroke-miterlimit:4;stroke-dasharray:none" />
    <path
       inkscape:connector-curvature="0"
       id="path1160"
       d="m 131.93492,254.0824 c 34.10417,0 34.10417,0 34.10417,0"
       style="fill:none;stroke:#000000;stroke-width:2;stroke-linecap:butt;stroke-linejoin:round;stroke-opacity:1;stroke-miterlimit:4;stroke-dasharray:none" />
    <path
       style="fill:none;stroke:#000000;stroke-width:2;stroke-linecap:butt;stroke-linejoin:round;stroke-opacity:1;stroke-miterlimit:4;stroke-dasharray:none"
       d="m 170.60516,258.95513 c -43.23628,0 -43.23628,0 -43.23628,0"
       id="path1166"
       inkscape:connector-curvature="0" />
    <path
       inkscape:connector-curvature="0"
       id="path1105"
       d="m 6.2621514,268.58359 c 23.0803516,0 23.0803516,0 23.0803516,0"
       style="fill:none;stroke:#000000;stroke-width:2;stroke-linecap:butt;stroke-linejoin:round;stroke-opacity:1;stroke-miterlimit:4;stroke-dasharray:none" />
    <path
       inkscape:connector-curvature="0"
       id="path1107"
       d="m 79.12041,273.13172 c 24.70231,0 24.70231,0 24.70231,0"
       style="fill:none;stroke:#000000;stroke-width:2;stroke-linecap:butt;stroke-linejoin:round;stroke-opacity:1;stroke-miterlimit:4;stroke-dasharray:none" />
    <path
       inkscape:connector-curvature="0"
       id="path1109"
       d="m 82.538482,268.33274 c 23.683688,0 23.683688,0 23.683688,0"
       style="fill:none;stroke:#000000;stroke-width:2;stroke-linecap:butt;stroke-linejoin:round;stroke-opacity:1;stroke-miterlimit:4;stroke-dasharray:none" />
    <path
       inkscape:connector-curvature="0"
       id="path1111"
       d="m 85.758153,263.53376 c 22.863517,0 22.863517,0 22.863517,0"
       style="fill:none;stroke:#000000;stroke-width:2;stroke-linecap:butt;stroke-linejoin:round;stroke-opacity:1;stroke-miterlimit:4;stroke-dasharray:none" />
    <path
       inkscape:connector-curvature="0"
       id="path1158"
       d="m 291.68073,225.42921 c -23.08035,0 -23.08035,0 -23.08035,0"
       style="fill:none;stroke:#000000;stroke-width:2;stroke-linecap:butt;stroke-linejoin:round;stroke-opacity:1;stroke-miterlimit:4;stroke-dasharray:none" />
    <path
       inkscape:connector-curvature="0"
       id="path1161"
       d="m 291.68073,230.22819 c -23.08035,0 -23.08035,0 -23.08035,0"
       style="fill:none;stroke:#000000;stroke-width:2;stroke-linecap:butt;stroke-linejoin:round;stroke-opacity:1;stroke-miterlimit:4;stroke-dasharray:none" />
    <path
       inkscape:connector-curvature="0"
       id="path1163"
       d="m 291.68073,235.02717 c -23.08035,0 -23.08035,0 -23.08035,0"
       style="fill:none;stroke:#000000;stroke-width:2;stroke-linecap:butt;stroke-linejoin:round;stroke-opacity:1;stroke-miterlimit:4;stroke-dasharray:none" />
    <path
       inkscape:connector-curvature="0"
       id="path1165"
       d="m 291.68073,239.82615 c -23.08035,0 -23.08035,0 -23.08035,0"
       style="fill:none;stroke:#000000;stroke-width:2;stroke-linecap:butt;stroke-linejoin:round;stroke-opacity:1;stroke-miterlimit:4;stroke-dasharray:none" />
    <path
       sodipodi:nodetypes="ccc"
       inkscape:connector-curvature="0"
       id="path1167"
       d="m 291.64267,244.67191 -31.14256,-0.0468 c -11.87495,0.0842 -6.25945,-15.0646 -15.62531,-15.70846"
       style="fill:none;stroke:#000000;stroke-width:2;stroke-linecap:butt;stroke-linejoin:round;stroke-opacity:1;stroke-miterlimit:4;stroke-dasharray:none" />
    <path
       sodipodi:nodetypes="ccc"
       inkscape:connector-curvature="0"
       id="path1169"
       d="m 291.68073,249.42412 -26.96981,-0.0165 c -11.90802,0.10074 -6.29252,-15.04806 -15.65837,-15.69192"
       style="fill:none;stroke:#000000;stroke-width:2;stroke-linecap:butt;stroke-linejoin:round;stroke-opacity:1;stroke-miterlimit:4;stroke-dasharray:none" />
    <path
       sodipodi:nodetypes="ccc"
       inkscape:connector-curvature="0"
       id="path1171"
       d="m 291.675,254.17633 -22.56823,0.005 c -12.07051,0.0893 -6.45501,-15.05945 -15.82087,-15.70331"
       style="fill:none;stroke:#000000;stroke-width:2;stroke-linecap:butt;stroke-linejoin:round;stroke-opacity:1;stroke-miterlimit:4;stroke-dasharray:none" />
    <path
       inkscape:connector-curvature="0"
       id="path1173"
       d="m 291.68073,259.02208 c -23.08035,0 -23.08035,0 -23.08035,0"
       style="fill:none;stroke:#000000;stroke-width:2;stroke-linecap:butt;stroke-linejoin:round;stroke-opacity:1;stroke-miterlimit:4;stroke-dasharray:none" />
    <path
       inkscape:connector-curvature="0"
       id="path1175"
       d="m 291.68073,263.82106 c -23.08035,0 -23.08035,0 -23.08035,0"
       style="fill:none;stroke:#000000;stroke-width:2;stroke-linecap:butt;stroke-linejoin:round;stroke-opacity:1;stroke-miterlimit:4;stroke-dasharray:none" />
    <path
       inkscape:connector-curvature="0"
       id="path1177"
       d="m 291.68073,273.41903 c -23.08035,0 -23.08035,0 -23.08035,0"
       style="fill:none;stroke:#000000;stroke-width:2;stroke-linecap:butt;stroke-linejoin:round;stroke-opacity:1;stroke-miterlimit:4;stroke-dasharray:none" />
    <path
       inkscape:connector-curvature="0"
       id="path1179"
       d="m 218.8222,225.39706 c -24.70245,0 -24.70245,0 -24.70245,0"
       style="fill:none;stroke:#000000;stroke-width:2;stroke-linecap:butt;stroke-linejoin:round;stroke-opacity:1;stroke-miterlimit:4;stroke-dasharray:none" />
    <path
       inkscape:connector-curvature="0"
       id="path1181"
       d="m 215.40411,230.19604 c -23.68382,0 -23.68382,0 -23.68382,0"
       style="fill:none;stroke:#000000;stroke-width:2;stroke-linecap:butt;stroke-linejoin:round;stroke-opacity:1;stroke-miterlimit:4;stroke-dasharray:none" />
    <path
       inkscape:connector-curvature="0"
       id="path1183"
       d="m 212.18442,234.99502 c -22.86364,0 -22.86364,0 -22.86364,0"
       style="fill:none;stroke:#000000;stroke-width:2;stroke-linecap:butt;stroke-linejoin:round;stroke-opacity:1;stroke-miterlimit:4;stroke-dasharray:none" />
    <path
       inkscape:connector-curvature="0"
       id="path1185"
       d="m 210.82735,239.79401 c -22.70632,0 -22.70632,0 -22.70632,0"
       style="fill:none;stroke:#000000;stroke-width:2;stroke-linecap:butt;stroke-linejoin:round;stroke-opacity:1;stroke-miterlimit:4;stroke-dasharray:none" />
    <path
       inkscape:connector-curvature="0"
       id="path1187"
       d="m 211.20153,258.98993 c -23.0805,0 -23.0805,0 -23.0805,0"
       style="fill:none;stroke:#000000;stroke-width:2;stroke-linecap:butt;stroke-linejoin:round;stroke-opacity:1;stroke-miterlimit:4;stroke-dasharray:none" />
    <g
       transform="matrix(-1,0,0,1,297.41372,0)"
       id="g1193"
       style="stroke-linejoin:round;stroke-width:2;stroke-miterlimit:4;stroke-dasharray:none">
      <path
         style="fill:none;stroke:#000000;stroke-width:2;stroke-linecap:butt;stroke-linejoin:round;stroke-opacity:1;stroke-miterlimit:4;stroke-dasharray:none"
         d="m 70.517273,259.40633 c -12.058891,0.29733 -8.46504,-30.22405 -17.978484,-30.48965"
         id="path1189"
         inkscape:connector-curvature="0"
         sodipodi:nodetypes="cc" />
      <path
         sodipodi:nodetypes="ccc"
         inkscape:connector-curvature="0"
         id="path1191"
         d="m 70.517273,259.40633 c 11.03201,0.10898 3.698085,-15.28293 16.459169,-14.83539 l 23.548618,-0.0442"
         style="fill:none;stroke:#000000;stroke-width:2;stroke-linecap:butt;stroke-linejoin:round;stroke-opacity:1;stroke-miterlimit:4;stroke-dasharray:none" />
    </g>
    <g
       transform="matrix(-1,0,0,1,301.59144,4.79898)"
       id="g1199"
       style="stroke-linejoin:round;stroke-width:2;stroke-miterlimit:4;stroke-dasharray:none">
      <path
         sodipodi:nodetypes="cc"
         inkscape:connector-curvature="0"
         id="path1195"
         d="m 70.517273,259.40633 c -12.058891,0.29733 -8.46504,-30.22405 -17.978484,-30.48965"
         style="fill:none;stroke:#000000;stroke-width:2;stroke-linecap:butt;stroke-linejoin:round;stroke-opacity:1;stroke-miterlimit:4;stroke-dasharray:none" />
      <path
         style="fill:none;stroke:#000000;stroke-width:2;stroke-linecap:butt;stroke-linejoin:round;stroke-opacity:1;stroke-miterlimit:4;stroke-dasharray:none"
         d="m 70.517273,259.40633 c 11.03201,0.10898 4.161106,-15.24986 16.75642,-14.812 l 27.995877,-0.001"
         id="path1197"
         inkscape:connector-curvature="0"
         sodipodi:nodetypes="ccc" />
    </g>
    <g
       id="g1205"
       transform="matrix(-1,0,0,1,305.82477,9.5614803)"
       style="stroke-linejoin:round;stroke-width:2;stroke-miterlimit:4;stroke-dasharray:none">
      <path
         style="fill:none;stroke:#000000;stroke-width:2;stroke-linecap:butt;stroke-linejoin:round;stroke-opacity:1;stroke-miterlimit:4;stroke-dasharray:none"
         d="m 70.517273,259.40633 c -12.058891,0.29733 -8.46504,-30.22405 -17.978484,-30.48965"
         id="path1201"
         inkscape:connector-curvature="0"
         sodipodi:nodetypes="cc" />
      <path
         sodipodi:nodetypes="ccc"
         inkscape:connector-curvature="0"
         id="path1203"
         d="m 70.517273,259.40633 c 11.03201,0.10898 5.12022,-14.72069 18.138146,-14.72247 l 30.313761,0.0117"
         style="fill:none;stroke:#000000;stroke-width:2;stroke-linecap:butt;stroke-linejoin:round;stroke-opacity:1;stroke-miterlimit:4;stroke-dasharray:none" />
    </g>
    <path
       sodipodi:nodetypes="cc"
       style="fill:none;stroke:#000000;stroke-width:2;stroke-linecap:butt;stroke-linejoin:round;stroke-opacity:1;stroke-miterlimit:4;stroke-dasharray:none"
       d="M 291.68073,211.14162 H 210.39169"
       id="path1207"
       inkscape:connector-curvature="0" />
    <path
       inkscape:connector-curvature="0"
       id="path1209"
       d="M 291.68073,215.90415 H 203.51248"
       style="fill:none;stroke:#000000;stroke-width:2;stroke-linecap:butt;stroke-linejoin:round;stroke-opacity:1;stroke-miterlimit:4;stroke-dasharray:none"
       sodipodi:nodetypes="cc" />
    <path
       sodipodi:nodetypes="cc"
       style="fill:none;stroke:#000000;stroke-width:2;stroke-linecap:butt;stroke-linejoin:round;stroke-opacity:1;stroke-miterlimit:4;stroke-dasharray:none"
       d="M 291.68073,220.66669 H 198.48537"
       id="path1211"
       inkscape:connector-curvature="0" />
    <path
       inkscape:connector-curvature="0"
       id="path1213"
       d="M 291.68073,287.87128 H 210.39169"
       style="fill:none;stroke:#000000;stroke-width:2;stroke-linecap:butt;stroke-linejoin:round;stroke-opacity:1;stroke-miterlimit:4;stroke-dasharray:none"
       sodipodi:nodetypes="cc" />
    <path
       sodipodi:nodetypes="cc"
       style="fill:none;stroke:#000000;stroke-width:2;stroke-linecap:butt;stroke-linejoin:round;stroke-opacity:1;stroke-miterlimit:4;stroke-dasharray:none"
       d="M 291.68073,283.10875 H 203.51248"
       id="path1215"
       inkscape:connector-curvature="0" />
    <path
       inkscape:connector-curvature="0"
       id="path1217"
       d="M 291.68073,278.34621 H 198.48537"
       style="fill:none;stroke:#000000;stroke-width:2;stroke-linecap:butt;stroke-linejoin:round;stroke-opacity:1;stroke-miterlimit:4;stroke-dasharray:none"
       sodipodi:nodetypes="cc" />
    <path
       style="fill:none;stroke:#000000;stroke-width:0.39825165px;stroke-linecap:butt;stroke-linejoin:miter;stroke-opacity:1"
       d="m 197.82221,287.8588 c -25.40134,0 -25.40134,0 -25.40134,0"
       id="path1219"
       inkscape:connector-curvature="0" />
    <path
       style="fill:none;stroke:#000000;stroke-width:2;stroke-linecap:butt;stroke-linejoin:round;stroke-opacity:1;stroke-miterlimit:4;stroke-dasharray:none"
       d="m 291.68073,268.58359 c -23.08035,0 -23.08035,0 -23.08035,0"
       id="path1221"
       inkscape:connector-curvature="0" />
    <path
       style="fill:none;stroke:#000000;stroke-width:2;stroke-linecap:butt;stroke-linejoin:round;stroke-opacity:1;stroke-miterlimit:4;stroke-dasharray:none"
       d="m 218.8222,273.13172 c -24.70245,0 -24.70245,0 -24.70245,0"
       id="path1223"
       inkscape:connector-curvature="0" />
    <path
       style="fill:none;stroke:#000000;stroke-width:2;stroke-linecap:butt;stroke-linejoin:round;stroke-opacity:1;stroke-miterlimit:4;stroke-dasharray:none"
       d="m 215.40411,268.33274 c -23.68382,0 -23.68382,0 -23.68382,0"
       id="path1225"
       inkscape:connector-curvature="0" />
    <path
       style="fill:none;stroke:#000000;stroke-width:2;stroke-linecap:butt;stroke-linejoin:round;stroke-opacity:1;stroke-miterlimit:4;stroke-dasharray:none"
       d="m 212.18442,263.53376 c -22.86364,0 -22.86364,0 -22.86364,0"
       id="path1227"
       inkscape:connector-curvature="0" />
  </g>
</svg>
