{
  "sound_intensity": 20,
  "wave": 7,
  "coarse": 3,
  "detune": 0,
  "trigger_noise_with_osc": true,
  "env_attack": 0,
  "env_decay": 2,
  "env_sustain": 1,
  "env_release": 6,
  "filter_osc_mode": 0,
  "filter_osc_freq_from": 6000,
  "filter_osc_freq_to": 0,
  "filter_osc_speed": 56,
  "filter_osc_resonance": 0,
  "noise_vol": 0,
  "noise_decay": 5,
  "filter_noise_freq_from": 4100,
  "filter_noise_freq_to": 0,
  "filter_noise_speed": 0,
  "pwm_from": 660,
  "pwm_to": 155,
  "pwm_speed": 7,
  "rev_send": 0,
  "chorus_send": 0,
  "delay_send": 0,
  "midi_channel": 2,
  "pan": 21
}