{
    "interface": "0.0.0.0",
    "port": 1965,
    "capsules": {
       "localhost": {
         "cert": "{here}/capsules/localhost.pem",
         "folder": "{here}/capsules/localhost",
         "lang": "fr",
         "lang_regex": "/\\.([a-z][a-z])\\./",
         "auto_index_ext": [".gmi",".md", "/"],
         "redirect": false
       },
       "example.tld": {
         "cert": "{here}/capsules/example.tld.pem",
         "folder": "{here}/capsules/example.tld",
         "lang": "en",
         "lang_regex": "/\\.([a-z][a-z])\\./",
         "auto_index_ext": [".gmi"],
         "redirect": false
       }
    }
}
