# Blender v2.90.1 OBJ File: ''
# www.blender.org
mtllib bc_picframe2.mtl
o Frame_Cube.001
v -1.000000 -16.000000 24.000000
v -1.000000 16.000000 24.000000
v -1.000000 -16.000000 -24.000000
v -1.000000 16.000000 -24.000000
v 1.000000 -16.000000 24.000000
v 1.000000 16.000000 24.000000
v 1.000000 -16.000000 -24.000000
v 1.000000 16.000000 -24.000000
v 1.000000 14.400000 -21.599998
v 1.000000 -14.400000 -21.599998
v 1.000000 -14.400000 21.599998
v 1.000000 14.400000 21.599998
v 0.000000 14.400000 -21.599998
v 0.000000 -14.400000 -21.599998
v 0.000000 -14.400000 21.599998
v 0.000000 14.400000 21.599998
vt 0.003662 0.159284
vt 0.003662 0.825951
vt 0.045329 0.825951
vt 0.045329 0.159284
vt 0.064648 0.001086
vt 0.064648 0.988295
vt 0.042614 0.938935
vt 0.042614 0.050447
vt 0.045329 0.159284
vt 0.045329 0.825951
vt 0.003662 0.825951
vt 0.003662 0.159284
vt 0.003662 0.992618
vt 0.045329 0.992618
vt 0.045329 -0.007382
vt 0.003662 -0.007382
vt 0.045329 0.992618
vt 0.003662 0.992618
vt 0.003662 -0.007382
vt 0.045329 -0.007382
vt 0.045329 0.192618
vt 0.045329 0.792618
vt 0.024495 0.792618
vt 0.024495 0.192618
vt 0.060933 0.100958
vt 0.060933 0.767625
vt 0.010933 0.734292
vt 0.010933 0.134292
vt 0.009653 0.755223
vt 0.009653 0.088557
vt 0.059653 0.121890
vt 0.059653 0.721890
vt 0.007852 0.993154
vt 0.007852 0.005945
vt 0.029886 0.055305
vt 0.029886 0.943793
vt 0.971695 0.011193
vt 0.971695 0.977088
vt 0.082993 0.977088
vt 0.082993 0.011193
vt 0.045329 0.792618
vt 0.045329 0.192618
vt 0.024495 0.192618
vt 0.024495 0.792618
vt 0.062171 0.042618
vt 0.062171 0.942618
vt 0.007653 0.942618
vt 0.007653 0.042618
vt 0.045329 0.942618
vt 0.045329 0.042618
vt 0.024495 0.042618
vt 0.024495 0.942618
vn 0.0000 0.0000 -1.0000
vn 1.0000 0.0000 0.0000
vn 0.0000 0.0000 1.0000
vn 0.0000 -1.0000 0.0000
vn 0.0000 1.0000 0.0000
usemtl Material.001
s off
f 3/1/1 4/2/1 8/3/1 7/4/1
f 8/5/2 6/6/2 12/7/2 9/8/2
f 5/9/3 6/10/3 2/11/3 1/12/3
f 3/13/4 7/14/4 5/15/4 1/16/4
f 8/17/5 4/18/5 2/19/5 6/20/5
f 10/21/3 9/22/3 13/23/3 14/24/3
f 7/25/2 8/26/2 9/27/2 10/28/2
f 6/29/2 5/30/2 11/31/2 12/32/2
f 5/33/2 7/34/2 10/35/2 11/36/2
f 14/37/2 13/38/2 16/39/2 15/40/2
f 12/41/1 11/42/1 15/43/1 16/44/1
f 11/45/5 10/46/5 14/47/5 15/48/5
f 9/49/4 12/50/4 16/51/4 13/52/4
